Skip to content

Console Output

+ ctest --timeout 180 --no-compress-output -T Test --test-output-size-passed=65536 --test-output-size-failed=1048576
Cannot find file: /var/jenkins/workspace/ArborX_master/build/DartConfiguration.tcl
   Site: 
   Build name: (empty)
Create new tag: 20240213-2049 - Experimental
Cannot find file: /var/jenkins/workspace/ArborX_master/build/DartConfiguration.tcl
Test project /var/jenkins/workspace/ArborX_master/build
      Start  1: ArborX_Test_DetailsUtils
 1/31 Test  #1: ArborX_Test_DetailsUtils .........................***Exception: SegFault  0.99 sec
      Start  2: ArborX_Test_Geometry
 2/31 Test  #2: ArborX_Test_Geometry .............................   Passed    0.04 sec
      Start  3: ArborX_Test_QueryTree
 3/31 Test  #3: ArborX_Test_QueryTree ............................***Exception: SegFault  1.00 sec
      Start  4: ArborX_Test_DetailsTreeConstruction
 4/31 Test  #4: ArborX_Test_DetailsTreeConstruction ..............***Exception: SegFault  1.00 sec
      Start  5: ArborX_Test_DetailsContainers
 5/31 Test  #5: ArborX_Test_DetailsContainers ....................   Passed    0.08 sec
      Start  6: ArborX_Test_DetailsCrsGraphWrapperImpl
 6/31 Test  #6: ArborX_Test_DetailsCrsGraphWrapperImpl ...........***Exception: SegFault  0.99 sec
      Start  7: ArborX_Test_Clustering
 7/31 Test  #7: ArborX_Test_Clustering ...........................***Exception: SegFault  0.99 sec
      Start  8: ArborX_Test_DetailsClusteringHelpers
 8/31 Test  #8: ArborX_Test_DetailsClusteringHelpers .............***Exception: SegFault  0.98 sec
      Start  9: ArborX_Test_SpecializedTraversals
 9/31 Test  #9: ArborX_Test_SpecializedTraversals ................***Exception: SegFault  1.00 sec
      Start 10: ArborX_Test_DistributedTree
10/31 Test #10: ArborX_Test_DistributedTree ......................***Failed   13.58 sec
      Start 11: ArborX_Test_DetailsDistributedTreeImpl
11/31 Test #11: ArborX_Test_DetailsDistributedTreeImpl ...........***Failed   13.50 sec
      Start 12: ArborX_Test_BoostAdapters
12/31 Test #12: ArborX_Test_BoostAdapters ........................***Exception: SegFault  1.00 sec
      Start 13: ArborX_Test_InterpMovingLeastSquares
13/31 Test #13: ArborX_Test_InterpMovingLeastSquares .............***Exception: SegFault  1.00 sec
      Start 14: ArborX_Example_HostAccessTraits
14/31 Test #14: ArborX_Example_HostAccessTraits ..................***Exception: SegFault  0.98 sec
      Start 15: ArborX_Example_BruteForce
15/31 Test #15: ArborX_Example_BruteForce ........................***Exception: SegFault  0.98 sec
      Start 16: ArborX_Example_Callback
16/31 Test #16: ArborX_Example_Callback ..........................***Exception: SegFault  0.98 sec
      Start 17: ArborX_Example_DBSCAN
17/31 Test #17: ArborX_Example_DBSCAN ............................***Exception: SegFault  1.00 sec
      Start 18: ArborX_Example_MolecularDynamics
18/31 Test #18: ArborX_Example_MolecularDynamics .................***Exception: SegFault  0.99 sec
      Start 19: ArborX_Example_Intersection
19/31 Test #19: ArborX_Example_Intersection ......................***Exception: SegFault  0.99 sec
      Start 20: ArborX_Example_TriangleIntersection
20/31 Test #20: ArborX_Example_TriangleIntersection ..............***Exception: SegFault  1.00 sec
      Start 21: ArborX_Example_TriangleIntersectionWithMapping
21/31 Test #21: ArborX_Example_TriangleIntersectionWithMapping ...***Exception: SegFault  0.98 sec
      Start 22: ArborX_Example_TreeViz
22/31 Test #22: ArborX_Example_TreeViz ...........................***Exception: SegFault  0.98 sec
      Start 23: ArborX_Example_RayTracing
23/31 Test #23: ArborX_Example_RayTracing ........................***Exception: SegFault  1.01 sec
      Start 24: ArborX_Example_MovingLeastSquares
24/31 Test #24: ArborX_Example_MovingLeastSquares ................***Exception: SegFault  1.01 sec
      Start 25: ArborX_Benchmark_BruteForceVsBVH
25/31 Test #25: ArborX_Benchmark_BruteForceVsBVH .................***Exception: SegFault  0.99 sec
      Start 26: ArborX_Benchmark_DBSCAN
26/31 Test #26: ArborX_Benchmark_DBSCAN ..........................***Exception: SegFault  0.98 sec
      Start 27: ArborX_Benchmark_ExecutionSpaces
27/31 Test #27: ArborX_Benchmark_ExecutionSpaces .................***Exception: SegFault  1.00 sec
      Start 28: ArborX_Benchmark_BoundingVolumeHierarchy
28/31 Test #28: ArborX_Benchmark_BoundingVolumeHierarchy .........***Exception: SegFault  0.97 sec
      Start 29: ArborX_Benchmark_Develop
29/31 Test #29: ArborX_Benchmark_Develop .........................***Exception: SegFault  0.99 sec
      Start 30: ArborX_Benchmark_UnionFind
30/31 Test #30: ArborX_Benchmark_UnionFind .......................***Exception: SegFault  1.01 sec
      Start 31: ArborX_Benchmark_DistributedTree
31/31 Test #31: ArborX_Benchmark_DistributedTree .................***Failed   13.53 sec

6% tests passed, 29 tests failed out of 31

Total Test time (real) =  66.56 sec

The following tests FAILED:
	  1 - ArborX_Test_DetailsUtils (SEGFAULT)
	  3 - ArborX_Test_QueryTree (SEGFAULT)
	  4 - ArborX_Test_DetailsTreeConstruction (SEGFAULT)
	  6 - ArborX_Test_DetailsCrsGraphWrapperImpl (SEGFAULT)
	  7 - ArborX_Test_Clustering (SEGFAULT)
	  8 - ArborX_Test_DetailsClusteringHelpers (SEGFAULT)
	  9 - ArborX_Test_SpecializedTraversals (SEGFAULT)
	 10 - ArborX_Test_DistributedTree (Failed)
	 11 - ArborX_Test_DetailsDistributedTreeImpl (Failed)
	 12 - ArborX_Test_BoostAdapters (SEGFAULT)
	 13 - ArborX_Test_InterpMovingLeastSquares (SEGFAULT)
	 14 - ArborX_Example_HostAccessTraits (SEGFAULT)
	 15 - ArborX_Example_BruteForce (SEGFAULT)
	 16 - ArborX_Example_Callback (SEGFAULT)
	 17 - ArborX_Example_DBSCAN (SEGFAULT)
	 18 - ArborX_Example_MolecularDynamics (SEGFAULT)
	 19 - ArborX_Example_Intersection (SEGFAULT)
	 20 - ArborX_Example_TriangleIntersection (SEGFAULT)
	 21 - ArborX_Example_TriangleIntersectionWithMapping (SEGFAULT)
	 22 - ArborX_Example_TreeViz (SEGFAULT)
	 23 - ArborX_Example_RayTracing (SEGFAULT)
	 24 - ArborX_Example_MovingLeastSquares (SEGFAULT)
	 25 - ArborX_Benchmark_BruteForceVsBVH (SEGFAULT)
	 26 - ArborX_Benchmark_DBSCAN (SEGFAULT)
	 27 - ArborX_Benchmark_ExecutionSpaces (SEGFAULT)
	 28 - ArborX_Benchmark_BoundingVolumeHierarchy (SEGFAULT)
	 29 - ArborX_Benchmark_Develop (SEGFAULT)
	 30 - ArborX_Benchmark_UnionFind (SEGFAULT)
	 31 - ArborX_Benchmark_DistributedTree (Failed)
Errors while running CTest
Output from these tests are in: /var/jenkins/workspace/ArborX_master/build/Testing/Temporary/LastTest.log
Use "--rerun-failed --output-on-failure" to re-run the failed cases verbosely.