Console Output

Skipping 1,745 KB.. Full Log
9437/9934 Test #7110: mpi/crash_03.mpirun=4.debug .....................................................   Passed    2.80 sec
          Start 7111: mpi/crash_03.mpirun=4.release
9438/9934 Test #7111: mpi/crash_03.mpirun=4.release ...................................................   Passed    2.84 sec
          Start 7151: mpi/distribute_sp_01.mpirun=4.debug
9439/9934 Test #7153: mpi/distribute_sp_02.mpirun=10.debug ............................................   Passed   10.79 sec
          Start 7157: mpi/dof_handler_number_cache.mpirun=10.debug
9440/9934 Test #7151: mpi/distribute_sp_01.mpirun=4.debug .............................................   Passed    2.76 sec
          Start 7152: mpi/distribute_sp_01.mpirun=4.release
9441/9934 Test #7154: mpi/distribute_sp_02.mpirun=10.release ..........................................   Passed    9.76 sec
          Start 7158: mpi/dof_handler_number_cache.mpirun=10.release
9442/9934 Test #7152: mpi/distribute_sp_01.mpirun=4.release ...........................................   Passed    2.79 sec
          Start 7155: mpi/distribute_sp_02.mpirun=4.debug
9443/9934 Test #7155: mpi/distribute_sp_02.mpirun=4.debug .............................................   Passed    2.80 sec
          Start 7156: mpi/distribute_sp_02.mpirun=4.release
9444/9934 Test #7156: mpi/distribute_sp_02.mpirun=4.release ...........................................   Passed    2.73 sec
          Start 7942: mpi/trilinos_distribute_01_block.mpirun=4.release
9445/9934 Test #7942: mpi/trilinos_distribute_01_block.mpirun=4.release ...............................   Passed    2.76 sec
          Start 7949: mpi/trilinos_distribute_01_inhomogenous.mpirun=4.debug
9446/9934 Test #7157: mpi/dof_handler_number_cache.mpirun=10.debug ....................................   Passed   14.02 sec
          Start 7161: mpi/extract_boundary_dofs.mpirun=10.debug
9447/9934 Test #7949: mpi/trilinos_distribute_01_inhomogenous.mpirun=4.debug ..........................   Passed    2.75 sec
          Start 7159: mpi/dof_handler_number_cache.mpirun=4.debug
9448/9934 Test #7158: mpi/dof_handler_number_cache.mpirun=10.release ..................................   Passed   13.47 sec
          Start 7162: mpi/extract_boundary_dofs.mpirun=10.release
9449/9934 Test #7159: mpi/dof_handler_number_cache.mpirun=4.debug .....................................   Passed    4.09 sec
          Start 7160: mpi/dof_handler_number_cache.mpirun=4.release
9450/9934 Test #7160: mpi/dof_handler_number_cache.mpirun=4.release ...................................   Passed    2.84 sec
          Start 7950: mpi/trilinos_distribute_01_inhomogenous.mpirun=4.release
9451/9934 Test #7950: mpi/trilinos_distribute_01_inhomogenous.mpirun=4.release ........................   Passed    2.68 sec
9452/9934 Test #7161: mpi/extract_boundary_dofs.mpirun=10.debug .......................................   Passed   13.11 sec
          Start 7165: mpi/extract_constant_modes_01.mpirun=10.debug
          Start 7163: mpi/extract_boundary_dofs.mpirun=4.debug
9453/9934 Test #7162: mpi/extract_boundary_dofs.mpirun=10.release .....................................   Passed   12.59 sec
          Start 7166: mpi/extract_constant_modes_01.mpirun=10.release
9454/9934 Test #7163: mpi/extract_boundary_dofs.mpirun=4.debug ........................................   Passed    3.41 sec
          Start 7164: mpi/extract_boundary_dofs.mpirun=4.release
9455/9934 Test #7164: mpi/extract_boundary_dofs.mpirun=4.release ......................................   Passed    2.77 sec
9456/9934 Test #7165: mpi/extract_constant_modes_01.mpirun=10.debug ...................................   Passed   12.35 sec
          Start 7171: mpi/extract_locally_active_dofs.mpirun=10.debug
          Start 7167: mpi/extract_constant_modes_01.mpirun=4.debug
9457/9934 Test #7166: mpi/extract_constant_modes_01.mpirun=10.release .................................   Passed   11.34 sec
          Start 7172: mpi/extract_locally_active_dofs.mpirun=10.release
9458/9934 Test #7167: mpi/extract_constant_modes_01.mpirun=4.debug ....................................   Passed    3.07 sec
          Start 7168: mpi/extract_constant_modes_01.mpirun=4.release
9459/9934 Test #7168: mpi/extract_constant_modes_01.mpirun=4.release ..................................   Passed    2.87 sec
9460/9934 Test #7171: mpi/extract_locally_active_dofs.mpirun=10.debug .................................   Passed   13.59 sec
          Start 7175: mpi/fe_field_function_01.mpirun=10.debug
          Start 7173: mpi/extract_locally_active_dofs.mpirun=4.debug
9461/9934 Test #7172: mpi/extract_locally_active_dofs.mpirun=10.release ...............................   Passed   12.67 sec
          Start 7176: mpi/fe_field_function_01.mpirun=10.release
9462/9934 Test #7173: mpi/extract_locally_active_dofs.mpirun=4.debug ..................................   Passed    3.37 sec
          Start 7174: mpi/extract_locally_active_dofs.mpirun=4.release
9463/9934 Test #7174: mpi/extract_locally_active_dofs.mpirun=4.release ................................   Passed    2.94 sec
9464/9934 Test #7176: mpi/fe_field_function_01.mpirun=10.release ......................................   Passed   12.55 sec
          Start 7189: mpi/fe_tools_extrapolate_03.mpirun=10.debug
          Start 7178: mpi/fe_field_function_01.mpirun=4.release
9465/9934 Test #7178: mpi/fe_field_function_01.mpirun=4.release .......................................   Passed    3.06 sec
9466/9934 Test #7189: mpi/fe_tools_extrapolate_03.mpirun=10.debug .....................................   Passed    4.26 sec
          Start 7190: mpi/fe_tools_extrapolate_03.mpirun=10.release
          Start 7191: mpi/fe_tools_extrapolate_03.mpirun=3.debug
9467/9934 Test #7175: mpi/fe_field_function_01.mpirun=10.debug ........................................   Passed   19.12 sec
          Start 7233: mpi/hp_integrate_difference.mpirun=10.debug
9468/9934 Test #7190: mpi/fe_tools_extrapolate_03.mpirun=10.release ...................................   Passed    2.86 sec
          Start 7234: mpi/hp_integrate_difference.mpirun=10.release
          Start 7192: mpi/fe_tools_extrapolate_03.mpirun=3.release
9469/9934 Test #7191: mpi/fe_tools_extrapolate_03.mpirun=3.debug ......................................   Passed    4.06 sec
9470/9934 Test #7192: mpi/fe_tools_extrapolate_03.mpirun=3.release ....................................   Passed    2.94 sec
          Start 7177: mpi/fe_field_function_01.mpirun=4.debug
9471/9934 Test #7234: mpi/hp_integrate_difference.mpirun=10.release ...................................   Passed   12.67 sec
          Start 7279: mpi/integrate_difference.mpirun=10.debug
9472/9934 Test #7233: mpi/hp_integrate_difference.mpirun=10.debug .....................................   Passed   14.37 sec
          Start 7280: mpi/integrate_difference.mpirun=10.release
9473/9934 Test #7177: mpi/fe_field_function_01.mpirun=4.debug .........................................   Passed   11.59 sec
          Start 7235: mpi/hp_integrate_difference.mpirun=4.debug
9474/9934 Test #7235: mpi/hp_integrate_difference.mpirun=4.debug ......................................   Passed    3.80 sec
          Start 7236: mpi/hp_integrate_difference.mpirun=4.release
9475/9934 Test #7236: mpi/hp_integrate_difference.mpirun=4.release ....................................   Passed    2.73 sec
9476/9934 Test #7279: mpi/integrate_difference.mpirun=10.debug ........................................   Passed   12.90 sec
          Start 7283: mpi/interpolate_01.mpirun=10.debug
          Start 7281: mpi/integrate_difference.mpirun=4.debug
9477/9934 Test #7280: mpi/integrate_difference.mpirun=10.release ......................................   Passed   12.53 sec
          Start 7284: mpi/interpolate_01.mpirun=10.release
9478/9934 Test #7281: mpi/integrate_difference.mpirun=4.debug .........................................   Passed    3.23 sec
          Start 7282: mpi/integrate_difference.mpirun=4.release
9479/9934 Test #7282: mpi/integrate_difference.mpirun=4.release .......................................   Passed    2.85 sec
9480/9934 Test #7284: mpi/interpolate_01.mpirun=10.release ............................................   Passed   12.67 sec
          Start 7287: mpi/interpolate_03.mpirun=10.debug
          Start 7286: mpi/interpolate_01.mpirun=4.release
9481/9934 Test #7283: mpi/interpolate_01.mpirun=10.debug ..............................................   Passed   14.27 sec
          Start 7288: mpi/interpolate_03.mpirun=10.release
9482/9934 Test #7286: mpi/interpolate_01.mpirun=4.release .............................................   Passed    2.94 sec
          Start 7285: mpi/interpolate_01.mpirun=4.debug
9483/9934 Test #7285: mpi/interpolate_01.mpirun=4.debug ...............................................   Passed    2.93 sec
9484/9934 Test #7287: mpi/interpolate_03.mpirun=10.debug ..............................................   Passed   12.23 sec
          Start 7297: mpi/is_locally_owned.mpirun=10.debug
          Start 7289: mpi/interpolate_03.mpirun=4.debug
9485/9934 Test #7288: mpi/interpolate_03.mpirun=10.release ............................................   Passed   11.27 sec
          Start 7298: mpi/is_locally_owned.mpirun=10.release
9486/9934 Test #7289: mpi/interpolate_03.mpirun=4.debug ...............................................   Passed    2.75 sec
          Start 7290: mpi/interpolate_03.mpirun=4.release
9487/9934 Test #7290: mpi/interpolate_03.mpirun=4.release .............................................   Passed    2.65 sec
9488/9934 Test #7298: mpi/is_locally_owned.mpirun=10.release ..........................................   Passed   10.13 sec
          Start 7307: mpi/make_zero_boundary_values.mpirun=10.debug
          Start 7300: mpi/is_locally_owned.mpirun=4.release
9489/9934 Test #7300: mpi/is_locally_owned.mpirun=4.release ...........................................   Passed    2.59 sec
9490/9934 Test #7297: mpi/is_locally_owned.mpirun=10.debug ............................................   Passed   12.88 sec
          Start 7308: mpi/make_zero_boundary_values.mpirun=10.release
          Start 7299: mpi/is_locally_owned.mpirun=4.debug
9491/9934 Test #7299: mpi/is_locally_owned.mpirun=4.debug .............................................   Passed    2.79 sec
9492/9934 Test #7307: mpi/make_zero_boundary_values.mpirun=10.debug ...................................   Passed   12.79 sec
          Start 7311: mpi/map_dofs_to_support_points.mpirun=10.debug
          Start 7309: mpi/make_zero_boundary_values.mpirun=4.debug
9493/9934 Test #7308: mpi/make_zero_boundary_values.mpirun=10.release .................................   Passed   12.09 sec
          Start 7312: mpi/map_dofs_to_support_points.mpirun=10.release
9494/9934 Test #7309: mpi/make_zero_boundary_values.mpirun=4.debug ....................................   Passed    3.18 sec
          Start 7310: mpi/make_zero_boundary_values.mpirun=4.release
9495/9934 Test #7310: mpi/make_zero_boundary_values.mpirun=4.release ..................................   Passed    2.83 sec
9496/9934 Test #7311: mpi/map_dofs_to_support_points.mpirun=10.debug ..................................   Passed   13.33 sec
          Start 7333: mpi/mg_01.mpirun=10.debug
          Start 7313: mpi/map_dofs_to_support_points.mpirun=4.debug
9497/9934 Test #7312: mpi/map_dofs_to_support_points.mpirun=10.release ................................   Passed   12.16 sec
          Start 7334: mpi/mg_01.mpirun=10.release
9498/9934 Test #7313: mpi/map_dofs_to_support_points.mpirun=4.debug ...................................   Passed    3.09 sec
          Start 7314: mpi/map_dofs_to_support_points.mpirun=4.release
9499/9934 Test #7314: mpi/map_dofs_to_support_points.mpirun=4.release .................................   Passed    2.56 sec
9500/9934 Test #7334: mpi/mg_01.mpirun=10.release .....................................................   Passed    9.96 sec
          Start 7337: mpi/mg_02.mpirun=10.debug
          Start 7336: mpi/mg_01.mpirun=4.release
9501/9934 Test #7333: mpi/mg_01.mpirun=10.debug .......................................................   Passed   11.83 sec
          Start 7338: mpi/mg_02.mpirun=10.release
9502/9934 Test #7336: mpi/mg_01.mpirun=4.release ......................................................   Passed    2.98 sec
          Start 7335: mpi/mg_01.mpirun=4.debug
9503/9934 Test #7335: mpi/mg_01.mpirun=4.debug ........................................................   Passed    2.81 sec
9504/9934 Test #7338: mpi/mg_02.mpirun=10.release .....................................................   Passed   11.48 sec
          Start 7343: mpi/mg_03.mpirun=10.debug
          Start 7340: mpi/mg_02.mpirun=4.release
9505/9934 Test #7337: mpi/mg_02.mpirun=10.debug .......................................................   Passed   12.70 sec
          Start 7344: mpi/mg_03.mpirun=10.release
9506/9934 Test #7340: mpi/mg_02.mpirun=4.release ......................................................   Passed    3.04 sec
          Start 7339: mpi/mg_02.mpirun=4.debug
9507/9934 Test #7343: mpi/mg_03.mpirun=10.debug .......................................................   Passed    3.04 sec
          Start 7399: mpi/p4est_2d_coarse_01.mpirun=10.debug
9508/9934 Test #7344: mpi/mg_03.mpirun=10.release .....................................................   Passed    3.03 sec
          Start 7400: mpi/p4est_2d_coarse_01.mpirun=10.release
9509/9934 Test #7339: mpi/mg_02.mpirun=4.debug ........................................................   Passed    2.92 sec
          Start 7345: mpi/mg_03.mpirun=4.debug
9510/9934 Test #7345: mpi/mg_03.mpirun=4.debug ........................................................   Passed    2.79 sec
          Start 7346: mpi/mg_03.mpirun=4.release
9511/9934 Test #7346: mpi/mg_03.mpirun=4.release ......................................................   Passed    2.82 sec
9512/9934 Test #7400: mpi/p4est_2d_coarse_01.mpirun=10.release ........................................   Passed   11.38 sec
          Start 7403: mpi/p4est_2d_constraintmatrix_01.mpirun=10.debug
          Start 7402: mpi/p4est_2d_coarse_01.mpirun=4.release
9513/9934 Test #7402: mpi/p4est_2d_coarse_01.mpirun=4.release .........................................   Passed    3.27 sec
9514/9934 Test #7399: mpi/p4est_2d_coarse_01.mpirun=10.debug ..........................................   Passed   21.92 sec
          Start 7404: mpi/p4est_2d_constraintmatrix_01.mpirun=10.release
          Start 7401: mpi/p4est_2d_coarse_01.mpirun=4.debug
9515/9934 Test #7403: mpi/p4est_2d_constraintmatrix_01.mpirun=10.debug ................................   Passed   13.42 sec
          Start 7407: mpi/p4est_2d_constraintmatrix_02.mpirun=10.debug
9516/9934 Test #7404: mpi/p4est_2d_constraintmatrix_01.mpirun=10.release ..............................   Passed   11.30 sec
          Start 7408: mpi/p4est_2d_constraintmatrix_02.mpirun=10.release
9517/9934 Test #7401: mpi/p4est_2d_coarse_01.mpirun=4.debug ...........................................   Passed   11.62 sec
          Start 7405: mpi/p4est_2d_constraintmatrix_01.mpirun=4.debug
9518/9934 Test #7405: mpi/p4est_2d_constraintmatrix_01.mpirun=4.debug .................................   Passed    2.94 sec
          Start 7406: mpi/p4est_2d_constraintmatrix_01.mpirun=4.release
9519/9934 Test #7407: mpi/p4est_2d_constraintmatrix_02.mpirun=10.debug ................................   Passed   12.79 sec
          Start 7411: mpi/p4est_2d_constraintmatrix_03.mpirun=10.debug
9520/9934 Test #7406: mpi/p4est_2d_constraintmatrix_01.mpirun=4.release ...............................   Passed    2.71 sec
          Start 7409: mpi/p4est_2d_constraintmatrix_02.mpirun=4.debug
9521/9934 Test #7409: mpi/p4est_2d_constraintmatrix_02.mpirun=4.debug .................................   Passed    2.75 sec
9522/9934 Test #7408: mpi/p4est_2d_constraintmatrix_02.mpirun=10.release ..............................   Passed   11.87 sec
          Start 7412: mpi/p4est_2d_constraintmatrix_03.mpirun=10.release
          Start 7410: mpi/p4est_2d_constraintmatrix_02.mpirun=4.release
9523/9934 Test #7410: mpi/p4est_2d_constraintmatrix_02.mpirun=4.release ...............................   Passed    2.65 sec
9524/9934 Test #7411: mpi/p4est_2d_constraintmatrix_03.mpirun=10.debug ................................   Passed   13.58 sec
          Start 7415: mpi/p4est_2d_constraintmatrix_04.mpirun=10.debug
          Start 7413: mpi/p4est_2d_constraintmatrix_03.mpirun=4.debug
9525/9934 Test #7413: mpi/p4est_2d_constraintmatrix_03.mpirun=4.debug .................................   Passed    3.18 sec
9526/9934 Test #7412: mpi/p4est_2d_constraintmatrix_03.mpirun=10.release ..............................   Passed   11.91 sec
          Start 7416: mpi/p4est_2d_constraintmatrix_04.mpirun=10.release
          Start 7414: mpi/p4est_2d_constraintmatrix_03.mpirun=4.release
9527/9934 Test #7414: mpi/p4est_2d_constraintmatrix_03.mpirun=4.release ...............................   Passed    2.73 sec
9528/9934 Test #7415: mpi/p4est_2d_constraintmatrix_04.mpirun=10.debug ................................   Passed   13.81 sec
          Start 7421: mpi/p4est_2d_dofhandler_01.mpirun=10.debug
          Start 7417: mpi/p4est_2d_constraintmatrix_04.mpirun=4.debug
9529/9934 Test #7416: mpi/p4est_2d_constraintmatrix_04.mpirun=10.release ..............................   Passed   11.47 sec
          Start 7422: mpi/p4est_2d_dofhandler_01.mpirun=10.release
9530/9934 Test #7417: mpi/p4est_2d_constraintmatrix_04.mpirun=4.debug .................................   Passed    3.91 sec
          Start 7418: mpi/p4est_2d_constraintmatrix_04.mpirun=4.release
9531/9934 Test #7418: mpi/p4est_2d_constraintmatrix_04.mpirun=4.release ...............................   Passed    2.74 sec
9532/9934 Test #7421: mpi/p4est_2d_dofhandler_01.mpirun=10.debug ......................................   Passed   13.01 sec
          Start 7425: mpi/p4est_2d_dofhandler_02.mpirun=10.debug
          Start 7423: mpi/p4est_2d_dofhandler_01.mpirun=4.debug
9533/9934 Test #7422: mpi/p4est_2d_dofhandler_01.mpirun=10.release ....................................   Passed   11.06 sec
          Start 7426: mpi/p4est_2d_dofhandler_02.mpirun=10.release
9534/9934 Test #7423: mpi/p4est_2d_dofhandler_01.mpirun=4.debug .......................................   Passed    2.83 sec
          Start 7424: mpi/p4est_2d_dofhandler_01.mpirun=4.release
9535/9934 Test #7424: mpi/p4est_2d_dofhandler_01.mpirun=4.release .....................................   Passed    2.69 sec
9536/9934 Test #7426: mpi/p4est_2d_dofhandler_02.mpirun=10.release ....................................   Passed   10.73 sec
          Start 7429: mpi/p4est_2d_dofhandler_03.mpirun=10.debug
          Start 7428: mpi/p4est_2d_dofhandler_02.mpirun=4.release
9537/9934 Test #7425: mpi/p4est_2d_dofhandler_02.mpirun=10.debug ......................................   Passed   14.60 sec
          Start 7430: mpi/p4est_2d_dofhandler_03.mpirun=10.release
9538/9934 Test #7428: mpi/p4est_2d_dofhandler_02.mpirun=4.release .....................................   Passed    2.81 sec
          Start 7427: mpi/p4est_2d_dofhandler_02.mpirun=4.debug
9539/9934 Test #7427: mpi/p4est_2d_dofhandler_02.mpirun=4.debug .......................................   Passed    4.30 sec
9540/9934 Test #7430: mpi/p4est_2d_dofhandler_03.mpirun=10.release ....................................   Passed   11.14 sec
          Start 7433: mpi/p4est_2d_dofhandler_04.mpirun=10.debug
          Start 7432: mpi/p4est_2d_dofhandler_03.mpirun=4.release
9541/9934 Test #7429: mpi/p4est_2d_dofhandler_03.mpirun=10.debug ......................................   Passed   15.72 sec
          Start 7434: mpi/p4est_2d_dofhandler_04.mpirun=10.release
9542/9934 Test #7432: mpi/p4est_2d_dofhandler_03.mpirun=4.release .....................................   Passed    2.73 sec
          Start 7431: mpi/p4est_2d_dofhandler_03.mpirun=4.debug
9543/9934 Test #7431: mpi/p4est_2d_dofhandler_03.mpirun=4.debug .......................................   Passed    4.46 sec
9544/9934 Test #7434: mpi/p4est_2d_dofhandler_04.mpirun=10.release ....................................   Passed   11.03 sec
          Start 7437: mpi/p4est_2d_dofhandler_05.mpirun=10.debug
          Start 7436: mpi/p4est_2d_dofhandler_04.mpirun=4.release
9545/9934 Test #7433: mpi/p4est_2d_dofhandler_04.mpirun=10.debug ......................................   Passed   15.09 sec
          Start 7438: mpi/p4est_2d_dofhandler_05.mpirun=10.release
9546/9934 Test #7436: mpi/p4est_2d_dofhandler_04.mpirun=4.release .....................................   Passed    2.81 sec
          Start 7435: mpi/p4est_2d_dofhandler_04.mpirun=4.debug
9547/9934 Test #7435: mpi/p4est_2d_dofhandler_04.mpirun=4.debug .......................................   Passed    4.39 sec
9548/9934 Test #7437: mpi/p4est_2d_dofhandler_05.mpirun=10.debug ......................................   Passed   12.06 sec
          Start 7441: mpi/p4est_2d_ghost_01.mpirun=10.debug
          Start 7439: mpi/p4est_2d_dofhandler_05.mpirun=4.debug
9549/9934 Test #7438: mpi/p4est_2d_dofhandler_05.mpirun=10.release ....................................   Passed   10.89 sec
          Start 7442: mpi/p4est_2d_ghost_01.mpirun=10.release
9550/9934 Test #7439: mpi/p4est_2d_dofhandler_05.mpirun=4.debug .......................................   Passed    2.87 sec
          Start 7440: mpi/p4est_2d_dofhandler_05.mpirun=4.release
9551/9934 Test #7440: mpi/p4est_2d_dofhandler_05.mpirun=4.release .....................................   Passed    2.68 sec
9552/9934 Test #7442: mpi/p4est_2d_ghost_01.mpirun=10.release .........................................   Passed   10.29 sec
          Start 7445: mpi/p4est_2d_ghost_02.mpirun=10.debug
          Start 7444: mpi/p4est_2d_ghost_01.mpirun=4.release
9553/9934 Test #7441: mpi/p4est_2d_ghost_01.mpirun=10.debug ...........................................   Passed   13.03 sec
          Start 7446: mpi/p4est_2d_ghost_02.mpirun=10.release
9554/9934 Test #7444: mpi/p4est_2d_ghost_01.mpirun=4.release ..........................................   Passed    2.88 sec
          Start 7443: mpi/p4est_2d_ghost_01.mpirun=4.debug
9555/9934 Test #7443: mpi/p4est_2d_ghost_01.mpirun=4.debug ............................................   Passed    2.78 sec
9556/9934 Test #7445: mpi/p4est_2d_ghost_02.mpirun=10.debug ...........................................   Passed   11.91 sec
          Start 7449: mpi/p4est_2d_refine_01.mpirun=10.debug
          Start 7447: mpi/p4est_2d_ghost_02.mpirun=4.debug
9557/9934 Test #7446: mpi/p4est_2d_ghost_02.mpirun=10.release .........................................   Passed   10.26 sec
          Start 7450: mpi/p4est_2d_refine_01.mpirun=10.release
9558/9934 Test #7447: mpi/p4est_2d_ghost_02.mpirun=4.debug ............................................   Passed    3.09 sec
          Start 7448: mpi/p4est_2d_ghost_02.mpirun=4.release
9559/9934 Test #7448: mpi/p4est_2d_ghost_02.mpirun=4.release ..........................................   Passed    2.98 sec
9560/9934 Test #7450: mpi/p4est_2d_refine_01.mpirun=10.release ........................................   Passed   10.12 sec
          Start 7453: mpi/p4est_2d_refine_02.mpirun=10.debug
          Start 7452: mpi/p4est_2d_refine_01.mpirun=4.release
9561/9934 Test #7449: mpi/p4est_2d_refine_01.mpirun=10.debug ..........................................   Passed   11.99 sec
          Start 7454: mpi/p4est_2d_refine_02.mpirun=10.release
9562/9934 Test #7452: mpi/p4est_2d_refine_01.mpirun=4.release .........................................   Passed    2.76 sec
          Start 7451: mpi/p4est_2d_refine_01.mpirun=4.debug
9563/9934 Test #7451: mpi/p4est_2d_refine_01.mpirun=4.debug ...........................................   Passed    2.78 sec
9564/9934 Test #7454: mpi/p4est_2d_refine_02.mpirun=10.release ........................................   Passed   10.29 sec
          Start 7457: mpi/p4est_2d_refine_03.mpirun=10.debug
          Start 7456: mpi/p4est_2d_refine_02.mpirun=4.release
9565/9934 Test #7453: mpi/p4est_2d_refine_02.mpirun=10.debug ..........................................   Passed   12.37 sec
          Start 7458: mpi/p4est_2d_refine_03.mpirun=10.release
9566/9934 Test #7456: mpi/p4est_2d_refine_02.mpirun=4.release .........................................   Passed    2.93 sec
          Start 7455: mpi/p4est_2d_refine_02.mpirun=4.debug
9567/9934 Test #7455: mpi/p4est_2d_refine_02.mpirun=4.debug ...........................................   Passed    2.86 sec
9568/9934 Test #7458: mpi/p4est_2d_refine_03.mpirun=10.release ........................................   Passed   10.31 sec
          Start 7461: mpi/p4est_2d_renumber_01.mpirun=10.debug
          Start 7460: mpi/p4est_2d_refine_03.mpirun=4.release
9569/9934 Test #7457: mpi/p4est_2d_refine_03.mpirun=10.debug ..........................................   Passed   13.28 sec
          Start 7462: mpi/p4est_2d_renumber_01.mpirun=10.release
9570/9934 Test #7460: mpi/p4est_2d_refine_03.mpirun=4.release .........................................   Passed    2.77 sec
          Start 7459: mpi/p4est_2d_refine_03.mpirun=4.debug
9571/9934 Test #7459: mpi/p4est_2d_refine_03.mpirun=4.debug ...........................................   Passed    3.77 sec
9572/9934 Test #7461: mpi/p4est_2d_renumber_01.mpirun=10.debug ........................................   Passed   13.11 sec
          Start 7465: mpi/p4est_2d_renumber_02.mpirun=10.debug
          Start 7463: mpi/p4est_2d_renumber_01.mpirun=4.debug
9573/9934 Test #7462: mpi/p4est_2d_renumber_01.mpirun=10.release ......................................   Passed   11.99 sec
          Start 7466: mpi/p4est_2d_renumber_02.mpirun=10.release
9574/9934 Test #7463: mpi/p4est_2d_renumber_01.mpirun=4.debug .........................................   Passed    2.83 sec
          Start 7464: mpi/p4est_2d_renumber_01.mpirun=4.release
9575/9934 Test #7464: mpi/p4est_2d_renumber_01.mpirun=4.release .......................................   Passed    2.56 sec
9576/9934 Test #7465: mpi/p4est_2d_renumber_02.mpirun=10.debug ........................................   Passed   12.19 sec
          Start 7469: mpi/p4est_2d_simple.mpirun=10.debug
          Start 7467: mpi/p4est_2d_renumber_02.mpirun=4.debug
9577/9934 Test #7466: mpi/p4est_2d_renumber_02.mpirun=10.release ......................................   Passed   11.52 sec
          Start 7470: mpi/p4est_2d_simple.mpirun=10.release
9578/9934 Test #7467: mpi/p4est_2d_renumber_02.mpirun=4.debug .........................................   Passed    3.07 sec
          Start 7468: mpi/p4est_2d_renumber_02.mpirun=4.release
9579/9934 Test #7468: mpi/p4est_2d_renumber_02.mpirun=4.release .......................................   Passed    2.83 sec
9580/9934 Test #7470: mpi/p4est_2d_simple.mpirun=10.release ...........................................   Passed    9.58 sec
          Start 7473: mpi/p4est_3d_constraintmatrix_01.mpirun=10.debug
          Start 7472: mpi/p4est_2d_simple.mpirun=4.release
9581/9934 Test #7469: mpi/p4est_2d_simple.mpirun=10.debug .............................................   Passed   11.49 sec
          Start 7474: mpi/p4est_3d_constraintmatrix_01.mpirun=10.release
9582/9934 Test #7472: mpi/p4est_2d_simple.mpirun=4.release ............................................   Passed    2.88 sec
          Start 7471: mpi/p4est_2d_simple.mpirun=4.debug
9583/9934 Test #7471: mpi/p4est_2d_simple.mpirun=4.debug ..............................................   Passed    3.13 sec
9584/9934 Test #7474: mpi/p4est_3d_constraintmatrix_01.mpirun=10.release ..............................   Passed   11.98 sec
          Start 7477: mpi/p4est_3d_constraintmatrix_02.mpirun=10.debug
          Start 7476: mpi/p4est_3d_constraintmatrix_01.mpirun=4.release
9585/9934 Test #7473: mpi/p4est_3d_constraintmatrix_01.mpirun=10.debug ................................   Passed   14.29 sec
          Start 7478: mpi/p4est_3d_constraintmatrix_02.mpirun=10.release
9586/9934 Test #7476: mpi/p4est_3d_constraintmatrix_01.mpirun=4.release ...............................   Passed    2.97 sec
          Start 7475: mpi/p4est_3d_constraintmatrix_01.mpirun=4.debug
9587/9934 Test #7475: mpi/p4est_3d_constraintmatrix_01.mpirun=4.debug .................................   Passed    4.05 sec
9588/9934 Test #7478: mpi/p4est_3d_constraintmatrix_02.mpirun=10.release ..............................   Passed   11.47 sec
          Start 7481: mpi/p4est_3d_constraintmatrix_03.mpirun=10.debug
          Start 7480: mpi/p4est_3d_constraintmatrix_02.mpirun=4.release
9589/9934 Test #7477: mpi/p4est_3d_constraintmatrix_02.mpirun=10.debug ................................   Passed   12.70 sec
          Start 7482: mpi/p4est_3d_constraintmatrix_03.mpirun=10.release
9590/9934 Test #7480: mpi/p4est_3d_constraintmatrix_02.mpirun=4.release ...............................   Passed    2.81 sec
          Start 7479: mpi/p4est_3d_constraintmatrix_02.mpirun=4.debug
9591/9934 Test #7479: mpi/p4est_3d_constraintmatrix_02.mpirun=4.debug .................................   Passed    3.06 sec
9592/9934 Test #7482: mpi/p4est_3d_constraintmatrix_03.mpirun=10.release ..............................   Passed   12.46 sec
          Start 7487: mpi/p4est_3d_ghost_01.mpirun=10.debug
          Start 7484: mpi/p4est_3d_constraintmatrix_03.mpirun=4.release
9593/9934 Test #7484: mpi/p4est_3d_constraintmatrix_03.mpirun=4.release ...............................   Passed    4.29 sec
9594/9934 Test #7487: mpi/p4est_3d_ghost_01.mpirun=10.debug ...........................................   Passed   12.52 sec
          Start 7488: mpi/p4est_3d_ghost_01.mpirun=10.release
          Start 7489: mpi/p4est_3d_ghost_01.mpirun=4.debug
9595/9934 Test #7481: mpi/p4est_3d_constraintmatrix_03.mpirun=10.debug ................................   Passed   27.67 sec
          Start 7491: mpi/p4est_3d_refine_01.mpirun=10.debug
9596/9934 Test #7489: mpi/p4est_3d_ghost_01.mpirun=4.debug ............................................   Passed    2.92 sec
          Start 7483: mpi/p4est_3d_constraintmatrix_03.mpirun=4.debug
9597/9934 Test #7488: mpi/p4est_3d_ghost_01.mpirun=10.release .........................................   Passed   10.84 sec
          Start 7492: mpi/p4est_3d_refine_01.mpirun=10.release
9598/9934 Test #7491: mpi/p4est_3d_refine_01.mpirun=10.debug ..........................................   Passed   18.89 sec
          Start 7495: mpi/p4est_3d_refine_02.mpirun=10.debug
9599/9934 Test #7492: mpi/p4est_3d_refine_01.mpirun=10.release ........................................   Passed   10.58 sec
          Start 7496: mpi/p4est_3d_refine_02.mpirun=10.release
9600/9934 Test #7483: mpi/p4est_3d_constraintmatrix_03.mpirun=4.debug .................................   Passed   27.69 sec
          Start 7490: mpi/p4est_3d_ghost_01.mpirun=4.release
9601/9934 Test #7496: mpi/p4est_3d_refine_02.mpirun=10.release ........................................   Passed   10.16 sec
          Start 7499: mpi/p4est_3d_refine_03.mpirun=10.debug
9602/9934 Test #7490: mpi/p4est_3d_ghost_01.mpirun=4.release ..........................................   Passed    2.82 sec
          Start 7493: mpi/p4est_3d_refine_01.mpirun=4.debug
9603/9934 Test #7495: mpi/p4est_3d_refine_02.mpirun=10.debug ..........................................   Passed   12.11 sec
          Start 7500: mpi/p4est_3d_refine_03.mpirun=10.release
9604/9934 Test #7493: mpi/p4est_3d_refine_01.mpirun=4.debug ...........................................   Passed    7.54 sec
          Start 7494: mpi/p4est_3d_refine_01.mpirun=4.release
9605/9934 Test #7494: mpi/p4est_3d_refine_01.mpirun=4.release .........................................   Passed    2.74 sec
          Start 7497: mpi/p4est_3d_refine_02.mpirun=4.debug
9606/9934 Test #7500: mpi/p4est_3d_refine_03.mpirun=10.release ........................................   Passed   10.21 sec
          Start 7511: mpi/p4est_data_out_01.mpirun=10.debug
9607/9934 Test #7499: mpi/p4est_3d_refine_03.mpirun=10.debug ..........................................   Passed   12.15 sec
          Start 7512: mpi/p4est_data_out_01.mpirun=10.release
9608/9934 Test #7497: mpi/p4est_3d_refine_02.mpirun=4.debug ...........................................   Passed    2.78 sec
          Start 7498: mpi/p4est_3d_refine_02.mpirun=4.release
9609/9934 Test #7498: mpi/p4est_3d_refine_02.mpirun=4.release .........................................   Passed    2.62 sec
          Start 7501: mpi/p4est_3d_refine_03.mpirun=4.debug
9610/9934 Test #7501: mpi/p4est_3d_refine_03.mpirun=4.debug ...........................................   Passed    2.81 sec
          Start 7502: mpi/p4est_3d_refine_03.mpirun=4.release
9611/9934 Test #7502: mpi/p4est_3d_refine_03.mpirun=4.release .........................................   Passed    2.76 sec
9612/9934 Test #7512: mpi/p4est_data_out_01.mpirun=10.release .........................................   Passed   12.07 sec
          Start 7515: mpi/p4est_get_subdomain_association.mpirun=10.debug
          Start 7514: mpi/p4est_data_out_01.mpirun=4.release
9613/9934 Test #7511: mpi/p4est_data_out_01.mpirun=10.debug ...........................................   Passed   13.13 sec
          Start 7516: mpi/p4est_get_subdomain_association.mpirun=10.release
9614/9934 Test #7514: mpi/p4est_data_out_01.mpirun=4.release ..........................................   Passed    2.84 sec
          Start 7513: mpi/p4est_data_out_01.mpirun=4.debug
9615/9934 Test #7513: mpi/p4est_data_out_01.mpirun=4.debug ............................................   Passed    2.95 sec
9616/9934 Test #7516: mpi/p4est_get_subdomain_association.mpirun=10.release ...........................   Passed   10.72 sec
          Start 7521: mpi/p4est_save_01.mpirun=10.debug
          Start 7518: mpi/p4est_get_subdomain_association.mpirun=4.release
9617/9934 Test #7515: mpi/p4est_get_subdomain_association.mpirun=10.debug .............................   Passed   12.06 sec
          Start 7522: mpi/p4est_save_01.mpirun=10.release
9618/9934 Test #7518: mpi/p4est_get_subdomain_association.mpirun=4.release ............................   Passed    2.91 sec
          Start 7517: mpi/p4est_get_subdomain_association.mpirun=4.debug
9619/9934 Test #7517: mpi/p4est_get_subdomain_association.mpirun=4.debug ..............................   Passed    3.02 sec
9620/9934 Test #7522: mpi/p4est_save_01.mpirun=10.release .............................................   Passed   10.56 sec
          Start 7539: mpi/parallel_block_vector_01.mpirun=10.debug
          Start 7524: mpi/p4est_save_01.mpirun=4.release
9621/9934 Test #7521: mpi/p4est_save_01.mpirun=10.debug ...............................................   Passed   12.01 sec
          Start 7540: mpi/parallel_block_vector_01.mpirun=10.release
9622/9934 Test #7539: mpi/parallel_block_vector_01.mpirun=10.debug ....................................   Passed    2.60 sec
          Start 7545: mpi/parallel_block_vector_02.mpirun=10.debug
9623/9934 Test #7524: mpi/p4est_save_01.mpirun=4.release ..............................................   Passed    2.78 sec
          Start 7523: mpi/p4est_save_01.mpirun=4.debug
9624/9934 Test #7540: mpi/parallel_block_vector_01.mpirun=10.release ..................................   Passed    2.87 sec
          Start 7546: mpi/parallel_block_vector_02.mpirun=10.release
9625/9934 Test #7545: mpi/parallel_block_vector_02.mpirun=10.debug ....................................   Passed    2.95 sec
          Start 7551: mpi/parallel_block_vector_04.mpirun=10.debug
9626/9934 Test #7523: mpi/p4est_save_01.mpirun=4.debug ................................................   Passed    3.04 sec
          Start 7541: mpi/parallel_block_vector_01.mpirun=4.debug
9627/9934 Test #7546: mpi/parallel_block_vector_02.mpirun=10.release ..................................   Passed    3.03 sec
          Start 7552: mpi/parallel_block_vector_04.mpirun=10.release
9628/9934 Test #7551: mpi/parallel_block_vector_04.mpirun=10.debug ....................................   Passed    2.89 sec
          Start 7583: mpi/parallel_partitioner_01.mpirun=10.debug
9629/9934 Test #7541: mpi/parallel_block_vector_01.mpirun=4.debug .....................................   Passed    3.07 sec
          Start 7542: mpi/parallel_block_vector_01.mpirun=4.release
9630/9934 Test #7552: mpi/parallel_block_vector_04.mpirun=10.release ..................................   Passed    2.85 sec
          Start 7584: mpi/parallel_partitioner_01.mpirun=10.release
9631/9934 Test #7542: mpi/parallel_block_vector_01.mpirun=4.release ...................................   Passed    2.86 sec
          Start 7547: mpi/parallel_block_vector_02.mpirun=4.debug
9632/9934 Test #7547: mpi/parallel_block_vector_02.mpirun=4.debug .....................................   Passed    2.86 sec
          Start 7548: mpi/parallel_block_vector_02.mpirun=4.release
9633/9934 Test #7548: mpi/parallel_block_vector_02.mpirun=4.release ...................................   Passed    2.65 sec
          Start 7553: mpi/parallel_block_vector_04.mpirun=4.debug
9634/9934 Test #7584: mpi/parallel_partitioner_01.mpirun=10.release ...................................   Passed    9.42 sec
          Start 7587: mpi/parallel_partitioner_02.mpirun=10.debug
9635/9934 Test #7583: mpi/parallel_partitioner_01.mpirun=10.debug .....................................   Passed   10.91 sec
          Start 7588: mpi/parallel_partitioner_02.mpirun=10.release
9636/9934 Test #7553: mpi/parallel_block_vector_04.mpirun=4.debug .....................................   Passed    2.63 sec
          Start 7554: mpi/parallel_block_vector_04.mpirun=4.release
9637/9934 Test #7554: mpi/parallel_block_vector_04.mpirun=4.release ...................................   Passed    2.76 sec
          Start 7585: mpi/parallel_partitioner_01.mpirun=4.debug
9638/9934 Test #7585: mpi/parallel_partitioner_01.mpirun=4.debug ......................................   Passed    2.66 sec
          Start 7586: mpi/parallel_partitioner_01.mpirun=4.release
9639/9934 Test #7586: mpi/parallel_partitioner_01.mpirun=4.release ....................................   Passed    2.59 sec
9640/9934 Test #7588: mpi/parallel_partitioner_02.mpirun=10.release ...................................   Passed    8.59 sec
          Start 7591: mpi/parallel_partitioner_03.mpirun=10.debug
          Start 7590: mpi/parallel_partitioner_02.mpirun=4.release
9641/9934 Test #7587: mpi/parallel_partitioner_02.mpirun=10.debug .....................................   Passed    9.77 sec
          Start 7592: mpi/parallel_partitioner_03.mpirun=10.release
9642/9934 Test #7590: mpi/parallel_partitioner_02.mpirun=4.release ....................................   Passed    2.88 sec
          Start 7589: mpi/parallel_partitioner_02.mpirun=4.debug
9643/9934 Test #7589: mpi/parallel_partitioner_02.mpirun=4.debug ......................................   Passed    2.84 sec
9644/9934 Test #7591: mpi/parallel_partitioner_03.mpirun=10.debug .....................................   Passed    9.76 sec
          Start 7597: mpi/parallel_partitioner_04.mpirun=10.debug
          Start 7593: mpi/parallel_partitioner_03.mpirun=4.debug
9645/9934 Test #7592: mpi/parallel_partitioner_03.mpirun=10.release ...................................   Passed    9.18 sec
          Start 7598: mpi/parallel_partitioner_04.mpirun=10.release
9646/9934 Test #7593: mpi/parallel_partitioner_03.mpirun=4.debug ......................................   Passed    2.94 sec
          Start 7594: mpi/parallel_partitioner_03.mpirun=4.release
9647/9934 Test #7594: mpi/parallel_partitioner_03.mpirun=4.release ....................................   Passed    2.82 sec
9648/9934 Test #7598: mpi/parallel_partitioner_04.mpirun=10.release ...................................   Passed    8.87 sec
          Start 7609: mpi/parallel_vector_01.mpirun=10.debug
          Start 7600: mpi/parallel_partitioner_04.mpirun=4.release
9649/9934 Test #7597: mpi/parallel_partitioner_04.mpirun=10.debug .....................................   Passed    9.96 sec
          Start 7610: mpi/parallel_vector_01.mpirun=10.release
9650/9934 Test #7600: mpi/parallel_partitioner_04.mpirun=4.release ....................................   Passed    2.61 sec
          Start 7599: mpi/parallel_partitioner_04.mpirun=4.debug
9651/9934 Test #7599: mpi/parallel_partitioner_04.mpirun=4.debug ......................................   Passed    2.70 sec
9652/9934 Test #7610: mpi/parallel_vector_01.mpirun=10.release ........................................   Passed    8.48 sec
          Start 7613: mpi/parallel_vector_02.mpirun=10.debug
          Start 7612: mpi/parallel_vector_01.mpirun=4.release
9653/9934 Test #7609: mpi/parallel_vector_01.mpirun=10.debug ..........................................   Passed   10.01 sec
          Start 7614: mpi/parallel_vector_02.mpirun=10.release
9654/9934 Test #7612: mpi/parallel_vector_01.mpirun=4.release .........................................   Passed    2.62 sec
          Start 7611: mpi/parallel_vector_01.mpirun=4.debug
9655/9934 Test #7611: mpi/parallel_vector_01.mpirun=4.debug ...........................................   Passed    3.02 sec
9656/9934 Test #7614: mpi/parallel_vector_02.mpirun=10.release ........................................   Passed    9.44 sec
          Start 7617: mpi/parallel_vector_03.mpirun=10.debug
          Start 7616: mpi/parallel_vector_02.mpirun=4.release
9657/9934 Test #7613: mpi/parallel_vector_02.mpirun=10.debug ..........................................   Passed   10.60 sec
          Start 7618: mpi/parallel_vector_03.mpirun=10.release
9658/9934 Test #7616: mpi/parallel_vector_02.mpirun=4.release .........................................   Passed    2.71 sec
          Start 7615: mpi/parallel_vector_02.mpirun=4.debug
9659/9934 Test #7615: mpi/parallel_vector_02.mpirun=4.debug ...........................................   Passed    2.66 sec
9660/9934 Test #7618: mpi/parallel_vector_03.mpirun=10.release ........................................   Passed    9.31 sec
          Start 7623: mpi/parallel_vector_04.mpirun=10.debug
          Start 7620: mpi/parallel_vector_03.mpirun=4.release
9661/9934 Test #7617: mpi/parallel_vector_03.mpirun=10.debug ..........................................   Passed   11.14 sec
          Start 7624: mpi/parallel_vector_04.mpirun=10.release
9662/9934 Test #7620: mpi/parallel_vector_03.mpirun=4.release .........................................   Passed    2.95 sec
          Start 7619: mpi/parallel_vector_03.mpirun=4.debug
9663/9934 Test #7619: mpi/parallel_vector_03.mpirun=4.debug ...........................................   Passed    2.89 sec
9664/9934 Test #7623: mpi/parallel_vector_04.mpirun=10.debug ..........................................   Passed   10.27 sec
          Start 7627: mpi/parallel_vector_05.mpirun=10.debug
          Start 7625: mpi/parallel_vector_04.mpirun=4.debug
9665/9934 Test #7624: mpi/parallel_vector_04.mpirun=10.release ........................................   Passed    8.66 sec
          Start 7628: mpi/parallel_vector_05.mpirun=10.release
9666/9934 Test #7625: mpi/parallel_vector_04.mpirun=4.debug ...........................................   Passed    2.72 sec
          Start 7626: mpi/parallel_vector_04.mpirun=4.release
9667/9934 Test #7626: mpi/parallel_vector_04.mpirun=4.release .........................................   Passed    2.80 sec
9668/9934 Test #7628: mpi/parallel_vector_05.mpirun=10.release ........................................   Passed    8.53 sec
          Start 7633: mpi/parallel_vector_06.mpirun=10.debug
          Start 7630: mpi/parallel_vector_05.mpirun=4.release
9669/9934 Test #7627: mpi/parallel_vector_05.mpirun=10.debug ..........................................   Passed    9.97 sec
          Start 7634: mpi/parallel_vector_06.mpirun=10.release
9670/9934 Test #7633: mpi/parallel_vector_06.mpirun=10.debug ..........................................   Passed    2.99 sec
          Start 7637: mpi/parallel_vector_07.mpirun=10.debug
9671/9934 Test #7630: mpi/parallel_vector_05.mpirun=4.release .........................................   Passed    3.00 sec
          Start 7629: mpi/parallel_vector_05.mpirun=4.debug
9672/9934 Test #7634: mpi/parallel_vector_06.mpirun=10.release ........................................   Passed    2.95 sec
          Start 7638: mpi/parallel_vector_07.mpirun=10.release
9673/9934 Test #7629: mpi/parallel_vector_05.mpirun=4.debug ...........................................   Passed    2.85 sec
          Start 7635: mpi/parallel_vector_06.mpirun=4.debug
9674/9934 Test #7635: mpi/parallel_vector_06.mpirun=4.debug ...........................................   Passed    2.90 sec
          Start 7636: mpi/parallel_vector_06.mpirun=4.release
9675/9934 Test #7636: mpi/parallel_vector_06.mpirun=4.release .........................................   Passed    2.80 sec
9676/9934 Test #7637: mpi/parallel_vector_07.mpirun=10.debug ..........................................   Passed    9.88 sec
          Start 7641: mpi/parallel_vector_08.mpirun=10.debug
          Start 7639: mpi/parallel_vector_07.mpirun=4.debug
9677/9934 Test #7638: mpi/parallel_vector_07.mpirun=10.release ........................................   Passed    9.58 sec
          Start 7642: mpi/parallel_vector_08.mpirun=10.release
9678/9934 Test #7639: mpi/parallel_vector_07.mpirun=4.debug ...........................................   Passed    2.89 sec
          Start 7640: mpi/parallel_vector_07.mpirun=4.release
9679/9934 Test #7640: mpi/parallel_vector_07.mpirun=4.release .........................................   Passed    2.85 sec
9680/9934 Test #7641: mpi/parallel_vector_08.mpirun=10.debug ..........................................   Passed    9.90 sec
          Start 7645: mpi/parallel_vector_09.mpirun=10.debug
          Start 7643: mpi/parallel_vector_08.mpirun=4.debug
9681/9934 Test #7642: mpi/parallel_vector_08.mpirun=10.release ........................................   Passed    9.55 sec
          Start 7646: mpi/parallel_vector_09.mpirun=10.release
9682/9934 Test #7643: mpi/parallel_vector_08.mpirun=4.debug ...........................................   Passed    2.73 sec
          Start 7644: mpi/parallel_vector_08.mpirun=4.release
9683/9934 Test #7644: mpi/parallel_vector_08.mpirun=4.release .........................................   Passed    2.60 sec
9684/9934 Test #7646: mpi/parallel_vector_09.mpirun=10.release ........................................   Passed    8.61 sec
          Start 7649: mpi/parallel_vector_10.mpirun=10.debug
          Start 7648: mpi/parallel_vector_09.mpirun=4.release
9685/9934 Test #7645: mpi/parallel_vector_09.mpirun=10.debug ..........................................   Passed    9.57 sec
          Start 7650: mpi/parallel_vector_10.mpirun=10.release
9686/9934 Test #7648: mpi/parallel_vector_09.mpirun=4.release .........................................   Passed    2.87 sec
          Start 7647: mpi/parallel_vector_09.mpirun=4.debug
9687/9934 Test #7647: mpi/parallel_vector_09.mpirun=4.debug ...........................................   Passed    2.58 sec
9688/9934 Test #7650: mpi/parallel_vector_10.mpirun=10.release ........................................   Passed    8.65 sec
          Start 7653: mpi/parallel_vector_11.mpirun=10.debug
          Start 7652: mpi/parallel_vector_10.mpirun=4.release
9689/9934 Test #7649: mpi/parallel_vector_10.mpirun=10.debug ..........................................   Passed    9.94 sec
          Start 7654: mpi/parallel_vector_11.mpirun=10.release
9690/9934 Test #7652: mpi/parallel_vector_10.mpirun=4.release .........................................   Passed    2.82 sec
          Start 7651: mpi/parallel_vector_10.mpirun=4.debug
9691/9934 Test #7651: mpi/parallel_vector_10.mpirun=4.debug ...........................................   Passed    2.86 sec
9692/9934 Test #7653: mpi/parallel_vector_11.mpirun=10.debug ..........................................   Passed   10.08 sec
          Start 7659: mpi/parallel_vector_12.mpirun=10.debug
          Start 7655: mpi/parallel_vector_11.mpirun=4.debug
9693/9934 Test #7654: mpi/parallel_vector_11.mpirun=10.release ........................................   Passed    9.59 sec
          Start 7660: mpi/parallel_vector_12.mpirun=10.release
9694/9934 Test #7659: mpi/parallel_vector_12.mpirun=10.debug ..........................................   Passed    2.85 sec
          Start 7663: mpi/parallel_vector_13.mpirun=10.debug
9695/9934 Test #7655: mpi/parallel_vector_11.mpirun=4.debug ...........................................   Passed    2.95 sec
          Start 7656: mpi/parallel_vector_11.mpirun=4.release
9696/9934 Test #7660: mpi/parallel_vector_12.mpirun=10.release ........................................   Passed    3.01 sec
          Start 7664: mpi/parallel_vector_13.mpirun=10.release
9697/9934 Test #7656: mpi/parallel_vector_11.mpirun=4.release .........................................   Passed    2.85 sec
          Start 7661: mpi/parallel_vector_12.mpirun=4.debug
9698/9934 Test #7661: mpi/parallel_vector_12.mpirun=4.debug ...........................................   Passed    2.93 sec
          Start 7662: mpi/parallel_vector_12.mpirun=4.release
9699/9934 Test #7662: mpi/parallel_vector_12.mpirun=4.release .........................................   Passed    2.89 sec
9700/9934 Test #7664: mpi/parallel_vector_13.mpirun=10.release ........................................   Passed    9.14 sec
          Start 7679: mpi/parallel_vector_18.mpirun=10.debug
          Start 7666: mpi/parallel_vector_13.mpirun=4.release
9701/9934 Test #7663: mpi/parallel_vector_13.mpirun=10.debug ..........................................   Passed   10.64 sec
          Start 7680: mpi/parallel_vector_18.mpirun=10.release
9702/9934 Test #7666: mpi/parallel_vector_13.mpirun=4.release .........................................   Passed    2.98 sec
          Start 7665: mpi/parallel_vector_13.mpirun=4.debug
9703/9934 Test #7679: mpi/parallel_vector_18.mpirun=10.debug ..........................................   Passed    2.99 sec
          Start 7685: mpi/parallel_vector_19.mpirun=10.debug
9704/9934 Test #7680: mpi/parallel_vector_18.mpirun=10.release ........................................   Passed    2.97 sec
          Start 7686: mpi/parallel_vector_19.mpirun=10.release
9705/9934 Test #7665: mpi/parallel_vector_13.mpirun=4.debug ...........................................   Passed    2.96 sec
          Start 7681: mpi/parallel_vector_18.mpirun=4.debug
9706/9934 Test #7685: mpi/parallel_vector_19.mpirun=10.debug ..........................................   Passed    3.04 sec
          Start 7693: mpi/parallel_vector_22.mpirun=10.debug
9707/9934 Test #7686: mpi/parallel_vector_19.mpirun=10.release ........................................   Passed    2.99 sec
          Start 7694: mpi/parallel_vector_22.mpirun=10.release
9708/9934 Test #7681: mpi/parallel_vector_18.mpirun=4.debug ...........................................   Passed    2.94 sec
          Start 7682: mpi/parallel_vector_18.mpirun=4.release
9709/9934 Test #7682: mpi/parallel_vector_18.mpirun=4.release .........................................   Passed    2.59 sec
          Start 7687: mpi/parallel_vector_19.mpirun=4.debug
9710/9934 Test #7687: mpi/parallel_vector_19.mpirun=4.debug ...........................................   Passed    2.86 sec
          Start 7688: mpi/parallel_vector_19.mpirun=4.release
9711/9934 Test #7694: mpi/parallel_vector_22.mpirun=10.release ........................................   Passed    9.03 sec
          Start 7749: mpi/refine_and_coarsen_fixed_fraction_01.mpirun=10.debug
9712/9934 Test #7693: mpi/parallel_vector_22.mpirun=10.debug ..........................................   Passed    9.90 sec
          Start 7750: mpi/refine_and_coarsen_fixed_fraction_01.mpirun=10.release
9713/9934 Test #7688: mpi/parallel_vector_19.mpirun=4.release .........................................   Passed    2.93 sec
          Start 7695: mpi/parallel_vector_22.mpirun=4.debug
9714/9934 Test #7695: mpi/parallel_vector_22.mpirun=4.debug ...........................................   Passed    3.09 sec
          Start 7696: mpi/parallel_vector_22.mpirun=4.release
9715/9934 Test #7696: mpi/parallel_vector_22.mpirun=4.release .........................................   Passed    2.81 sec
9716/9934 Test #7750: mpi/refine_and_coarsen_fixed_fraction_01.mpirun=10.release ......................   Passed   11.21 sec
          Start 7753: mpi/refine_and_coarsen_fixed_fraction_02.mpirun=10.debug
          Start 7752: mpi/refine_and_coarsen_fixed_fraction_01.mpirun=4.release
9717/9934 Test #7749: mpi/refine_and_coarsen_fixed_fraction_01.mpirun=10.debug ........................   Passed   13.39 sec
          Start 7754: mpi/refine_and_coarsen_fixed_fraction_02.mpirun=10.release
9718/9934 Test #7752: mpi/refine_and_coarsen_fixed_fraction_01.mpirun=4.release .......................   Passed    2.67 sec
          Start 7751: mpi/refine_and_coarsen_fixed_fraction_01.mpirun=4.debug
9719/9934 Test #7751: mpi/refine_and_coarsen_fixed_fraction_01.mpirun=4.debug .........................   Passed    2.92 sec
9720/9934 Test #7753: mpi/refine_and_coarsen_fixed_fraction_02.mpirun=10.debug ........................   Passed   11.80 sec
          Start 7757: mpi/refine_and_coarsen_fixed_fraction_03.mpirun=10.debug
          Start 7755: mpi/refine_and_coarsen_fixed_fraction_02.mpirun=4.debug
9721/9934 Test #7754: mpi/refine_and_coarsen_fixed_fraction_02.mpirun=10.release ......................   Passed   10.11 sec
          Start 7758: mpi/refine_and_coarsen_fixed_fraction_03.mpirun=10.release
9722/9934 Test #7755: mpi/refine_and_coarsen_fixed_fraction_02.mpirun=4.debug .........................   Passed    2.98 sec
          Start 7756: mpi/refine_and_coarsen_fixed_fraction_02.mpirun=4.release
9723/9934 Test #7756: mpi/refine_and_coarsen_fixed_fraction_02.mpirun=4.release .......................   Passed    2.82 sec
9724/9934 Test #7758: mpi/refine_and_coarsen_fixed_fraction_03.mpirun=10.release ......................   Passed   10.61 sec
          Start 7769: mpi/refine_and_coarsen_fixed_number_01.mpirun=10.debug
          Start 7760: mpi/refine_and_coarsen_fixed_fraction_03.mpirun=4.release
9725/9934 Test #7757: mpi/refine_and_coarsen_fixed_fraction_03.mpirun=10.debug ........................   Passed   13.46 sec
          Start 7770: mpi/refine_and_coarsen_fixed_number_01.mpirun=10.release
9726/9934 Test #7760: mpi/refine_and_coarsen_fixed_fraction_03.mpirun=4.release .......................   Passed    2.94 sec
          Start 7759: mpi/refine_and_coarsen_fixed_fraction_03.mpirun=4.debug
9727/9934 Test #7759: mpi/refine_and_coarsen_fixed_fraction_03.mpirun=4.debug .........................   Passed    2.89 sec
9728/9934 Test #7769: mpi/refine_and_coarsen_fixed_number_01.mpirun=10.debug ..........................   Passed   12.27 sec
          Start 7773: mpi/refine_and_coarsen_fixed_number_02.mpirun=10.debug
          Start 7771: mpi/refine_and_coarsen_fixed_number_01.mpirun=4.debug
9729/9934 Test #7770: mpi/refine_and_coarsen_fixed_number_01.mpirun=10.release ........................   Passed   10.66 sec
          Start 7774: mpi/refine_and_coarsen_fixed_number_02.mpirun=10.release
9730/9934 Test #7771: mpi/refine_and_coarsen_fixed_number_01.mpirun=4.debug ...........................   Passed    2.78 sec
          Start 7772: mpi/refine_and_coarsen_fixed_number_01.mpirun=4.release
9731/9934 Test #7772: mpi/refine_and_coarsen_fixed_number_01.mpirun=4.release .........................   Passed    2.95 sec
9732/9934 Test #7774: mpi/refine_and_coarsen_fixed_number_02.mpirun=10.release ........................   Passed   10.25 sec
          Start 7777: mpi/refine_and_coarsen_fixed_number_03.mpirun=10.debug
          Start 7776: mpi/refine_and_coarsen_fixed_number_02.mpirun=4.release
9733/9934 Test #7773: mpi/refine_and_coarsen_fixed_number_02.mpirun=10.debug ..........................   Passed   12.87 sec
          Start 7778: mpi/refine_and_coarsen_fixed_number_03.mpirun=10.release
9734/9934 Test #7776: mpi/refine_and_coarsen_fixed_number_02.mpirun=4.release .........................   Passed    2.91 sec
          Start 7775: mpi/refine_and_coarsen_fixed_number_02.mpirun=4.debug
9735/9934 Test #7775: mpi/refine_and_coarsen_fixed_number_02.mpirun=4.debug ...........................   Passed    2.80 sec
9736/9934 Test #7778: mpi/refine_and_coarsen_fixed_number_03.mpirun=10.release ........................   Passed   10.24 sec
          Start 7787: mpi/refine_and_coarsen_fixed_number_06.mpirun=10.debug
          Start 7780: mpi/refine_and_coarsen_fixed_number_03.mpirun=4.release
9737/9934 Test #7777: mpi/refine_and_coarsen_fixed_number_03.mpirun=10.debug ..........................   Passed   12.86 sec
          Start 7788: mpi/refine_and_coarsen_fixed_number_06.mpirun=10.release
9738/9934 Test #7780: mpi/refine_and_coarsen_fixed_number_03.mpirun=4.release .........................   Passed    2.87 sec
          Start 7779: mpi/refine_and_coarsen_fixed_number_03.mpirun=4.debug
9739/9934 Test #7787: mpi/refine_and_coarsen_fixed_number_06.mpirun=10.debug ..........................   Passed    2.97 sec
          Start 7793: mpi/refine_and_coarsen_fixed_number_07.mpirun=10.debug
9740/9934 Test #7788: mpi/refine_and_coarsen_fixed_number_06.mpirun=10.release ........................   Passed    3.10 sec
          Start 7794: mpi/refine_and_coarsen_fixed_number_07.mpirun=10.release
9741/9934 Test #7779: mpi/refine_and_coarsen_fixed_number_03.mpirun=4.debug ...........................   Passed    3.20 sec
          Start 7789: mpi/refine_and_coarsen_fixed_number_06.mpirun=4.debug
9742/9934 Test #7793: mpi/refine_and_coarsen_fixed_number_07.mpirun=10.debug ..........................   Passed    3.61 sec
          Start 7819: mpi/renumber_z_order_01.mpirun=10.debug
9743/9934 Test #7794: mpi/refine_and_coarsen_fixed_number_07.mpirun=10.release ........................   Passed    3.10 sec
          Start 7820: mpi/renumber_z_order_01.mpirun=10.release
9744/9934 Test #7789: mpi/refine_and_coarsen_fixed_number_06.mpirun=4.debug ...........................   Passed    2.85 sec
          Start 7790: mpi/refine_and_coarsen_fixed_number_06.mpirun=4.release
9745/9934 Test #7819: mpi/renumber_z_order_01.mpirun=10.debug .........................................   Passed    3.18 sec
          Start 7825: mpi/renumber_z_order_02.mpirun=10.debug
9746/9934 Test #7820: mpi/renumber_z_order_01.mpirun=10.release .......................................   Passed    3.03 sec
          Start 7826: mpi/renumber_z_order_02.mpirun=10.release
9747/9934 Test #7790: mpi/refine_and_coarsen_fixed_number_06.mpirun=4.release .........................   Passed    3.07 sec
          Start 7795: mpi/refine_and_coarsen_fixed_number_07.mpirun=4.debug
9748/9934 Test #7825: mpi/renumber_z_order_02.mpirun=10.debug .........................................   Passed    3.12 sec
          Start 7879: mpi/tria_ghost_owners_02.mpirun=11.debug
9749/9934 Test #7826: mpi/renumber_z_order_02.mpirun=10.release .......................................   Passed    3.06 sec
          Start 7880: mpi/tria_ghost_owners_02.mpirun=11.release
9750/9934 Test #7795: mpi/refine_and_coarsen_fixed_number_07.mpirun=4.debug ...........................   Passed    3.33 sec
          Start 7796: mpi/refine_and_coarsen_fixed_number_07.mpirun=4.release
9751/9934 Test #7796: mpi/refine_and_coarsen_fixed_number_07.mpirun=4.release .........................   Passed    2.91 sec
          Start 7821: mpi/renumber_z_order_01.mpirun=4.debug
9752/9934 Test #7821: mpi/renumber_z_order_01.mpirun=4.debug ..........................................   Passed    2.73 sec
          Start 7822: mpi/renumber_z_order_01.mpirun=4.release
9753/9934 Test #7822: mpi/renumber_z_order_01.mpirun=4.release ........................................   Passed    2.80 sec
          Start 7827: mpi/renumber_z_order_02.mpirun=4.debug
9754/9934 Test #7880: mpi/tria_ghost_owners_02.mpirun=11.release ......................................   Passed   11.80 sec
          Start 7885: mpi/tria_signals_01.mpirun=11.debug
9755/9934 Test #7827: mpi/renumber_z_order_02.mpirun=4.debug ..........................................   Passed    3.01 sec
          Start 7828: mpi/renumber_z_order_02.mpirun=4.release
9756/9934 Test #7885: mpi/tria_signals_01.mpirun=11.debug .............................................   Passed    2.86 sec
          Start 7886: mpi/tria_signals_01.mpirun=11.release
9757/9934 Test #7828: mpi/renumber_z_order_02.mpirun=4.release ........................................   Passed    2.62 sec
          Start 7882: mpi/tria_ghost_owners_02.mpirun=5.release
9758/9934 Test #7886: mpi/tria_signals_01.mpirun=11.release ...........................................   Passed    2.57 sec
          Start 7891: mpi/tria_signals_02.mpirun=11.debug
9759/9934 Test #7882: mpi/tria_ghost_owners_02.mpirun=5.release .......................................   Passed    2.79 sec
          Start 7887: mpi/tria_signals_01.mpirun=4.debug
9760/9934 Test #7879: mpi/tria_ghost_owners_02.mpirun=11.debug ........................................   Passed   19.33 sec
          Start 7892: mpi/tria_signals_02.mpirun=11.release
9761/9934 Test #7891: mpi/tria_signals_02.mpirun=11.debug .............................................   Passed    2.61 sec
          Start 7897: mpi/tria_signals_03.mpirun=11.debug
9762/9934 Test #7892: mpi/tria_signals_02.mpirun=11.release ...........................................   Passed    2.80 sec
          Start 7898: mpi/tria_signals_03.mpirun=11.release
9763/9934 Test #7887: mpi/tria_signals_01.mpirun=4.debug ..............................................   Passed    2.88 sec
          Start 7881: mpi/tria_ghost_owners_02.mpirun=5.debug
9764/9934 Test #7898: mpi/tria_signals_03.mpirun=11.release ...........................................   Passed    3.15 sec
          Start 7903: mpi/tria_signals_04.mpirun=11.debug
9765/9934 Test #7881: mpi/tria_ghost_owners_02.mpirun=5.debug .........................................   Passed   12.01 sec
          Start 7888: mpi/tria_signals_01.mpirun=4.release
9766/9934 Test #7888: mpi/tria_signals_01.mpirun=4.release ............................................   Passed    2.55 sec
          Start 7893: mpi/tria_signals_02.mpirun=4.debug
9767/9934 Test #7893: mpi/tria_signals_02.mpirun=4.debug ..............................................   Passed    2.67 sec
          Start 7894: mpi/tria_signals_02.mpirun=4.release
9768/9934 Test #7897: mpi/tria_signals_03.mpirun=11.debug .............................................   Passed   20.22 sec
          Start 7904: mpi/tria_signals_04.mpirun=11.release
9769/9934 Test #7894: mpi/tria_signals_02.mpirun=4.release ............................................   Passed    2.66 sec
          Start 7899: mpi/tria_signals_03.mpirun=4.debug
9770/9934 Test #7904: mpi/tria_signals_04.mpirun=11.release ...........................................   Passed    2.89 sec
          Start 7909: mpi/tria_signals_05.mpirun=11.debug
9771/9934 Test #7903: mpi/tria_signals_04.mpirun=11.debug .............................................   Passed   18.11 sec
          Start 7910: mpi/tria_signals_05.mpirun=11.release
9772/9934 Test #7910: mpi/tria_signals_05.mpirun=11.release ...........................................   Passed    2.73 sec
          Start 7915: mpi/trilinos_01.mpirun=10.debug
9773/9934 Test #7909: mpi/tria_signals_05.mpirun=11.debug .............................................   Passed    3.08 sec
          Start 7916: mpi/trilinos_01.mpirun=10.release
9774/9934 Test #7916: mpi/trilinos_01.mpirun=10.release ...............................................   Passed   11.92 sec
          Start 7919: mpi/trilinos_02.mpirun=10.debug
9775/9934 Test #7915: mpi/trilinos_01.mpirun=10.debug .................................................   Passed   12.97 sec
          Start 7920: mpi/trilinos_02.mpirun=10.release
9776/9934 Test #7920: mpi/trilinos_02.mpirun=10.release ...............................................   Passed    8.83 sec
          Start 7959: mpi/trilinos_ghost_01.mpirun=10.debug
9777/9934 Test #7919: mpi/trilinos_02.mpirun=10.debug .................................................   Passed   10.02 sec
          Start 7960: mpi/trilinos_ghost_01.mpirun=10.release
9778/9934 Test #7899: mpi/tria_signals_03.mpirun=4.debug ..............................................   Passed   32.21 sec
          Start 7900: mpi/tria_signals_03.mpirun=4.release
9779/9934 Test #7960: mpi/trilinos_ghost_01.mpirun=10.release .........................................   Passed    8.77 sec
          Start 7963: mpi/trilinos_ghost_02.mpirun=10.debug
9780/9934 Test #7959: mpi/trilinos_ghost_01.mpirun=10.debug ...........................................   Passed    9.99 sec
          Start 7964: mpi/trilinos_ghost_02.mpirun=10.release
9781/9934 Test #7900: mpi/tria_signals_03.mpirun=4.release ............................................   Passed    3.70 sec
          Start 7905: mpi/tria_signals_04.mpirun=4.debug
9782/9934 Test #7964: mpi/trilinos_ghost_02.mpirun=10.release .........................................   Passed    9.01 sec
          Start 7967: mpi/trilinos_ghost_03.mpirun=10.debug
9783/9934 Test #7963: mpi/trilinos_ghost_02.mpirun=10.debug ...........................................   Passed   10.10 sec
          Start 7969: mpi/trilinos_ghost_03_linfty.mpirun=10.debug
9784/9934 Test #7967: mpi/trilinos_ghost_03.mpirun=10.debug ...........................................   Passed    9.94 sec
          Start 7971: mpi/trilinos_ghost_05.mpirun=10.debug
9785/9934 Test #7969: mpi/trilinos_ghost_03_linfty.mpirun=10.debug ....................................   Passed   10.03 sec
          Start 7972: mpi/trilinos_ghost_05.mpirun=10.release
9786/9934 Test #7972: mpi/trilinos_ghost_05.mpirun=10.release .........................................   Passed    8.96 sec
          Start 1449: base/mpi_gather_01.mpirun=6.release
          Start 7906: mpi/tria_signals_04.mpirun=4.release
9787/9934 Test #7971: mpi/trilinos_ghost_05.mpirun=10.debug ...........................................   Passed   10.02 sec
          Start 1454: base/mpi_some_to_some_01.mpirun=6.debug
          Start 7911: mpi/tria_signals_05.mpirun=4.debug
9788/9934 Test #1449: base/mpi_gather_01.mpirun=6.release .............................................   Passed    2.38 sec
          Start 1455: base/mpi_some_to_some_01.mpirun=6.release
9789/9934 Test #1454: base/mpi_some_to_some_01.mpirun=6.debug .........................................   Passed    2.35 sec
          Start 5689: lac/diagonal_matrix_02.mpirun=7.debug
9790/9934 Test #7906: mpi/tria_signals_04.mpirun=4.release ............................................   Passed    3.57 sec
          Start 7912: mpi/tria_signals_05.mpirun=4.release
9791/9934 Test #7911: mpi/tria_signals_05.mpirun=4.debug ..............................................   Passed    2.89 sec
          Start 7917: mpi/trilinos_01.mpirun=4.debug
9792/9934 Test #1455: base/mpi_some_to_some_01.mpirun=6.release .......................................   Passed    2.32 sec
          Start 5690: lac/diagonal_matrix_02.mpirun=7.release
9793/9934 Test #5689: lac/diagonal_matrix_02.mpirun=7.debug ...........................................   Passed    1.66 sec
          Start 6470: matrix_free/cell_categorization.mpirun=7.debug
9794/9934 Test #5690: lac/diagonal_matrix_02.mpirun=7.release .........................................   Passed    1.39 sec
          Start 6471: matrix_free/cell_categorization.mpirun=7.release
9795/9934 Test #7912: mpi/tria_signals_05.mpirun=4.release ............................................   Passed    2.69 sec
          Start 7918: mpi/trilinos_01.mpirun=4.release
9796/9934 Test #6470: matrix_free/cell_categorization.mpirun=7.debug ..................................   Passed    1.55 sec
          Start 6476: matrix_free/cell_categorization_02.mpirun=7.debug
9797/9934 Test #6471: matrix_free/cell_categorization.mpirun=7.release ................................   Passed    1.19 sec
          Start 6477: matrix_free/cell_categorization_02.mpirun=7.release
9798/9934 Test #6477: matrix_free/cell_categorization_02.mpirun=7.release .............................   Passed    1.35 sec
          Start 6492: matrix_free/dg_pbc_01.mpirun=7.debug
9799/9934 Test #7917: mpi/trilinos_01.mpirun=4.debug ..................................................   Passed    5.60 sec
          Start 7921: mpi/trilinos_02.mpirun=4.debug
9800/9934 Test #6492: matrix_free/dg_pbc_01.mpirun=7.debug ............................................   Passed    1.27 sec
          Start 6493: matrix_free/dg_pbc_01.mpirun=7.release
9801/9934 Test #6493: matrix_free/dg_pbc_01.mpirun=7.release ..........................................   Passed    1.06 sec
          Start 6496: matrix_free/dg_pbc_02.mpirun=7.debug
9802/9934 Test #7905: mpi/tria_signals_04.mpirun=4.debug ..............................................   Passed   39.27 sec
          Start 7922: mpi/trilinos_02.mpirun=4.release
9803/9934 Test #7918: mpi/trilinos_01.mpirun=4.release ................................................   Passed    5.56 sec
          Start 7961: mpi/trilinos_ghost_01.mpirun=4.debug
9804/9934 Test #7921: mpi/trilinos_02.mpirun=4.debug ..................................................   Passed    2.63 sec
          Start 7962: mpi/trilinos_ghost_01.mpirun=4.release
9805/9934 Test #6496: matrix_free/dg_pbc_02.mpirun=7.debug ............................................   Passed    1.51 sec
          Start 6497: matrix_free/dg_pbc_02.mpirun=7.release
9806/9934 Test #6497: matrix_free/dg_pbc_02.mpirun=7.release ..........................................   Passed    1.13 sec
          Start 6789: matrix_free/parallel_multigrid.mpirun=7.debug
9807/9934 Test #7922: mpi/trilinos_02.mpirun=4.release ................................................   Passed    2.52 sec
          Start 7965: mpi/trilinos_ghost_02.mpirun=4.debug
9808/9934 Test #7961: mpi/trilinos_ghost_01.mpirun=4.debug ............................................   Passed    2.58 sec
          Start 7966: mpi/trilinos_ghost_02.mpirun=4.release
9809/9934 Test #7962: mpi/trilinos_ghost_01.mpirun=4.release ..........................................   Passed    2.51 sec
          Start 7968: mpi/trilinos_ghost_03.mpirun=4.debug
9810/9934 Test #6476: matrix_free/cell_categorization_02.mpirun=7.debug ...............................   Passed    8.41 sec
          Start 6790: matrix_free/parallel_multigrid.mpirun=7.release
9811/9934 Test #6790: matrix_free/parallel_multigrid.mpirun=7.release .................................   Passed    1.50 sec
          Start 6793: matrix_free/parallel_multigrid_02.mpirun=7.debug
9812/9934 Test #7965: mpi/trilinos_ghost_02.mpirun=4.debug ............................................   Passed    2.64 sec
          Start 7970: mpi/trilinos_ghost_03_linfty.mpirun=4.debug
9813/9934 Test #7966: mpi/trilinos_ghost_02.mpirun=4.release ..........................................   Passed    2.62 sec
          Start 7973: mpi/trilinos_ghost_05.mpirun=4.debug
9814/9934 Test #7968: mpi/trilinos_ghost_03.mpirun=4.debug ............................................   Passed    2.65 sec
          Start 7974: mpi/trilinos_ghost_05.mpirun=4.release
9815/9934 Test #7970: mpi/trilinos_ghost_03_linfty.mpirun=4.debug .....................................   Passed    2.67 sec
9816/9934 Test #6793: matrix_free/parallel_multigrid_02.mpirun=7.debug ................................   Passed    3.04 sec
          Start 6726: matrix_free/matrix_vector_faces_16.mpirun=11.debug
9817/9934 Test #7974: mpi/trilinos_ghost_05.mpirun=4.release ..........................................   Passed    2.49 sec
9818/9934 Test #7973: mpi/trilinos_ghost_05.mpirun=4.debug ............................................   Passed    2.64 sec
          Start 6794: matrix_free/parallel_multigrid_02.mpirun=7.release
9819/9934 Test #6794: matrix_free/parallel_multigrid_02.mpirun=7.release ..............................   Passed    1.07 sec
          Start 6797: matrix_free/parallel_multigrid_adaptive_01.mpirun=7.debug
9820/9934 Test #6789: matrix_free/parallel_multigrid.mpirun=7.debug ...................................   Passed   10.91 sec
          Start 6798: matrix_free/parallel_multigrid_adaptive_01.mpirun=7.release
9821/9934 Test #6798: matrix_free/parallel_multigrid_adaptive_01.mpirun=7.release .....................   Passed    1.59 sec
          Start 6801: matrix_free/parallel_multigrid_adaptive_02.mpirun=7.debug
9822/9934 Test #6726: matrix_free/matrix_vector_faces_16.mpirun=11.debug ..............................   Passed   18.44 sec
          Start 6727: matrix_free/matrix_vector_faces_16.mpirun=11.release
9823/9934 Test #6797: matrix_free/parallel_multigrid_adaptive_01.mpirun=7.debug .......................   Passed   17.31 sec
          Start 6802: matrix_free/parallel_multigrid_adaptive_02.mpirun=7.release
9824/9934 Test #6802: matrix_free/parallel_multigrid_adaptive_02.mpirun=7.release .....................   Passed    1.82 sec
          Start 6805: matrix_free/parallel_multigrid_adaptive_03.mpirun=7.debug
9825/9934 Test #6727: matrix_free/matrix_vector_faces_16.mpirun=11.release ............................   Passed   14.92 sec
          Start 6806: matrix_free/parallel_multigrid_adaptive_03.mpirun=7.release
          Start 6819: matrix_free/parallel_multigrid_mf.mpirun=7.debug
9826/9934 Test #6801: matrix_free/parallel_multigrid_adaptive_02.mpirun=7.debug .......................   Passed   26.94 sec
          Start 6820: matrix_free/parallel_multigrid_mf.mpirun=7.release
9827/9934 Test #6806: matrix_free/parallel_multigrid_adaptive_03.mpirun=7.release .....................   Passed    2.13 sec
          Start 7131: mpi/derivative_approximation_02.mpirun=7.debug
9828/9934 Test #6805: matrix_free/parallel_multigrid_adaptive_03.mpirun=7.debug .......................   Passed   15.95 sec
          Start 7132: mpi/derivative_approximation_02.mpirun=7.release
9829/9934 Test #7131: mpi/derivative_approximation_02.mpirun=7.debug ..................................   Passed    2.88 sec
          Start 7211: mpi/has_hanging_nodes.mpirun=7.debug
9830/9934 Test #7132: mpi/derivative_approximation_02.mpirun=7.release ................................   Passed    2.72 sec
          Start 7212: mpi/has_hanging_nodes.mpirun=7.release
9831/9934 Test #7211: mpi/has_hanging_nodes.mpirun=7.debug ............................................   Passed    3.62 sec
          Start 7271: mpi/hp_unify_dof_indices_08.mpirun=7.debug
9832/9934 Test #7212: mpi/has_hanging_nodes.mpirun=7.release ..........................................   Passed    2.75 sec
          Start 7272: mpi/hp_unify_dof_indices_08.mpirun=7.release
9833/9934 Test #7272: mpi/hp_unify_dof_indices_08.mpirun=7.release ....................................   Passed    4.59 sec
          Start 7357: mpi/mg_06.mpirun=7.debug
9834/9934 Test #7357: mpi/mg_06.mpirun=7.debug ........................................................   Passed   14.66 sec
          Start 7358: mpi/mg_06.mpirun=7.release
9835/9934 Test #6820: matrix_free/parallel_multigrid_mf.mpirun=7.release ..............................   Passed   34.06 sec
          Start 7361: mpi/mg_ghost_dofs_periodic_01.mpirun=7.debug
9836/9934 Test #6819: matrix_free/parallel_multigrid_mf.mpirun=7.debug ................................   Passed   35.79 sec
          Start 7362: mpi/mg_ghost_dofs_periodic_01.mpirun=7.release
9837/9934 Test #7361: mpi/mg_ghost_dofs_periodic_01.mpirun=7.debug ....................................   Passed    3.06 sec
          Start 7373: mpi/mg_ghost_dofs_periodic_06.mpirun=7.debug
9838/9934 Test #7362: mpi/mg_ghost_dofs_periodic_01.mpirun=7.release ..................................   Passed    2.78 sec
          Start 7374: mpi/mg_ghost_dofs_periodic_06.mpirun=7.release
9839/9934 Test #7358: mpi/mg_06.mpirun=7.release ......................................................   Passed   11.68 sec
          Start 7719: mpi/periodicity_02.mpirun=7.debug
9840/9934 Test #7719: mpi/periodicity_02.mpirun=7.debug ...............................................   Passed    3.13 sec
          Start 7720: mpi/periodicity_02.mpirun=7.release
9841/9934 Test #7271: mpi/hp_unify_dof_indices_08.mpirun=7.debug ......................................   Passed   35.55 sec
          Start 7725: mpi/periodicity_04.mpirun=7.debug
9842/9934 Test #7720: mpi/periodicity_02.mpirun=7.release .............................................   Passed    2.88 sec
          Start 7726: mpi/periodicity_04.mpirun=7.release
9843/9934 Test #7726: mpi/periodicity_04.mpirun=7.release .............................................   Passed    3.62 sec
          Start 7743: mpi/point_value_01.mpirun=6.debug
9844/9934 Test #7374: mpi/mg_ghost_dofs_periodic_06.mpirun=7.release ..................................   Passed   10.76 sec
          Start 7744: mpi/point_value_01.mpirun=6.release
9845/9934 Test #7373: mpi/mg_ghost_dofs_periodic_06.mpirun=7.debug ....................................   Passed   12.18 sec
          Start 7853: mpi/step-37.mpirun=7.debug
9846/9934 Test #7744: mpi/point_value_01.mpirun=6.release .............................................   Passed    2.70 sec
          Start 7854: mpi/step-37.mpirun=7.release
9847/9934 Test #7743: mpi/point_value_01.mpirun=6.debug ...............................................   Passed    2.88 sec
          Start 7861: mpi/step-39.mpirun=6.debug
9848/9934 Test #7854: mpi/step-37.mpirun=7.release ....................................................***Failed    3.54 sec
          Start 7862: mpi/step-39.mpirun=6.release
9849/9934 Test #7861: mpi/step-39.mpirun=6.debug ......................................................   Passed    3.65 sec
          Start 7877: mpi/tria_ghost_owners_01.mpirun=7.debug
9850/9934 Test #7862: mpi/step-39.mpirun=6.release ....................................................   Passed    3.01 sec
          Start 7878: mpi/tria_ghost_owners_01.mpirun=7.release
9851/9934 Test #7878: mpi/tria_ghost_owners_01.mpirun=7.release .......................................   Passed   11.45 sec
          Start 8120: multigrid/step-16-50-mpi.mpirun=7.debug
9852/9934 Test #7853: mpi/step-37.mpirun=7.debug ......................................................***Failed   21.14 sec
          Start 8121: multigrid/step-16-50-mpi.mpirun=7.release
9853/9934 Test #8121: multigrid/step-16-50-mpi.mpirun=7.release .......................................   Passed    1.11 sec
          Start 8170: multigrid/transfer_matrix_free_01.mpirun=7.debug
9854/9934 Test #8120: multigrid/step-16-50-mpi.mpirun=7.debug .........................................   Passed    2.33 sec
          Start 8171: multigrid/transfer_matrix_free_01.mpirun=7.release
9855/9934 Test #8171: multigrid/transfer_matrix_free_01.mpirun=7.release ..............................   Passed    1.70 sec
          Start 8186: multigrid/transfer_matrix_free_04.mpirun=7.debug
9856/9934 Test #7725: mpi/periodicity_04.mpirun=7.debug ...............................................   Passed   32.17 sec
          Start 8187: multigrid/transfer_matrix_free_04.mpirun=7.release
9857/9934 Test #8187: multigrid/transfer_matrix_free_04.mpirun=7.release ..............................   Passed    1.69 sec
9858/9934 Test #8186: multigrid/transfer_matrix_free_04.mpirun=7.debug ................................   Passed   16.59 sec
          Start 6887: mpi/attach_data_01.mpirun=8.debug
9859/9934 Test #8170: multigrid/transfer_matrix_free_01.mpirun=7.debug ................................   Passed   18.86 sec
          Start 6888: mpi/attach_data_01.mpirun=8.release
9860/9934 Test #6887: mpi/attach_data_01.mpirun=8.debug ...............................................   Passed    2.59 sec
          Start 6893: mpi/attach_data_02.mpirun=8.debug
9861/9934 Test #6888: mpi/attach_data_01.mpirun=8.release .............................................   Passed    2.65 sec
          Start 6894: mpi/attach_data_02.mpirun=8.release
9862/9934 Test #6894: mpi/attach_data_02.mpirun=8.release .............................................   Passed    2.53 sec
          Start 6901: mpi/cell_data_transfer_01.mpirun=8.debug
9863/9934 Test #6893: mpi/attach_data_02.mpirun=8.debug ...............................................   Passed    2.77 sec
          Start 6902: mpi/cell_data_transfer_01.mpirun=8.release
9864/9934 Test #6902: mpi/cell_data_transfer_01.mpirun=8.release ......................................   Passed    2.71 sec
          Start 6905: mpi/cell_data_transfer_02.mpirun=8.debug
9865/9934 Test #6901: mpi/cell_data_transfer_01.mpirun=8.debug ........................................   Passed    2.76 sec
          Start 6906: mpi/cell_data_transfer_02.mpirun=8.release
9866/9934 Test #6906: mpi/cell_data_transfer_02.mpirun=8.release ......................................   Passed    2.68 sec
          Start 6909: mpi/cell_data_transfer_03.mpirun=8.debug
9867/9934 Test #6905: mpi/cell_data_transfer_02.mpirun=8.debug ........................................   Passed    2.70 sec
          Start 6910: mpi/cell_data_transfer_03.mpirun=8.release
9868/9934 Test #7877: mpi/tria_ghost_owners_01.mpirun=7.debug .........................................   Passed   46.55 sec
          Start 7137: mpi/distort_random_01.mpirun=8.debug
9869/9934 Test #6910: mpi/cell_data_transfer_03.mpirun=8.release ......................................   Passed    2.70 sec
          Start 7138: mpi/distort_random_01.mpirun=8.release
9870/9934 Test #6909: mpi/cell_data_transfer_03.mpirun=8.debug ........................................   Passed    2.96 sec
          Start 7143: mpi/distort_random_02.mpirun=8.debug
9871/9934 Test #7137: mpi/distort_random_01.mpirun=8.debug ............................................   Passed    3.33 sec
          Start 7144: mpi/distort_random_02.mpirun=8.release
9872/9934 Test #7138: mpi/distort_random_01.mpirun=8.release ..........................................   Passed    3.24 sec
          Start 7215: mpi/hp_active_fe_indices_transfer_01.mpirun=8.debug
9873/9934 Test #7143: mpi/distort_random_02.mpirun=8.debug ............................................   Passed    3.64 sec
          Start 7216: mpi/hp_active_fe_indices_transfer_01.mpirun=8.release
9874/9934 Test #7144: mpi/distort_random_02.mpirun=8.release ..........................................   Passed    3.41 sec
          Start 7219: mpi/hp_active_fe_indices_transfer_02.mpirun=8.debug
9875/9934 Test #7215: mpi/hp_active_fe_indices_transfer_01.mpirun=8.debug .............................   Passed    3.13 sec
          Start 7220: mpi/hp_active_fe_indices_transfer_02.mpirun=8.release
9876/9934 Test #7216: mpi/hp_active_fe_indices_transfer_01.mpirun=8.release ...........................   Passed    3.06 sec
          Start 7223: mpi/hp_active_fe_indices_transfer_03.mpirun=8.debug
9877/9934 Test #7219: mpi/hp_active_fe_indices_transfer_02.mpirun=8.debug .............................   Passed    3.40 sec
          Start 7224: mpi/hp_active_fe_indices_transfer_03.mpirun=8.release
9878/9934 Test #7220: mpi/hp_active_fe_indices_transfer_02.mpirun=8.release ...........................   Passed    3.16 sec
          Start 7387: mpi/no_flux_constraints.mpirun=9.debug
9879/9934 Test #7223: mpi/hp_active_fe_indices_transfer_03.mpirun=8.debug .............................   Passed    3.24 sec
          Start 7388: mpi/no_flux_constraints.mpirun=9.release
9880/9934 Test #7224: mpi/hp_active_fe_indices_transfer_03.mpirun=8.release ...........................   Passed    3.09 sec
          Start 7391: mpi/no_flux_constraints_02.mpirun=9.debug
9881/9934 Test #7391: mpi/no_flux_constraints_02.mpirun=9.debug .......................................   Passed    7.37 sec
          Start 7392: mpi/no_flux_constraints_02.mpirun=9.release
9882/9934 Test #7388: mpi/no_flux_constraints.mpirun=9.release ........................................   Passed   12.41 sec
          Start 7395: mpi/no_flux_constraints_03.mpirun=9.debug
9883/9934 Test #7392: mpi/no_flux_constraints_02.mpirun=9.release .....................................   Passed    3.99 sec
          Start 7396: mpi/no_flux_constraints_03.mpirun=9.release
9884/9934 Test #7396: mpi/no_flux_constraints_03.mpirun=9.release .....................................   Passed    3.69 sec
          Start 7397: mpi/normal_flux_constraints.mpirun=9.debug
9885/9934 Test #7395: mpi/no_flux_constraints_03.mpirun=9.debug .......................................   Passed    4.20 sec
          Start 7398: mpi/normal_flux_constraints.mpirun=9.release
9886/9934 Test #7387: mpi/no_flux_constraints.mpirun=9.debug ..........................................   Passed   17.32 sec
          Start 7535: mpi/p_refinement_and_coarsening.mpirun=8.debug
9887/9934 Test #7535: mpi/p_refinement_and_coarsening.mpirun=8.debug ..................................   Passed    2.91 sec
          Start 7536: mpi/p_refinement_and_coarsening.mpirun=8.release
9888/9934 Test #7536: mpi/p_refinement_and_coarsening.mpirun=8.release ................................   Passed    2.77 sec
          Start 7727: mpi/periodicity_05.mpirun=9.debug
9889/9934 Test #7398: mpi/normal_flux_constraints.mpirun=9.release ....................................   Passed   12.05 sec
          Start 7728: mpi/periodicity_05.mpirun=9.release
9890/9934 Test #7397: mpi/normal_flux_constraints.mpirun=9.debug ......................................   Passed   16.38 sec
          Start 8025: multigrid/constrained_dofs_02.mpirun=8.debug
9891/9934 Test #8025: multigrid/constrained_dofs_02.mpirun=8.debug ....................................   Passed    1.05 sec
          Start 8026: multigrid/constrained_dofs_02.mpirun=8.release
9892/9934 Test #8026: multigrid/constrained_dofs_02.mpirun=8.release ..................................   Passed    0.89 sec
          Start 8140: multigrid/step-50_01.mpirun=8.debug
9893/9934 Test #8140: multigrid/step-50_01.mpirun=8.debug .............................................   Passed    1.19 sec
          Start 8141: multigrid/step-50_01.mpirun=8.release
9894/9934 Test #8141: multigrid/step-50_01.mpirun=8.release ...........................................   Passed    0.91 sec
          Start 9489: trilinos/n_nonzeros_02_parallel.mpirun=9.debug
9895/9934 Test #7727: mpi/periodicity_05.mpirun=9.debug ...............................................   Passed   15.46 sec
          Start 9490: trilinos/n_nonzeros_02_parallel.mpirun=9.release
9896/9934 Test #7728: mpi/periodicity_05.mpirun=9.release .............................................   Passed   11.94 sec
9897/9934 Test #9490: trilinos/n_nonzeros_02_parallel.mpirun=9.release ................................   Passed   10.55 sec
          Start 7199: mpi/fe_tools_extrapolate_06.mpirun=10.debug
9898/9934 Test #9489: trilinos/n_nonzeros_02_parallel.mpirun=9.debug ..................................   Passed   12.38 sec
          Start 7200: mpi/fe_tools_extrapolate_06.mpirun=10.release
9899/9934 Test #7200: mpi/fe_tools_extrapolate_06.mpirun=10.release ...................................   Passed    3.27 sec
          Start 7205: mpi/has_active_dofs_01.mpirun=10.debug
9900/9934 Test #7199: mpi/fe_tools_extrapolate_06.mpirun=10.debug .....................................   Passed    4.71 sec
          Start 7206: mpi/has_active_dofs_01.mpirun=10.release
9901/9934 Test #7206: mpi/has_active_dofs_01.mpirun=10.release ........................................   Passed   11.55 sec
          Start 7207: mpi/has_active_dofs_02.mpirun=10.debug
9902/9934 Test #7205: mpi/has_active_dofs_01.mpirun=10.debug ..........................................   Passed   12.38 sec
          Start 7208: mpi/has_active_dofs_02.mpirun=10.release
9903/9934 Test #7208: mpi/has_active_dofs_02.mpirun=10.release ........................................   Passed   10.38 sec
          Start 7273: mpi/hp_unify_dof_indices_09.mpirun=10.debug
9904/9934 Test #7207: mpi/has_active_dofs_02.mpirun=10.debug ..........................................   Passed   12.15 sec
          Start 7274: mpi/hp_unify_dof_indices_09.mpirun=10.release
9905/9934 Test #7274: mpi/hp_unify_dof_indices_09.mpirun=10.release ...................................   Passed   11.07 sec
          Start 7355: mpi/mg_05.mpirun=10.debug
9906/9934 Test #7273: mpi/hp_unify_dof_indices_09.mpirun=10.debug .....................................   Passed   13.06 sec
          Start 7356: mpi/mg_05.mpirun=10.release
9907/9934 Test #7356: mpi/mg_05.mpirun=10.release .....................................................   Passed   11.34 sec
          Start 7581: mpi/parallel_block_vector_13.mpirun=10.debug
9908/9934 Test #7355: mpi/mg_05.mpirun=10.debug .......................................................   Passed   13.02 sec
          Start 7582: mpi/parallel_block_vector_13.mpirun=10.release
9909/9934 Test #7581: mpi/parallel_block_vector_13.mpirun=10.debug ....................................   Passed   10.07 sec
          Start 7731: mpi/periodicity_07.mpirun=13.debug
9910/9934 Test #7582: mpi/parallel_block_vector_13.mpirun=10.release ..................................   Passed    9.05 sec
          Start 7732: mpi/periodicity_07.mpirun=13.release
9911/9934 Test #7732: mpi/periodicity_07.mpirun=13.release ............................................   Passed   12.19 sec
9912/9934 Test #7731: mpi/periodicity_07.mpirun=13.debug ..............................................   Passed   14.05 sec
          Start 7369: mpi/mg_ghost_dofs_periodic_05.mpirun=28.debug
9913/9934 Test #7369: mpi/mg_ghost_dofs_periodic_05.mpirun=28.debug ...................................   Passed   22.45 sec
          Start 7370: mpi/mg_ghost_dofs_periodic_05.mpirun=28.release
9914/9934 Test #7370: mpi/mg_ghost_dofs_periodic_05.mpirun=28.release .................................   Passed   11.75 sec
          Start 7507: mpi/p4est_3d_refine_04.mpirun=24.debug
9915/9934 Test #7507: mpi/p4est_3d_refine_04.mpirun=24.debug ..........................................   Passed    4.47 sec
          Start 7508: mpi/p4est_3d_refine_04.mpirun=24.release
9916/9934 Test #7508: mpi/p4est_3d_refine_04.mpirun=24.release ........................................   Passed    2.64 sec
          Start 7799: mpi/refinement_listener_01.mpirun=20.debug
          Start 7509: mpi/p4est_3d_refine_04.mpirun=4.debug
9917/9934 Test #7799: mpi/refinement_listener_01.mpirun=20.debug ......................................   Passed    3.20 sec
          Start 7800: mpi/refinement_listener_01.mpirun=20.release
9918/9934 Test #7800: mpi/refinement_listener_01.mpirun=20.release ....................................   Passed    2.53 sec
          Start 7805: mpi/refinement_listener_02.mpirun=20.debug
9919/9934 Test #7509: mpi/p4est_3d_refine_04.mpirun=4.debug ...........................................   Passed    6.71 sec
          Start 7510: mpi/p4est_3d_refine_04.mpirun=4.release
9920/9934 Test #7805: mpi/refinement_listener_02.mpirun=20.debug ......................................   Passed    3.21 sec
          Start 7806: mpi/refinement_listener_02.mpirun=20.release
9921/9934 Test #7510: mpi/p4est_3d_refine_04.mpirun=4.release .........................................   Passed    2.91 sec
          Start 7801: mpi/refinement_listener_01.mpirun=4.debug
9922/9934 Test #7806: mpi/refinement_listener_02.mpirun=20.release ....................................   Passed    3.03 sec
          Start 8042: multigrid/distribute_bug_01.mpirun=20.debug
9923/9934 Test #7801: mpi/refinement_listener_01.mpirun=4.debug .......................................   Passed    3.17 sec
          Start 7802: mpi/refinement_listener_01.mpirun=4.release
9924/9934 Test #8042: multigrid/distribute_bug_01.mpirun=20.debug .....................................   Passed    2.99 sec
          Start 8043: multigrid/distribute_bug_01.mpirun=20.release
9925/9934 Test #7802: mpi/refinement_listener_01.mpirun=4.release .....................................   Passed    2.52 sec
          Start 7807: mpi/refinement_listener_02.mpirun=4.debug
9926/9934 Test #8043: multigrid/distribute_bug_01.mpirun=20.release ...................................   Passed    1.13 sec
          Start 7371: mpi/mg_ghost_dofs_periodic_05.mpirun=6.debug
          Start 7372: mpi/mg_ghost_dofs_periodic_05.mpirun=6.release
          Start 7808: mpi/refinement_listener_02.mpirun=4.release
9927/9934 Test #7807: mpi/refinement_listener_02.mpirun=4.debug .......................................   Passed    3.19 sec
          Start 8044: multigrid/distribute_bug_01.mpirun=6.debug
9928/9934 Test #7808: mpi/refinement_listener_02.mpirun=4.release .....................................   Passed    2.59 sec
          Start 8045: multigrid/distribute_bug_01.mpirun=6.release
9929/9934 Test #7372: mpi/mg_ghost_dofs_periodic_05.mpirun=6.release ..................................   Passed    3.43 sec
9930/9934 Test #8044: multigrid/distribute_bug_01.mpirun=6.debug ......................................   Passed    2.89 sec
9931/9934 Test #7371: mpi/mg_ghost_dofs_periodic_05.mpirun=6.debug ....................................   Passed   21.61 sec
9932/9934 Test #8045: multigrid/distribute_bug_01.mpirun=6.release ....................................***Timeout 600.11 sec
          Start 7377: mpi/mg_ghost_dofs_periodic_07.mpirun=43.debug
9933/9934 Test #7377: mpi/mg_ghost_dofs_periodic_07.mpirun=43.debug ...................................   Passed    4.44 sec
          Start 7378: mpi/mg_ghost_dofs_periodic_07.mpirun=43.release
9934/9934 Test #7378: mpi/mg_ghost_dofs_periodic_07.mpirun=43.release .................................   Passed    3.10 sec

99% tests passed, 9 tests failed out of 9934

Total Test time (real) = 11555.18 sec

The following tests FAILED:
	2700 - cuda/solver_02.debug (Failed)
	2701 - cuda/solver_02.release (Failed)
	2725 - cuda/vector_memory_02.release (Failed)
	2917 - distributed_grids/3d_coarse_grid_02.debug (Failed)
	4752 - grid/grid_tools_cache_04.mpirun=4.debug (Failed)
	4753 - grid/grid_tools_cache_04.mpirun=4.release (Failed)
	7853 - mpi/step-37.mpirun=7.debug (Failed)
	7854 - mpi/step-37.mpirun=7.release (Failed)
	8045 - multigrid/distribute_bug_01.mpirun=6.release (Timeout)
-- Running CTEST_SUBMIT()
	Add file: /home/build/revision.log
	Add file: /home/build/summary.log
	Add file: /home/build/detailed.log
	Add file: /home/build/include/deal.II/base/config.h
Submit files
   Send to track: Continuous
   SubmitURL: http://cdash.kyomu.43-1.org/submit.php?project=deal.II
   Uploaded: /home/build/Testing/20190516-1104/Update.xml
   Uploaded: /home/build/Testing/20190516-1104/Configure.xml
   Uploaded: /home/build/Testing/20190516-1104/Build.xml
   Uploaded: /home/build/Testing/20190516-1104/Test.xml
   Uploaded: /home/build/Testing/20190516-1104/Notes.xml
   Uploaded: /home/build/Testing/20190516-1104/Done.xml
   Submission successful
-- Submission successful. Goodbye!
mv: setting attribute 'security.selinux' for 'security.selinux': No space left on device
mv: error writing '/var/jenkins/workspace/deal.II-CUDA10.1/build/tests/sparsity/CMakeFiles/dynamic_sparsity_pattern_iterator_03.release.dir/depend.make': No space left on device
mv: error writing '/var/jenkins/workspace/deal.II-CUDA10.1/build/tests/sparsity/CMakeFiles/dynamic_sparsity_pattern_iterator_03.release.dir/depend.internal': No space left on device
mv: error writing '/var/jenkins/workspace/deal.II-CUDA10.1/build/tests/sparsity/CMakeFiles/dynamic_sparsity_pattern_iterator_03.release.dir/CXX.includecache': No space left on device
mv: cannot create directory '/var/jenkins/workspace/deal.II-CUDA10.1/build/tests/sparsity/CMakeFiles/dynamic_sparsity_pattern_iterator_03.release.dir/dynamic_sparsity_pattern_iterator_03.release': No space left on device
mv: cannot create directory '/var/jenkins/workspace/deal.II-CUDA10.1/build/tests/sparsity/CMakeFiles/dynamic_sparsity_pattern_14.debug.diff.dir': No space left on device
mv: cannot create directory '/var/jenkins/workspace/deal.II-CUDA10.1/build/tests/sparsity/CMakeFiles/block_sparsity_pattern_03.release.diff.dir': No space left on device
mv: cannot create directory '/var/jenkins/workspace/deal.II-CUDA10.1/build/tests/sparsity/CMakeFiles/block_dynamic_sparsity_pattern_indexset_01.release.diff.dir': No space left on device
mv: cannot create directory '/var/jenkins/workspace/deal.II-CUDA10.1/build/tests/sparsity/CMakeFiles/dynamic_sparsity_pattern_04.debug.diff.dir': No space left on device
mv: cannot create directory '/var/jenkins/workspace/deal.II-CUDA10.1/build/tests/sparsity/CMakeFiles/dynamic_sparsity_pattern_iterator_09.release.diff.dir': No space left on device
mv: cannot create directory '/var/jenkins/workspace/deal.II-CUDA10.1/build/tests/sparsity/CMakeFiles/dynamic_sparsity_pattern_17.debug.diff.dir': No space left on device
mv: cannot create directory '/var/jenkins/workspace/deal.II-CUDA10.1/build/tests/sparsity/CMakeFiles/dynamic_sparsity_pattern_20.debug.diff.dir': No space left on device
mv: cannot create directory '/var/jenkins/workspace/deal.II-CUDA10.1/build/tests/sparsity/CMakeFiles/chunk_sparsity_pattern_04.debug.dir': No space left on device
mv: cannot create directory '/var/jenkins/workspace/deal.II-CUDA10.1/build/tests/sparsity/CMakeFiles/chunk_sparsity_pattern_09.debug.dir': No space left on device
mv: cannot create directory '/var/jenkins/workspace/deal.II-CUDA10.1/build/tests/sparsity/CMakeFiles/sparsity_pattern_iterator_07.debug.diff.dir': No space left on device
mv: cannot create directory '/var/jenkins/workspace/deal.II-CUDA10.1/build/tests/sparsity/CMakeFiles/chunk_sparsity_pattern_05.release.diff.dir': No space left on device
mv: cannot create directory '/var/jenkins/workspace/deal.II-CUDA10.1/build/tests/sparsity/CMakeFiles/sparsity_pattern_copy_from_02.debug.dir': No space left on device
mv: cannot create directory '/var/jenkins/workspace/deal.II-CUDA10.1/build/tests/sparsity/CMakeFiles/chunk_sparsity_pattern_10.debug.dir': No space left on device
mv: cannot create directory '/var/jenkins/workspace/deal.II-CUDA10.1/build/tests/sparsity/CMakeFiles/dynamic_sparsity_pattern_12.debug.diff.dir': No space left on device
mv: cannot create directory '/var/jenkins/workspace/deal.II-CUDA10.1/build/tests/sparsity/CMakeFiles/chunk_sparsity_pattern_09.release.diff.dir': No space left on device
mv: cannot create directory '/var/jenkins/workspace/deal.II-CUDA10.1/build/tests/sparsity/CMakeFiles/sparsity_pattern_01.debug.diff.dir': No space left on device
mv: cannot create directory '/var/jenkins/workspace/deal.II-CUDA10.1/build/tests/sparsity/CMakeFiles/sparsity_tools_01.release.diff.dir': No space left on device
mv: cannot create directory '/var/jenkins/workspace/deal.II-CUDA10.1/build/tests/sparsity/CMakeFiles/dynamic_sparsity_pattern_20.release.diff.dir': No space left on device
mv: cannot create directory '/var/jenkins/workspace/deal.II-CUDA10.1/build/tests/sparsity/CMakeFiles/dynamic_sparsity_pattern_20.release.dir': No space left on device
mv: cannot create directory '/var/jenkins/workspace/deal.II-CUDA10.1/build/tests/sparsity/CMakeFiles/dynamic_sparsity_pattern_22.debug.dir': No space left on device
mv: cannot create directory '/var/jenkins/workspace/deal.II-CUDA10.1/build/tests/sparsity/CMakeFiles/dynamic_sparsity_pattern_02.debug.dir': No space left on device
mv: cannot create directory '/var/jenkins/workspace/deal.II-CUDA10.1/build/tests/sparsity/CMakeFiles/dynamic_sparsity_pattern_compute_Tmmult_1.debug.diff.dir': No space left on device
mv: cannot create directory '/var/jenkins/workspace/deal.II-CUDA10.1/build/tests/sparsity/CMakeFiles/block_sparsity_pattern_01.debug.dir': No space left on device
mv: cannot create directory '/var/jenkins/workspace/deal.II-CUDA10.1/build/tests/sparsity/CMakeFiles/dynamic_sparsity_pattern_iterator_06.release.diff.dir': No space left on device
mv: cannot create directory '/var/jenkins/workspace/deal.II-CUDA10.1/build/tests/sparsity/CMakeFiles/chunk_sparsity_pattern_10.debug.diff.dir': No space left on device
mv: cannot create directory '/var/jenkins/workspace/deal.II-CUDA10.1/build/tests/sparsity/CMakeFiles/sparsity_pattern_iterator_01.release.dir': No space left on device
mv: cannot create directory '/var/jenkins/workspace/deal.II-CUDA10.1/build/tests/sparsity/CMakeFiles/sparsity_pattern_07.release.diff.dir': No space left on device
mv: cannot create directory '/var/jenkins/workspace/deal.II-CUDA10.1/build/tests/sparsity/CMakeFiles/sparsity_pattern_11.debug.dir': No space left on device
mv: cannot create directory '/var/jenkins/workspace/deal.II-CUDA10.1/build/tests/sparsity/CMakeFiles/sparsity_pattern.release.diff.dir': No space left on device
mv: cannot create directory '/var/jenkins/workspace/deal.II-CUDA10.1/build/tests/sparsity/CMakeFiles/dynamic_sparsity_pattern_index_set_02.debug.diff.dir': No space left on device
mv: cannot create directory '/var/jenkins/workspace/deal.II-CUDA10.1/build/tests/sparsity/CMakeFiles/block_dynamic_01.debug.diff.dir': No space left on device
mv: cannot create directory '/var/jenkins/workspace/deal.II-CUDA10.1/build/tests/sparsity/CMakeFiles/dynamic_sparsity_pattern_iterator_01.debug.dir': No space left on device
mv: cannot create directory '/var/jenkins/workspace/deal.II-CUDA10.1/build/tests/sparsity/CMakeFiles/block_sparsity_pattern_02.release.dir': No space left on device
mv: cannot create directory '/var/jenkins/workspace/deal.II-CUDA10.1/build/tests/sparsity/CMakeFiles/chunk_sparsity_pattern_06.debug.diff.dir': No space left on device
mv: cannot create directory '/var/jenkins/workspace/deal.II-CUDA10.1/build/tests/sparsity/CMakeFiles/dynamic_sparsity_pattern_13.release.dir': No space left on device
mv: cannot create directory '/var/jenkins/workspace/deal.II-CUDA10.1/build/tests/sparsity/CMakeFiles/dynamic_sparsity_pattern_09.debug.diff.dir': No space left on device
mv: cannot create directory '/var/jenkins/workspace/deal.II-CUDA10.1/build/tests/sparsity/CMakeFiles/sparsity_pattern_iterator_08.debug.dir': No space left on device
mv: cannot create directory '/var/jenkins/workspace/deal.II-CUDA10.1/build/tests/sparsity/CMakeFiles/dynamic_sparsity_pattern_compute_mmult_1.debug.dir': No space left on device
mv: cannot create directory '/var/jenkins/workspace/deal.II-CUDA10.1/build/tests/sparsity/CMakeFiles/dynamic_sparsity_pattern_05.release.dir': No space left on device
mv: cannot create directory '/var/jenkins/workspace/deal.II-CUDA10.1/build/tests/sparsity/CMakeFiles/dynamic_sparsity_pattern_06.release.dir': No space left on device
mv: cannot create directory '/var/jenkins/workspace/deal.II-CUDA10.1/build/tests/sparsity/CMakeFiles/sparsity_pattern_write_svg_01.release.diff.dir': No space left on device
mv: cannot create directory '/var/jenkins/workspace/deal.II-CUDA10.1/build/tests/sparsity/CMakeFiles/sparsity_pattern_copy_from_01.debug.dir': No space left on device
mv: cannot create directory '/var/jenkins/workspace/deal.II-CUDA10.1/build/tests/sparsity/CMakeFiles/dynamic_sparsity_pattern_01.debug.diff.dir': No space left on device
mv: setting attribute 'security.selinux' for 'security.selinux': No space left on device
mv: setting attribute 'security.selinux' for 'security.selinux': No space left on device
mv: cannot create directory '/var/jenkins/workspace/deal.II-CUDA10.1/build/tests/sparsity/CMakeFiles/3.14.3/CompilerIdCXX/tmp': No space left on device
mv: setting attribute 'security.selinux' for 'security.selinux': No space left on device
mv: cannot create directory '/var/jenkins/workspace/deal.II-CUDA10.1/build/tests/sparsity/CMakeFiles/3.14.3/CompilerIdCUDA': No space left on device
mv: cannot create regular file '/var/jenkins/workspace/deal.II-CUDA10.1/build/tests/sparsity/CMakeFiles/3.14.3/CMakeSystem.cmake': No space left on device
mv: cannot create regular file '/var/jenkins/workspace/deal.II-CUDA10.1/build/tests/sparsity/CMakeFiles/3.14.3/CMakeCXXCompiler.cmake': No space left on device
mv: cannot create regular file '/var/jenkins/workspace/deal.II-CUDA10.1/build/tests/sparsity/CMakeFiles/3.14.3/CMakeDetermineCompilerABI_CUDA.bin': No space left on device
mv: cannot create regular file '/var/jenkins/workspace/deal.II-CUDA10.1/build/tests/sparsity/CMakeFiles/3.14.3/CMakeCUDACompiler.cmake': No space left on device
mv: cannot create regular file '/var/jenkins/workspace/deal.II-CUDA10.1/build/tests/sparsity/CMakeFiles/3.14.3/CMakeDetermineCompilerABI_CXX.bin': No space left on device
mv: setting attribute 'security.selinux' for 'security.selinux': No space left on device
mv: cannot create directory '/var/jenkins/workspace/deal.II-CUDA10.1/build/tests/sparsity/CMakeFiles/sparsity_tools_02.release.diff.dir': No space left on device
mv: cannot create directory '/var/jenkins/workspace/deal.II-CUDA10.1/build/tests/sparsity/CMakeFiles/sparsity_pattern_08.release.dir': No space left on device
mv: cannot create directory '/var/jenkins/workspace/deal.II-CUDA10.1/build/tests/sparsity/CMakeFiles/sparsity_pattern_07.debug.diff.dir': No space left on device
mv: cannot create directory '/var/jenkins/workspace/deal.II-CUDA10.1/build/tests/sparsity/CMakeFiles/dynamic_sparsity_pattern_iterator_05.release.diff.dir': No space left on device
mv: cannot create directory '/var/jenkins/workspace/deal.II-CUDA10.1/build/tests/sparsity/CMakeFiles/dynamic_sparsity_pattern_01.release.diff.dir': No space left on device
mv: cannot create directory '/var/jenkins/workspace/deal.II-CUDA10.1/build/tests/sparsity/CMakeFiles/dynamic_sparsity_pattern_compute_mmult_2.debug.dir': No space left on device
mv: cannot create directory '/var/jenkins/workspace/deal.II-CUDA10.1/build/tests/sparsity/CMakeFiles/chunk_sparsity_pattern_01.debug.diff.dir': No space left on device
mv: cannot create directory '/var/jenkins/workspace/deal.II-CUDA10.1/build/tests/sparsity/CMakeFiles/block_dynamic_sparsity_pattern_indexset_01.release.dir': No space left on device
mv: cannot create directory '/var/jenkins/workspace/deal.II-CUDA10.1/build/tests/sparsity/CMakeFiles/block_sparsity_pattern_01.release.diff.dir': No space left on device
mv: cannot create directory '/var/jenkins/workspace/deal.II-CUDA10.1/build/tests/sparsity/CMakeFiles/chunk_sparsity_pattern_10.release.diff.dir': No space left on device
mv: cannot create directory '/var/jenkins/workspace/deal.II-CUDA10.1/build/tests/sparsity/CMakeFiles/dynamic_sparsity_pattern_08.debug.diff.dir': No space left on device
mv: cannot create directory '/var/jenkins/workspace/deal.II-CUDA10.1/build/tests/sparsity/CMakeFiles/chunk_sparsity_pattern_11.debug.diff.dir': No space left on device
mv: cannot create directory '/var/jenkins/workspace/deal.II-CUDA10.1/build/tests/sparsity/CMakeFiles/dynamic_sparsity_pattern_13.debug.dir': No space left on device
mv: cannot create directory '/var/jenkins/workspace/deal.II-CUDA10.1/build/tests/sparsity/CMakeFiles/sparsity_pattern_iterator_08.release.dir': No space left on device
mv: cannot create directory '/var/jenkins/workspace/deal.II-CUDA10.1/build/tests/sparsity/CMakeFiles/dynamic_sparsity_pattern_12.release.diff.dir': No space left on device
mv: cannot create directory '/var/jenkins/workspace/deal.II-CUDA10.1/build/tests/sparsity/CMakeFiles/dynamic_sparsity_pattern_compute_Tmmult_2.release.dir': No space left on device
mv: cannot create directory '/var/jenkins/workspace/deal.II-CUDA10.1/build/tests/sparsity/CMakeFiles/dynamic_sparsity_pattern_compute_mmult_1.release.diff.dir': No space left on device
mv: cannot create directory '/var/jenkins/workspace/deal.II-CUDA10.1/build/tests/sparsity/CMakeFiles/sparsity_pattern_08.release.diff.dir': No space left on device
mv: cannot create directory '/var/jenkins/workspace/deal.II-CUDA10.1/build/tests/sparsity/CMakeFiles/sparsity_pattern_07.debug.dir': No space left on device
mv: cannot create directory '/var/jenkins/workspace/deal.II-CUDA10.1/build/tests/sparsity/CMakeFiles/dynamic_sparsity_pattern_iterator_02.debug.dir': No space left on device
mv: cannot create directory '/var/jenkins/workspace/deal.II-CUDA10.1/build/tests/sparsity/CMakeFiles/chunk_sparsity_pattern_02.debug.dir': No space left on device
mv: cannot create directory '/var/jenkins/workspace/deal.II-CUDA10.1/build/tests/sparsity/CMakeFiles/sparsity_pattern_10.release.diff.dir': No space left on device
mv: cannot create directory '/var/jenkins/workspace/deal.II-CUDA10.1/build/tests/sparsity/CMakeFiles/dynamic_sparsity_pattern_13.debug.diff.dir': No space left on device
mv: cannot create directory '/var/jenkins/workspace/deal.II-CUDA10.1/build/tests/sparsity/CMakeFiles/dynamic_sparsity_pattern_01.debug.dir': No space left on device
mv: cannot create directory '/var/jenkins/workspace/deal.II-CUDA10.1/build/tests/sparsity/CMakeFiles/sparsity_pattern_copy_from_01.debug.diff.dir': No space left on device
mv: cannot create directory '/var/jenkins/workspace/deal.II-CUDA10.1/build/tests/sparsity/CMakeFiles/chunk_sparsity_pattern_02.release.diff.dir': No space left on device
mv: cannot create directory '/var/jenkins/workspace/deal.II-CUDA10.1/build/tests/sparsity/CMakeFiles/dynamic_sparsity_pattern_14.debug.dir': No space left on device
mv: cannot create directory '/var/jenkins/workspace/deal.II-CUDA10.1/build/tests/sparsity/CMakeFiles/sparsity_pattern.debug.dir': No space left on device
mv: cannot create directory '/var/jenkins/workspace/deal.II-CUDA10.1/build/tests/sparsity/CMakeFiles/dynamic_sparsity_pattern_08.release.diff.dir': No space left on device
mv: cannot create directory '/var/jenkins/workspace/deal.II-CUDA10.1/build/tests/sparsity/CMakeFiles/dynamic_sparsity_pattern_compute_Tmmult_2.debug.diff.dir': No space left on device
mv: cannot create directory '/var/jenkins/workspace/deal.II-CUDA10.1/build/tests/sparsity/CMakeFiles/sparsity_tools_02.release.dir': No space left on device
mv: cannot create directory '/var/jenkins/workspace/deal.II-CUDA10.1/build/tests/sparsity/CMakeFiles/chunk_sparsity_pattern_09.release.dir': No space left on device
mv: cannot create directory '/var/jenkins/workspace/deal.II-CUDA10.1/build/tests/sparsity/CMakeFiles/dynamic_sparsity_pattern_iterator_01.release.diff.dir': No space left on device
mv: cannot create directory '/var/jenkins/workspace/deal.II-CUDA10.1/build/tests/sparsity/CMakeFiles/dynamic_sparsity_pattern_07.release.dir': No space left on device
mv: cannot create directory '/var/jenkins/workspace/deal.II-CUDA10.1/build/tests/sparsity/CMakeFiles/dynamic_sparsity_pattern_14.release.dir': No space left on device
mv: cannot create directory '/var/jenkins/workspace/deal.II-CUDA10.1/build/tests/sparsity/CMakeFiles/dynamic_sparsity_pattern_iterator_03.debug.diff.dir': No space left on device
mv: cannot create directory '/var/jenkins/workspace/deal.II-CUDA10.1/build/tests/sparsity/CMakeFiles/block_sparsity_pattern_03.release.dir': No space left on device
mv: cannot create directory '/var/jenkins/workspace/deal.II-CUDA10.1/build/tests/sparsity/CMakeFiles/dynamic_sparsity_pattern_21.debug.diff.dir': No space left on device
mv: cannot create directory '/var/jenkins/workspace/deal.II-CUDA10.1/build/tests/sparsity/CMakeFiles/dynamic_sparsity_pattern_01.release.dir': No space left on device
mv: cannot create directory '/var/jenkins/workspace/deal.II-CUDA10.1/build/tests/sparsity/CMakeFiles/block_sparsity_pattern_03.debug.dir': No space left on device
mv: cannot create directory '/var/jenkins/workspace/deal.II-CUDA10.1/build/tests/sparsity/CMakeFiles/dynamic_sparsity_pattern_10.debug.dir': No space left on device
mv: cannot create directory '/var/jenkins/workspace/deal.II-CUDA10.1/build/tests/sparsity/CMakeFiles/dynamic_sparsity_pattern_06.debug.diff.dir': No space left on device
mv: cannot create directory '/var/jenkins/workspace/deal.II-CUDA10.1/build/tests/sparsity/CMakeFiles/dynamic_sparsity_pattern_09.release.dir': No space left on device
mv: cannot create directory '/var/jenkins/workspace/deal.II-CUDA10.1/build/tests/sparsity/CMakeFiles/dynamic_sparsity_pattern_iterator_02.debug.diff.dir': No space left on device
mv: cannot create directory '/var/jenkins/workspace/deal.II-CUDA10.1/build/tests/sparsity/CMakeFiles/sparsity_pattern_04.release.dir': No space left on device
mv: cannot create directory '/var/jenkins/workspace/deal.II-CUDA10.1/build/tests/sparsity/CMakeFiles/dynamic_sparsity_pattern_15.release.dir': No space left on device
mv: cannot create directory '/var/jenkins/workspace/deal.II-CUDA10.1/build/tests/sparsity/CMakeFiles/sparsity_pattern_iterator_08.debug.diff.dir': No space left on device
mv: cannot create directory '/var/jenkins/workspace/deal.II-CUDA10.1/build/tests/sparsity/CMakeFiles/chunk_sparsity_pattern_11.release.dir': No space left on device
mv: cannot create directory '/var/jenkins/workspace/deal.II-CUDA10.1/build/tests/sparsity/CMakeFiles/sparsity_tools_02.debug.dir': No space left on device
mv: cannot create directory '/var/jenkins/workspace/deal.II-CUDA10.1/build/tests/sparsity/CMakeFiles/sparsity_tools_01.release.dir': No space left on device
mv: cannot create directory '/var/jenkins/workspace/deal.II-CUDA10.1/build/tests/sparsity/CMakeFiles/sparsity_pattern_iterator_09.debug.dir': No space left on device
mv: cannot create directory '/var/jenkins/workspace/deal.II-CUDA10.1/build/tests/sparsity/CMakeFiles/sparsity_pattern_01.release.diff.dir': No space left on device
mv: cannot create directory '/var/jenkins/workspace/deal.II-CUDA10.1/build/tests/sparsity/CMakeFiles/sparsity_pattern_iterator_07.debug.dir': No space left on device
mv: cannot create directory '/var/jenkins/workspace/deal.II-CUDA10.1/build/tests/sparsity/CMakeFiles/dynamic_sparsity_pattern_iterator_08.release.diff.dir': No space left on device
mv: cannot create directory '/var/jenkins/workspace/deal.II-CUDA10.1/build/tests/sparsity/CMakeFiles/dynamic_sparsity_pattern_iterator_02.release.diff.dir': No space left on device
mv: cannot create directory '/var/jenkins/workspace/deal.II-CUDA10.1/build/tests/sparsity/CMakeFiles/dynamic_sparsity_pattern_iterator_01.debug.diff.dir': No space left on device
mv: cannot create directory '/var/jenkins/workspace/deal.II-CUDA10.1/build/tests/sparsity/CMakeFiles/dynamic_sparsity_pattern_06.release.diff.dir': No space left on device
mv: cannot create directory '/var/jenkins/workspace/deal.II-CUDA10.1/build/tests/sparsity/CMakeFiles/chunk_sparsity_pattern_05.release.dir': No space left on device
mv: cannot create directory '/var/jenkins/workspace/deal.II-CUDA10.1/build/tests/sparsity/CMakeFiles/dynamic_sparsity_pattern_11.debug.dir': No space left on device
mv: cannot create directory '/var/jenkins/workspace/deal.II-CUDA10.1/build/tests/sparsity/CMakeFiles/block_dynamic_01.release.diff.dir': No space left on device
mv: cannot create directory '/var/jenkins/workspace/deal.II-CUDA10.1/build/tests/sparsity/CMakeFiles/dynamic_sparsity_pattern_21.debug.dir': No space left on device
mv: cannot create directory '/var/jenkins/workspace/deal.II-CUDA10.1/build/tests/sparsity/CMakeFiles/sparsity_pattern_10.release.dir': No space left on device
mv: cannot create directory '/var/jenkins/workspace/deal.II-CUDA10.1/build/tests/sparsity/CMakeFiles/dynamic_sparsity_pattern_19.mpirun3.debug.diff.dir': No space left on device
mv: cannot create directory '/var/jenkins/workspace/deal.II-CUDA10.1/build/tests/sparsity/CMakeFiles/dynamic_sparsity_pattern_compute_Tmmult_1.release.dir': No space left on device
mv: cannot create directory '/var/jenkins/workspace/deal.II-CUDA10.1/build/tests/sparsity/CMakeFiles/sparsity_pattern_13.release.dir': No space left on device
mv: cannot create directory '/var/jenkins/workspace/deal.II-CUDA10.1/build/tests/sparsity/CMakeFiles/sparsity_pattern_copy_from_02.debug.diff.dir': No space left on device
mv: cannot create directory '/var/jenkins/workspace/deal.II-CUDA10.1/build/tests/sparsity/CMakeFiles/sparsity_pattern_09.debug.dir': No space left on device
mv: cannot create directory '/var/jenkins/workspace/deal.II-CUDA10.1/build/tests/sparsity/CMakeFiles/sparsity_pattern_06.debug.dir': No space left on device
mv: cannot create directory '/var/jenkins/workspace/deal.II-CUDA10.1/build/tests/sparsity/CMakeFiles/dynamic_sparsity_pattern_iterator_08.release.dir': No space left on device
mv: cannot create directory '/var/jenkins/workspace/deal.II-CUDA10.1/build/tests/sparsity/CMakeFiles/dynamic_sparsity_pattern_index_set_02.release.diff.dir': No space left on device
mv: cannot create directory '/var/jenkins/workspace/deal.II-CUDA10.1/build/tests/sparsity/CMakeFiles/dynamic_sparsity_pattern_index_set_02.release.dir': No space left on device
mv: cannot create directory '/var/jenkins/workspace/deal.II-CUDA10.1/build/tests/sparsity/CMakeFiles/chunk_sparsity_pattern_12.debug.diff.dir': No space left on device
mv: cannot create directory '/var/jenkins/workspace/deal.II-CUDA10.1/build/tests/sparsity/CMakeFiles/chunk_sparsity_pattern_01.release.dir': No space left on device
mv: cannot create directory '/var/jenkins/workspace/deal.II-CUDA10.1/build/tests/sparsity/CMakeFiles/sparsity_tools_02.debug.diff.dir': No space left on device
mv: cannot create directory '/var/jenkins/workspace/deal.II-CUDA10.1/build/tests/sparsity/CMakeFiles/sparsity_pattern_write_svg_01.debug.diff.dir': No space left on device
mv: cannot create directory '/var/jenkins/workspace/deal.II-CUDA10.1/build/tests/sparsity/CMakeFiles/sparsity_pattern_11.release.diff.dir': No space left on device
mv: cannot create directory '/var/jenkins/workspace/deal.II-CUDA10.1/build/tests/sparsity/CMakeFiles/sparsity_pattern_full_matrix_02.debug.diff.dir': No space left on device
mv: cannot create directory '/var/jenkins/workspace/deal.II-CUDA10.1/build/tests/sparsity/CMakeFiles/sparsity_pattern_iterator_01.release.diff.dir': No space left on device
mv: cannot create directory '/var/jenkins/workspace/deal.II-CUDA10.1/build/tests/sparsity/CMakeFiles/dynamic_sparsity_pattern_iterator_06.release.dir': No space left on device
mv: cannot create directory '/var/jenkins/workspace/deal.II-CUDA10.1/build/tests/sparsity/CMakeFiles/dynamic_sparsity_pattern_index_set_02.debug.dir': No space left on device
mv: cannot create directory '/var/jenkins/workspace/deal.II-CUDA10.1/build/tests/sparsity/CMakeFiles/dynamic_sparsity_pattern_02.release.dir': No space left on device
mv: cannot create directory '/var/jenkins/workspace/deal.II-CUDA10.1/build/tests/sparsity/CMakeFiles/chunk_sparsity_pattern_05.debug.dir': No space left on device
mv: cannot create directory '/var/jenkins/workspace/deal.II-CUDA10.1/build/tests/sparsity/CMakeFiles/dynamic_sparsity_pattern_iterator_03.debug.dir': No space left on device
mv: cannot create directory '/var/jenkins/workspace/deal.II-CUDA10.1/build/tests/sparsity/CMakeFiles/dynamic_sparsity_pattern_07.debug.dir': No space left on device
mv: cannot create directory '/var/jenkins/workspace/deal.II-CUDA10.1/build/tests/sparsity/CMakeFiles/dynamic_sparsity_pattern_iterator_01.release.dir': No space left on device
mv: cannot create directory '/var/jenkins/workspace/deal.II-CUDA10.1/build/tests/sparsity/CMakeFiles/dynamic_sparsity_pattern_15.debug.dir': No space left on device
mv: cannot create directory '/var/jenkins/workspace/deal.II-CUDA10.1/build/tests/sparsity/CMakeFiles/dynamic_sparsity_pattern_iterator_08.debug.dir': No space left on device
mv: cannot create directory '/var/jenkins/workspace/deal.II-CUDA10.1/build/tests/sparsity/CMakeFiles/dynamic_sparsity_pattern_19.release.dir': No space left on device
mv: cannot create directory '/var/jenkins/workspace/deal.II-CUDA10.1/build/tests/sparsity/CMakeFiles/sparsity_pattern_copy_from_01.release.diff.dir': No space left on device
mv: cannot create directory '/var/jenkins/workspace/deal.II-CUDA10.1/build/tests/sparsity/CMakeFiles/sparsity_pattern_full_matrix_02.release.dir': No space left on device
mv: cannot create directory '/var/jenkins/workspace/deal.II-CUDA10.1/build/tests/sparsity/CMakeFiles/sparsity_pattern_full_matrix_02.debug.dir': No space left on device
mv: cannot create directory '/var/jenkins/workspace/deal.II-CUDA10.1/build/tests/sparsity/CMakeFiles/sparsity_pattern_03.release.diff.dir': No space left on device
mv: cannot create directory '/var/jenkins/workspace/deal.II-CUDA10.1/build/tests/sparsity/CMakeFiles/sparsity_pattern_01.release.dir': No space left on device
mv: cannot create directory '/var/jenkins/workspace/deal.II-CUDA10.1/build/tests/sparsity/CMakeFiles/dynamic_sparsity_pattern_iterator_09.release.dir': No space left on device
mv: cannot create directory '/var/jenkins/workspace/deal.II-CUDA10.1/build/tests/sparsity/CMakeFiles/sparsity_pattern_08.debug.dir': No space left on device
mv: cannot create directory '/var/jenkins/workspace/deal.II-CUDA10.1/build/tests/sparsity/CMakeFiles/chunk_sparsity_pattern_07.debug.dir': No space left on device
mv: cannot create directory '/var/jenkins/workspace/deal.II-CUDA10.1/build/tests/sparsity/CMakeFiles/dynamic_sparsity_pattern_08.debug.dir': No space left on device
mv: cannot create directory '/var/jenkins/workspace/deal.II-CUDA10.1/build/tests/sparsity/CMakeFiles/sparsity_pattern_02.debug.diff.dir': No space left on device
mv: cannot create directory '/var/jenkins/workspace/deal.II-CUDA10.1/build/tests/sparsity/CMakeFiles/sparsity_pattern_full_matrix_02.release.diff.dir': No space left on device
mv: cannot create directory '/var/jenkins/workspace/deal.II-CUDA10.1/build/tests/sparsity/CMakeFiles/dynamic_sparsity_pattern_12.release.dir': No space left on device
mv: cannot create directory '/var/jenkins/workspace/deal.II-CUDA10.1/build/tests/sparsity/CMakeFiles/dynamic_sparsity_pattern_17.debug.dir': No space left on device
mv: cannot create directory '/var/jenkins/workspace/deal.II-CUDA10.1/build/tests/sparsity/CMakeFiles/dynamic_sparsity_pattern_21.release.dir': No space left on device
mv: cannot create directory '/var/jenkins/workspace/deal.II-CUDA10.1/build/tests/sparsity/CMakeFiles/sparsity_pattern_05.release.dir': No space left on device
mv: cannot create directory '/var/jenkins/workspace/deal.II-CUDA10.1/build/tests/sparsity/CMakeFiles/sparsity_pattern_iterator_09.debug.diff.dir': No space left on device
mv: cannot create directory '/var/jenkins/workspace/deal.II-CUDA10.1/build/tests/sparsity/CMakeFiles/sparsity_pattern.release.dir': No space left on device
mv: cannot create directory '/var/jenkins/workspace/deal.II-CUDA10.1/build/tests/sparsity/CMakeFiles/chunk_sparsity_pattern_07.release.dir': No space left on device
mv: cannot create directory '/var/jenkins/workspace/deal.II-CUDA10.1/build/tests/sparsity/CMakeFiles/dynamic_sparsity_pattern_03.release.dir': No space left on device
mv: cannot create directory '/var/jenkins/workspace/deal.II-CUDA10.1/build/tests/sparsity/CMakeFiles/dynamic_sparsity_pattern_07.debug.diff.dir': No space left on device
mv: cannot create directory '/var/jenkins/workspace/deal.II-CUDA10.1/build/tests/sparsity/CMakeFiles/chunk_sparsity_pattern_09.debug.diff.dir': No space left on device
mv: cannot create directory '/var/jenkins/workspace/deal.II-CUDA10.1/build/tests/sparsity/CMakeFiles/dynamic_sparsity_pattern_04.release.dir': No space left on device
mv: cannot create directory '/var/jenkins/workspace/deal.II-CUDA10.1/build/tests/sparsity/CMakeFiles/dynamic_sparsity_pattern_11.debug.diff.dir': No space left on device
mv: cannot create directory '/var/jenkins/workspace/deal.II-CUDA10.1/build/tests/sparsity/CMakeFiles/dynamic_sparsity_pattern_19.mpirun3.release.diff.dir': No space left on device
mv: cannot create directory '/var/jenkins/workspace/deal.II-CUDA10.1/build/tests/sparsity/CMakeFiles/sparsity_pattern_06.release.diff.dir': No space left on device
mv: cannot create directory '/var/jenkins/workspace/deal.II-CUDA10.1/build/tests/sparsity/CMakeFiles/sparsity_pattern_iterator_07.release.dir': No space left on device
mv: cannot create directory '/var/jenkins/workspace/deal.II-CUDA10.1/build/tests/sparsity/CMakeFiles/sparsity_pattern_full_matrix_01.release.diff.dir': No space left on device
mv: cannot create directory '/var/jenkins/workspace/deal.II-CUDA10.1/build/tests/sparsity/CMakeFiles/sparsity_pattern_copy_from_01.release.dir': No space left on device
mv: cannot create directory '/var/jenkins/workspace/deal.II-CUDA10.1/build/tests/sparsity/CMakeFiles/sparsity_pattern_13.release.diff.dir': No space left on device
mv: cannot create directory '/var/jenkins/workspace/deal.II-CUDA10.1/build/tests/sparsity/CMakeFiles/sparsity_pattern_12.debug.dir': No space left on device
mv: cannot create directory '/var/jenkins/workspace/deal.II-CUDA10.1/build/tests/sparsity/CMakeFiles/sparsity_pattern_04.debug.diff.dir': No space left on device
mv: cannot create directory '/var/jenkins/workspace/deal.II-CUDA10.1/build/tests/sparsity/CMakeFiles/sparsity_pattern_03.debug.diff.dir': No space left on device
mv: cannot create directory '/var/jenkins/workspace/deal.II-CUDA10.1/build/tests/sparsity/CMakeFiles/dynamic_sparsity_pattern_22.release.diff.dir': No space left on device
mv: cannot create directory '/var/jenkins/workspace/deal.II-CUDA10.1/build/tests/sparsity/CMakeFiles/dynamic_sparsity_pattern_22.release.dir': No space left on device
mv: cannot create directory '/var/jenkins/workspace/deal.II-CUDA10.1/build/tests/sparsity/CMakeFiles/sparsity_pattern_11.release.dir': No space left on device
mv: cannot create directory '/var/jenkins/workspace/deal.II-CUDA10.1/build/tests/sparsity/CMakeFiles/chunk_sparsity_pattern_12.release.dir': No space left on device
mv: cannot create directory '/var/jenkins/workspace/deal.II-CUDA10.1/build/tests/sparsity/CMakeFiles/dynamic_sparsity_pattern_11.release.dir': No space left on device
mv: cannot create directory '/var/jenkins/workspace/deal.II-CUDA10.1/build/tests/sparsity/CMakeFiles/sparsity_pattern_12.debug.diff.dir': No space left on device
mv: cannot create directory '/var/jenkins/workspace/deal.II-CUDA10.1/build/tests/sparsity/CMakeFiles/dynamic_sparsity_pattern_05.release.diff.dir': No space left on device
mv: cannot create directory '/var/jenkins/workspace/deal.II-CUDA10.1/build/tests/sparsity/CMakeFiles/dynamic_sparsity_pattern_08.release.dir': No space left on device
mv: cannot create directory '/var/jenkins/workspace/deal.II-CUDA10.1/build/tests/sparsity/CMakeFiles/sparsity_pattern_full_matrix_01.release.dir': No space left on device
mv: cannot create directory '/var/jenkins/workspace/deal.II-CUDA10.1/build/tests/sparsity/CMakeFiles/dynamic_sparsity_pattern_15.debug.diff.dir': No space left on device
mv: cannot create directory '/var/jenkins/workspace/deal.II-CUDA10.1/build/tests/sparsity/CMakeFiles/block_dynamic_01.debug.dir': No space left on device
mv: cannot create directory '/var/jenkins/workspace/deal.II-CUDA10.1/build/tests/sparsity/CMakeFiles/block_sparsity_pattern_02.release.diff.dir': No space left on device
mv: setting attribute 'security.selinux' for 'security.selinux': No space left on device
mv: cannot create directory '/var/jenkins/workspace/deal.II-CUDA10.1/build/tests/sparsity/dynamic_sparsity_pattern_iterator_05.debug': No space left on device
mv: cannot create directory '/var/jenkins/workspace/deal.II-CUDA10.1/build/tests/sparsity/dynamic_sparsity_pattern_iterator_07.release': No space left on device
mv: cannot create directory '/var/jenkins/workspace/deal.II-CUDA10.1/build/tests/sparsity/sparsity_pattern_10.release': No space left on device
mv: cannot create directory '/var/jenkins/workspace/deal.II-CUDA10.1/build/tests/sparsity/sparsity_pattern_iterator_01.debug': No space left on device
mv: cannot create directory '/var/jenkins/workspace/deal.II-CUDA10.1/build/tests/sparsity/chunk_sparsity_pattern_07.release': No space left on device
mv: cannot create directory '/var/jenkins/workspace/deal.II-CUDA10.1/build/tests/sparsity/chunk_sparsity_pattern_12.release': No space left on device
mv: cannot create directory '/var/jenkins/workspace/deal.II-CUDA10.1/build/tests/sparsity/dynamic_sparsity_pattern_06.release': No space left on device
mv: cannot create directory '/var/jenkins/workspace/deal.II-CUDA10.1/build/tests/sparsity/dynamic_sparsity_pattern_08.release': No space left on device
mv: cannot create directory '/var/jenkins/workspace/deal.II-CUDA10.1/build/tests/sparsity/dynamic_sparsity_pattern_10.release': No space left on device
mv: cannot create directory '/var/jenkins/workspace/deal.II-CUDA10.1/build/tests/sparsity/dynamic_sparsity_pattern_13.debug': No space left on device
mv: cannot create directory '/var/jenkins/workspace/deal.II-CUDA10.1/build/tests/sparsity/dynamic_sparsity_pattern_compute_Tmmult_2.release': No space left on device
mv: cannot create directory '/var/jenkins/workspace/deal.II-CUDA10.1/build/tests/sparsity/sparsity_pattern_01.release': No space left on device
mv: cannot create directory '/var/jenkins/workspace/deal.II-CUDA10.1/build/tests/sparsity/sparsity_pattern_05.release': No space left on device
mv: cannot create directory '/var/jenkins/workspace/deal.II-CUDA10.1/build/tests/sparsity/dynamic_sparsity_pattern_15.release': No space left on device
mv: cannot create directory '/var/jenkins/workspace/deal.II-CUDA10.1/build/tests/sparsity/dynamic_sparsity_pattern_17.release': No space left on device
mv: cannot create directory '/var/jenkins/workspace/deal.II-CUDA10.1/build/tests/sparsity/dynamic_sparsity_pattern_22.release': No space left on device
mv: cannot create directory '/var/jenkins/workspace/deal.II-CUDA10.1/build/tests/sparsity/dynamic_sparsity_pattern_iterator_05.release': No space left on device
mv: cannot create directory '/var/jenkins/workspace/deal.II-CUDA10.1/build/tests/sparsity/sparsity_pattern_copy_from_02.debug': No space left on device
mv: cannot create directory '/var/jenkins/workspace/deal.II-CUDA10.1/build/tests/sparsity/sparsity_pattern_write_svg_01.debug': No space left on device
mv: cannot create directory '/var/jenkins/workspace/deal.II-CUDA10.1/build/tests/sparsity/sparsity_tools_02.release': No space left on device
mv: cannot create directory '/var/jenkins/workspace/deal.II-CUDA10.1/build/tests/sparsity/block_dynamic_01.release': No space left on device
mv: cannot create directory '/var/jenkins/workspace/deal.II-CUDA10.1/build/tests/sparsity/block_sparsity_pattern_02.debug': No space left on device
mv: cannot create directory '/var/jenkins/workspace/deal.II-CUDA10.1/build/tests/sparsity/chunk_sparsity_pattern_02.release': No space left on device
mv: cannot create directory '/var/jenkins/workspace/deal.II-CUDA10.1/build/tests/sparsity/dynamic_sparsity_pattern_20.release': No space left on device
mv: cannot create directory '/var/jenkins/workspace/deal.II-CUDA10.1/build/tests/sparsity/dynamic_sparsity_pattern_iterator_01.debug': No space left on device
mv: cannot create directory '/var/jenkins/workspace/deal.II-CUDA10.1/build/tests/sparsity/dynamic_sparsity_pattern_iterator_03.debug': No space left on device
mv: cannot create directory '/var/jenkins/workspace/deal.II-CUDA10.1/build/tests/sparsity/sparsity_pattern_03.release': No space left on device
mv: cannot create directory '/var/jenkins/workspace/deal.II-CUDA10.1/build/tests/sparsity/sparsity_pattern_08.release': No space left on device
mv: cannot create directory '/var/jenkins/workspace/deal.II-CUDA10.1/build/tests/sparsity/sparsity_pattern_13.release': No space left on device
mv: cannot create directory '/var/jenkins/workspace/deal.II-CUDA10.1/build/tests/sparsity/chunk_sparsity_pattern_05.release': No space left on device
mv: cannot create directory '/var/jenkins/workspace/deal.II-CUDA10.1/build/tests/sparsity/chunk_sparsity_pattern_10.release': No space left on device
mv: cannot create directory '/var/jenkins/workspace/deal.II-CUDA10.1/build/tests/sparsity/dynamic_sparsity_pattern_09.debug': No space left on device
mv: cannot create directory '/var/jenkins/workspace/deal.II-CUDA10.1/build/tests/sparsity/dynamic_sparsity_pattern_11.debug': No space left on device
mv: cannot create directory '/var/jenkins/workspace/deal.II-CUDA10.1/build/tests/sparsity/dynamic_sparsity_pattern_16.debug': No space left on device
mv: cannot create directory '/var/jenkins/workspace/deal.II-CUDA10.1/build/tests/sparsity/dynamic_sparsity_pattern_compute_mmult_1.debug': No space left on device
mv: cannot create directory '/var/jenkins/workspace/deal.II-CUDA10.1/build/tests/sparsity/sparsity_pattern.debug': No space left on device
mv: cannot create directory '/var/jenkins/workspace/deal.II-CUDA10.1/build/tests/sparsity/sparsity_pattern_iterator_08.debug': No space left on device
mv: cannot create directory '/var/jenkins/workspace/deal.II-CUDA10.1/build/tests/sparsity/chunk_sparsity_pattern_04.debug': No space left on device
mv: cannot create directory '/var/jenkins/workspace/deal.II-CUDA10.1/build/tests/sparsity/dynamic_sparsity_pattern_iterator_08.debug': No space left on device
mv: cannot create directory '/var/jenkins/workspace/deal.II-CUDA10.1/build/tests/sparsity/sparsity_pattern_06.debug': No space left on device
mv: cannot create directory '/var/jenkins/workspace/deal.II-CUDA10.1/build/tests/sparsity/sparsity_pattern_11.debug': No space left on device
mv: cannot create directory '/var/jenkins/workspace/deal.II-CUDA10.1/build/tests/sparsity/sparsity_pattern_copy_from_02.release': No space left on device
mv: cannot create directory '/var/jenkins/workspace/deal.II-CUDA10.1/build/tests/sparsity/sparsity_pattern_iterator_01.release': No space left on device
mv: cannot create directory '/var/jenkins/workspace/deal.II-CUDA10.1/build/tests/sparsity/dynamic_sparsity_pattern_02.release': No space left on device
mv: cannot create directory '/var/jenkins/workspace/deal.II-CUDA10.1/build/tests/sparsity/dynamic_sparsity_pattern_13.release': No space left on device
mv: cannot create directory '/var/jenkins/workspace/deal.II-CUDA10.1/build/tests/sparsity/dynamic_sparsity_pattern_21.debug': No space left on device
mv: cannot create directory '/var/jenkins/workspace/deal.II-CUDA10.1/build/tests/sparsity/dynamic_sparsity_pattern_index_set_01.debug': No space left on device
mv: cannot create directory '/var/jenkins/workspace/deal.II-CUDA10.1/build/tests/sparsity/dynamic_sparsity_pattern_iterator_01.release': No space left on device
mv: cannot create directory '/var/jenkins/workspace/deal.II-CUDA10.1/build/tests/sparsity/dynamic_sparsity_pattern_iterator_03.release': No space left on device
mv: cannot create directory '/var/jenkins/workspace/deal.II-CUDA10.1/build/tests/sparsity/sparsity_pattern_02.debug': No space left on device
mv: cannot create directory '/var/jenkins/workspace/deal.II-CUDA10.1/build/tests/sparsity/sparsity_pattern_09.debug': No space left on device
mv: cannot create directory '/var/jenkins/workspace/deal.II-CUDA10.1/build/tests/sparsity/sparsity_pattern_write_svg_01.release': No space left on device
mv: cannot create directory '/var/jenkins/workspace/deal.II-CUDA10.1/build/tests/sparsity/dynamic_sparsity_pattern_05.debug': No space left on device
mv: cannot create directory '/var/jenkins/workspace/deal.II-CUDA10.1/build/tests/sparsity/dynamic_sparsity_pattern_11.release': No space left on device
mv: cannot create directory '/var/jenkins/workspace/deal.II-CUDA10.1/build/tests/sparsity/dynamic_sparsity_pattern_19.debug': No space left on device
mv: cannot create directory '/var/jenkins/workspace/deal.II-CUDA10.1/build/tests/sparsity/dynamic_sparsity_pattern_compute_mmult_1.release': No space left on device
mv: cannot create directory '/var/jenkins/workspace/deal.II-CUDA10.1/build/tests/sparsity/dynamic_sparsity_pattern_iterator_06.debug': No space left on device
mv: cannot create directory '/var/jenkins/workspace/deal.II-CUDA10.1/build/tests/sparsity/sparsity_pattern_11.release': No space left on device
mv: cannot create directory '/var/jenkins/workspace/deal.II-CUDA10.1/build/tests/sparsity/sparsity_pattern_full_matrix_01.debug': No space left on device
mv: cannot create directory '/var/jenkins/workspace/deal.II-CUDA10.1/build/tests/sparsity/block_sparsity_pattern_03.release': No space left on device
mv: cannot create directory '/var/jenkins/workspace/deal.II-CUDA10.1/build/tests/sparsity/chunk_sparsity_pattern_01.release': No space left on device
mv: cannot create directory '/var/jenkins/workspace/deal.II-CUDA10.1/build/tests/sparsity/dynamic_sparsity_pattern_01.debug': No space left on device
mv: cannot create directory '/var/jenkins/workspace/deal.II-CUDA10.1/build/tests/sparsity/sparsity_pattern_copy_from_01.debug': No space left on device
mv: cannot create directory '/var/jenkins/workspace/deal.II-CUDA10.1/build/tests/sparsity/block_sparsity_pattern_01.debug': No space left on device
mv: cannot create directory '/var/jenkins/workspace/deal.II-CUDA10.1/build/tests/sparsity/chunk_sparsity_pattern_06.debug': No space left on device
mv: cannot create directory '/var/jenkins/workspace/deal.II-CUDA10.1/build/tests/sparsity/chunk_sparsity_pattern_09.debug': No space left on device
mv: cannot create directory '/var/jenkins/workspace/deal.II-CUDA10.1/build/tests/sparsity/dynamic_sparsity_pattern_07.debug': No space left on device
mv: cannot create directory '/var/jenkins/workspace/deal.II-CUDA10.1/build/tests/sparsity/dynamic_sparsity_pattern_09.release': No space left on device
mv: cannot create directory '/var/jenkins/workspace/deal.II-CUDA10.1/build/tests/sparsity/dynamic_sparsity_pattern_14.debug': No space left on device
mv: cannot create directory '/var/jenkins/workspace/deal.II-CUDA10.1/build/tests/sparsity/dynamic_sparsity_pattern_21.release': No space left on device
mv: cannot create directory '/var/jenkins/workspace/deal.II-CUDA10.1/build/tests/sparsity/dynamic_sparsity_pattern_compute_Tmmult_1.debug': No space left on device
mv: cannot create directory '/var/jenkins/workspace/deal.II-CUDA10.1/build/tests/sparsity/dynamic_sparsity_pattern_index_set_01.release': No space left on device
mv: cannot create directory '/var/jenkins/workspace/deal.II-CUDA10.1/build/tests/sparsity/sparsity_pattern.release': No space left on device
mv: cannot create directory '/var/jenkins/workspace/deal.II-CUDA10.1/build/tests/sparsity/sparsity_pattern_06.release': No space left on device
mv: cannot create directory '/var/jenkins/workspace/deal.II-CUDA10.1/build/tests/sparsity/sparsity_pattern_iterator_08.release': No space left on device
mv: cannot create directory '/var/jenkins/workspace/deal.II-CUDA10.1/build/tests/sparsity/block_sparsity_pattern_02.release': No space left on device
mv: cannot create directory '/var/jenkins/workspace/deal.II-CUDA10.1/build/tests/sparsity/chunk_sparsity_pattern_11.debug': No space left on device
mv: cannot create directory '/var/jenkins/workspace/deal.II-CUDA10.1/build/tests/sparsity/dynamic_sparsity_pattern_01.release': No space left on device
mv: cannot create directory '/var/jenkins/workspace/deal.II-CUDA10.1/build/tests/sparsity/dynamic_sparsity_pattern_03.debug': No space left on device
mv: cannot create directory '/var/jenkins/workspace/deal.II-CUDA10.1/build/tests/sparsity/dynamic_sparsity_pattern_16.release': No space left on device
mv: cannot create directory '/var/jenkins/workspace/deal.II-CUDA10.1/build/tests/sparsity/sparsity_pattern_04.debug': No space left on device
mv: cannot create directory '/var/jenkins/workspace/deal.II-CUDA10.1/build/tests/sparsity/sparsity_pattern_09.release': No space left on device
mv: cannot create directory '/var/jenkins/workspace/deal.II-CUDA10.1/build/tests/sparsity/sparsity_pattern_12.debug': No space left on device
mv: cannot create directory '/var/jenkins/workspace/deal.II-CUDA10.1/build/tests/sparsity/block_dynamic_sparsity_pattern_indexset_01.debug': No space left on device
mv: cannot create directory '/var/jenkins/workspace/deal.II-CUDA10.1/build/tests/sparsity/chunk_sparsity_pattern_03.debug': No space left on device
mv: cannot create directory '/var/jenkins/workspace/deal.II-CUDA10.1/build/tests/sparsity/dynamic_sparsity_pattern_03.release': No space left on device
mv: cannot create directory '/var/jenkins/workspace/deal.II-CUDA10.1/build/tests/sparsity/dynamic_sparsity_pattern_05.release': No space left on device
mv: cannot create directory '/var/jenkins/workspace/deal.II-CUDA10.1/build/tests/sparsity/dynamic_sparsity_pattern_iterator_06.release': No space left on device
mv: cannot create directory '/var/jenkins/workspace/deal.II-CUDA10.1/build/tests/sparsity/dynamic_sparsity_pattern_iterator_08.release': No space left on device
mv: cannot create directory '/var/jenkins/workspace/deal.II-CUDA10.1/build/tests/sparsity/sparsity_pattern_full_matrix_01.release': No space left on device
mv: cannot create regular file '/var/jenkins/workspace/deal.II-CUDA10.1/build/tests/sparsity/CMakeCache.txt': No space left on device
mv: cannot create regular file '/var/jenkins/workspace/deal.II-CUDA10.1/build/tests/sparsity/Makefile': No space left on device
mv: cannot create regular file '/var/jenkins/workspace/deal.II-CUDA10.1/build/tests/sparsity/cmake_install.cmake': No space left on device
mv: cannot create regular file '/var/jenkins/workspace/deal.II-CUDA10.1/build/tests/sparsity/CTestTestfile.cmake': No space left on device
mv: cannot create directory '/var/jenkins/workspace/deal.II-CUDA10.1/build/tests/sparsity/chunk_sparsity_pattern_04.release': No space left on device
mv: cannot create directory '/var/jenkins/workspace/deal.II-CUDA10.1/build/tests/sparsity/chunk_sparsity_pattern_09.release': No space left on device
mv: cannot create directory '/var/jenkins/workspace/deal.II-CUDA10.1/build/tests/sparsity/chunk_sparsity_pattern_11.release': No space left on device
mv: cannot create directory '/var/jenkins/workspace/deal.II-CUDA10.1/build/tests/sparsity/dynamic_sparsity_pattern_19.release': No space left on device
mv: cannot create directory '/var/jenkins/workspace/deal.II-CUDA10.1/build/tests/sparsity/dynamic_sparsity_pattern_compute_mmult_2.debug': No space left on device
mv: cannot create directory '/var/jenkins/workspace/deal.II-CUDA10.1/build/tests/sparsity/dynamic_sparsity_pattern_iterator_02.debug': No space left on device
mv: cannot create directory '/var/jenkins/workspace/deal.II-CUDA10.1/build/tests/sparsity/dynamic_sparsity_pattern_iterator_04.debug': No space left on device
mv: cannot create directory '/var/jenkins/workspace/deal.II-CUDA10.1/build/tests/sparsity/sparsity_pattern_04.release': No space left on device
mv: cannot create directory '/var/jenkins/workspace/deal.II-CUDA10.1/build/tests/sparsity/chunk_sparsity_pattern_06.release': No space left on device
mv: cannot create directory '/var/jenkins/workspace/deal.II-CUDA10.1/build/tests/sparsity/dynamic_sparsity_pattern_compute_Tmmult_1.release': No space left on device
mv: cannot create directory '/var/jenkins/workspace/deal.II-CUDA10.1/build/tests/sparsity/dynamic_sparsity_pattern_index_set_02.debug': No space left on device
mv: cannot create directory '/var/jenkins/workspace/deal.II-CUDA10.1/build/tests/sparsity/sparsity_pattern_iterator_09.debug': No space left on device
mv: cannot create directory '/var/jenkins/workspace/deal.II-CUDA10.1/build/tests/sparsity/sparsity_tools_01.debug': No space left on device
mv: cannot create directory '/var/jenkins/workspace/deal.II-CUDA10.1/build/tests/sparsity/dynamic_sparsity_pattern_iterator_09.debug': No space left on device
mv: cannot create directory '/var/jenkins/workspace/deal.II-CUDA10.1/build/tests/sparsity/sparsity_pattern_02.release': No space left on device
mv: cannot create directory '/var/jenkins/workspace/deal.II-CUDA10.1/build/tests/sparsity/sparsity_pattern_07.debug': No space left on device
mv: cannot create directory '/var/jenkins/workspace/deal.II-CUDA10.1/build/tests/sparsity/sparsity_pattern_10.debug': No space left on device
mv: cannot create directory '/var/jenkins/workspace/deal.II-CUDA10.1/build/tests/sparsity/sparsity_pattern_full_matrix_02.debug': No space left on device
mv: cannot create directory '/var/jenkins/workspace/deal.II-CUDA10.1/build/tests/sparsity/sparsity_pattern_iterator_07.debug': No space left on device
mv: cannot create directory '/var/jenkins/workspace/deal.II-CUDA10.1/build/tests/sparsity/block_sparsity_pattern_01.release': No space left on device
mv: cannot create directory '/var/jenkins/workspace/deal.II-CUDA10.1/build/tests/sparsity/chunk_sparsity_pattern_02.debug': No space left on device
mv: cannot create directory '/var/jenkins/workspace/deal.II-CUDA10.1/build/tests/sparsity/dynamic_sparsity_pattern_04.debug': No space left on device
mv: cannot create directory '/var/jenkins/workspace/deal.II-CUDA10.1/build/tests/sparsity/dynamic_sparsity_pattern_07.release': No space left on device
mv: cannot create directory '/var/jenkins/workspace/deal.II-CUDA10.1/build/tests/sparsity/dynamic_sparsity_pattern_12.debug': No space left on device
mv: cannot create directory '/var/jenkins/workspace/deal.II-CUDA10.1/build/tests/sparsity/dynamic_sparsity_pattern_iterator_02.release': No space left on device
mv: cannot create directory '/var/jenkins/workspace/deal.II-CUDA10.1/build/tests/sparsity/dynamic_sparsity_pattern_iterator_04.release': No space left on device
mv: cannot create directory '/var/jenkins/workspace/deal.II-CUDA10.1/build/tests/sparsity/sparsity_pattern_12.release': No space left on device
mv: cannot create directory '/var/jenkins/workspace/deal.II-CUDA10.1/build/tests/sparsity/sparsity_pattern_copy_from_01.release': No space left on device
mv: cannot create directory '/var/jenkins/workspace/deal.II-CUDA10.1/build/tests/sparsity/sparsity_pattern_iterator_07.release': No space left on device
mv: cannot create directory '/var/jenkins/workspace/deal.II-CUDA10.1/build/tests/sparsity/dynamic_sparsity_pattern_06.debug': No space left on device
mv: cannot create directory '/var/jenkins/workspace/deal.II-CUDA10.1/build/tests/sparsity/dynamic_sparsity_pattern_10.debug': No space left on device
mv: cannot create directory '/var/jenkins/workspace/deal.II-CUDA10.1/build/tests/sparsity/dynamic_sparsity_pattern_14.release': No space left on device
mv: cannot create directory '/var/jenkins/workspace/deal.II-CUDA10.1/build/tests/sparsity/dynamic_sparsity_pattern_22.debug': No space left on device
mv: cannot create directory '/var/jenkins/workspace/deal.II-CUDA10.1/build/tests/sparsity/dynamic_sparsity_pattern_compute_Tmmult_2.debug': No space left on device
mv: cannot create directory '/var/jenkins/workspace/deal.II-CUDA10.1/build/tests/sparsity/sparsity_pattern_01.debug': No space left on device
mv: cannot create directory '/var/jenkins/workspace/deal.II-CUDA10.1/build/tests/sparsity/sparsity_pattern_05.debug': No space left on device
mv: cannot create directory '/var/jenkins/workspace/deal.II-CUDA10.1/build/tests/sparsity/sparsity_pattern_07.release': No space left on device
mv: cannot create directory '/var/jenkins/workspace/deal.II-CUDA10.1/build/tests/sparsity/sparsity_tools_01.release': No space left on device
mv: cannot create directory '/var/jenkins/workspace/deal.II-CUDA10.1/build/tests/sparsity/block_dynamic_01.debug': No space left on device
mv: cannot create directory '/var/jenkins/workspace/deal.II-CUDA10.1/build/tests/sparsity/chunk_sparsity_pattern_01.debug': No space left on device
mv: cannot create directory '/var/jenkins/workspace/deal.II-CUDA10.1/build/tests/sparsity/chunk_sparsity_pattern_03.release': No space left on device
mv: cannot create directory '/var/jenkins/workspace/deal.II-CUDA10.1/build/tests/sparsity/chunk_sparsity_pattern_07.debug': No space left on device
mv: cannot create directory '/var/jenkins/workspace/deal.II-CUDA10.1/build/tests/sparsity/chunk_sparsity_pattern_12.debug': No space left on device
mv: cannot create directory '/var/jenkins/workspace/deal.II-CUDA10.1/build/tests/sparsity/dynamic_sparsity_pattern_iterator_07.debug': No space left on device
mv: cannot create directory '/var/jenkins/workspace/deal.II-CUDA10.1/build/tests/sparsity/chunk_sparsity_pattern_05.debug': No space left on device
mv: cannot create directory '/var/jenkins/workspace/deal.II-CUDA10.1/build/tests/sparsity/dynamic_sparsity_pattern_08.debug': No space left on device
mv: cannot create directory '/var/jenkins/workspace/deal.II-CUDA10.1/build/tests/sparsity/dynamic_sparsity_pattern_12.release': No space left on device
mv: cannot create directory '/var/jenkins/workspace/deal.II-CUDA10.1/build/tests/sparsity/dynamic_sparsity_pattern_17.debug': No space left on device
mv: cannot create directory '/var/jenkins/workspace/deal.II-CUDA10.1/build/tests/sparsity/dynamic_sparsity_pattern_20.debug': No space left on device
mv: cannot create directory '/var/jenkins/workspace/deal.II-CUDA10.1/build/tests/sparsity/dynamic_sparsity_pattern_compute_mmult_2.release': No space left on device
mv: cannot create directory '/var/jenkins/workspace/deal.II-CUDA10.1/build/tests/sparsity/dynamic_sparsity_pattern_index_set_02.release': No space left on device
mv: cannot create directory '/var/jenkins/workspace/deal.II-CUDA10.1/build/tests/sparsity/dynamic_sparsity_pattern_iterator_09.release': No space left on device
mv: cannot create directory '/var/jenkins/workspace/deal.II-CUDA10.1/build/tests/sparsity/sparsity_pattern_full_matrix_02.release': No space left on device
mv: cannot create directory '/var/jenkins/workspace/deal.II-CUDA10.1/build/tests/sparsity/sparsity_pattern_iterator_09.release': No space left on device
mv: cannot create directory '/var/jenkins/workspace/deal.II-CUDA10.1/build/tests/sparsity/sparsity_tools_02.debug': No space left on device
mv: setting attribute 'security.selinux' for 'security.selinux': No space left on device
mv: cannot create directory '/var/jenkins/workspace/deal.II-CUDA10.1/build/tests/cuda': No space left on device
mv: cannot create directory '/var/jenkins/workspace/deal.II-CUDA10.1/build/tests/metis': No space left on device
mv: cannot create directory '/var/jenkins/workspace/deal.II-CUDA10.1/build/tests/sundials': No space left on device
mv: cannot create directory '/var/jenkins/workspace/deal.II-CUDA10.1/build/tests/data_out': No space left on device
mv: cannot create directory '/var/jenkins/workspace/deal.II-CUDA10.1/build/tests/mpi': No space left on device
mv: cannot create directory '/var/jenkins/workspace/deal.II-CUDA10.1/build/tests/symengine': No space left on device
mv: cannot create directory '/var/jenkins/workspace/deal.II-CUDA10.1/build/tests/distributed_grids': No space left on device
mv: cannot create directory '/var/jenkins/workspace/deal.II-CUDA10.1/build/tests/multigrid': No space left on device
mv: cannot create directory '/var/jenkins/workspace/deal.II-CUDA10.1/build/tests/tensors': No space left on device
mv: cannot create directory '/var/jenkins/workspace/deal.II-CUDA10.1/build/tests/dofs': No space left on device
mv: cannot create directory '/var/jenkins/workspace/deal.II-CUDA10.1/build/tests/non_matching': No space left on device
mv: cannot create directory '/var/jenkins/workspace/deal.II-CUDA10.1/build/tests/trilinos': No space left on device
mv: cannot create directory '/var/jenkins/workspace/deal.II-CUDA10.1/build/tests/epetraext': No space left on device
mv: cannot create directory '/var/jenkins/workspace/deal.II-CUDA10.1/build/tests/numerics': No space left on device
mv: cannot create directory '/var/jenkins/workspace/deal.II-CUDA10.1/build/tests/umfpack': No space left on device
mv: cannot create directory '/var/jenkins/workspace/deal.II-CUDA10.1/build/tests/examples': No space left on device
mv: cannot create directory '/var/jenkins/workspace/deal.II-CUDA10.1/build/tests/opencascade': No space left on device
mv: cannot create directory '/var/jenkins/workspace/deal.II-CUDA10.1/build/tests/vector': No space left on device
mv: cannot create regular file '/var/jenkins/workspace/deal.II-CUDA10.1/build/tests/CTestTestfile.cmake': No space left on device
mv: cannot create directory '/var/jenkins/workspace/deal.II-CUDA10.1/build/tests/fe': No space left on device
mv: cannot create directory '/var/jenkins/workspace/deal.II-CUDA10.1/build/tests/optimization': No space left on device
mv: cannot create directory '/var/jenkins/workspace/deal.II-CUDA10.1/build/tests/vector_tools': No space left on device
mv: cannot create regular file '/var/jenkins/workspace/deal.II-CUDA10.1/build/tests/Makefile': No space left on device
mv: cannot create regular file '/var/jenkins/workspace/deal.II-CUDA10.1/build/tests/cmake_install.cmake': No space left on device
mv: setting attribute 'security.selinux' for 'security.selinux': No space left on device
mv: setting attribute 'security.selinux' for 'security.selinux': No space left on device
+ docker rm -f cuda10_deal_ci
cuda10_deal_ci
Build step 'Execute shell' marked build as failure
[WARNINGS] Skipping publisher since build result is FAILURE
INFO: Starting to record.
INFO: Processing CTest-Version 3.x (default)
INFO: [CTest-Version 3.x (default)] - 1 test report file(s) were found with the pattern 'build/Testing/**/Test.xml' relative to '/var/jenkins/workspace/deal.II-CUDA10.1' for the testing framework 'CTest-Version 3.x (default)'.
INFO: Check 'Failed Tests' threshold.
INFO: The total number of tests for the threshold 'Failed Tests' exceeds the specified "failure threshold" value.
INFO: Setting the build status to FAILURE
INFO: Stopping recording.
Finished: FAILURE