Console Output

Skipping 2,201 KB.. Full Log
            Start  7926: mpi/collective_min_vector_in_place.mpirun=4.debug
11121/11593 Test  #7976: mpi/count_dofs_per_block_01.mpirun=10.debug ............................................   Passed   26.86 sec
            Start  7977: mpi/count_dofs_per_block_01.mpirun=10.release
11122/11593 Test  #7926: mpi/collective_min_vector_in_place.mpirun=4.debug ......................................   Passed    5.17 sec
            Start  7927: mpi/collective_min_vector_in_place.mpirun=4.release
11123/11593 Test  #7970: mpi/constraint_matrix_trilinos_bug.mpirun=10.debug .....................................   Passed   29.81 sec
            Start  7980: mpi/count_dofs_per_block_02.mpirun=10.debug
11124/11593 Test  #7927: mpi/collective_min_vector_in_place.mpirun=4.release ....................................   Passed    2.95 sec
            Start  7936: mpi/collective_tensor.mpirun=4.debug
11125/11593 Test  #7936: mpi/collective_tensor.mpirun=4.debug ...................................................   Passed    2.92 sec
            Start  7937: mpi/collective_tensor.mpirun=4.release
11126/11593 Test  #7937: mpi/collective_tensor.mpirun=4.release .................................................   Passed    2.93 sec
            Start  7962: mpi/compute_mean_value.mpirun=4.debug
11127/11593 Test  #7962: mpi/compute_mean_value.mpirun=4.debug ..................................................   Passed    3.83 sec
            Start  7963: mpi/compute_mean_value.mpirun=4.release
11128/11593 Test  #7963: mpi/compute_mean_value.mpirun=4.release ................................................   Passed    3.02 sec
            Start  7971: mpi/constraint_matrix_trilinos_bug.mpirun=4.debug
11129/11593 Test  #7971: mpi/constraint_matrix_trilinos_bug.mpirun=4.debug ......................................   Passed    3.16 sec
            Start  7978: mpi/count_dofs_per_block_01.mpirun=4.debug
11130/11593 Test  #7977: mpi/count_dofs_per_block_01.mpirun=10.release ..........................................   Passed   19.50 sec
            Start  7981: mpi/count_dofs_per_block_02.mpirun=10.release
11131/11593 Test  #7980: mpi/count_dofs_per_block_02.mpirun=10.debug ............................................   Passed   23.92 sec
            Start  7984: mpi/count_dofs_per_component_01.mpirun=10.debug
11132/11593 Test  #7978: mpi/count_dofs_per_block_01.mpirun=4.debug .............................................   Passed    5.99 sec
            Start  7979: mpi/count_dofs_per_block_01.mpirun=4.release
11133/11593 Test  #7979: mpi/count_dofs_per_block_01.mpirun=4.release ...........................................   Passed    2.97 sec
            Start  7982: mpi/count_dofs_per_block_02.mpirun=4.debug
11134/11593 Test  #7982: mpi/count_dofs_per_block_02.mpirun=4.debug .............................................   Passed    3.94 sec
11135/11593 Test  #7981: mpi/count_dofs_per_block_02.mpirun=10.release ..........................................   Passed   20.52 sec
            Start  7985: mpi/count_dofs_per_component_01.mpirun=10.release
            Start  7983: mpi/count_dofs_per_block_02.mpirun=4.release
11136/11593 Test  #7983: mpi/count_dofs_per_block_02.mpirun=4.release ...........................................   Passed    2.97 sec
11137/11593 Test  #7984: mpi/count_dofs_per_component_01.mpirun=10.debug ........................................   Passed   22.19 sec
            Start  7988: mpi/crash_01.mpirun=10.debug
            Start  7986: mpi/count_dofs_per_component_01.mpirun=4.debug
11138/11593 Test  #7986: mpi/count_dofs_per_component_01.mpirun=4.debug .........................................   Passed    3.23 sec
11139/11593 Test  #7985: mpi/count_dofs_per_component_01.mpirun=10.release ......................................   Passed   20.02 sec
            Start  7989: mpi/crash_01.mpirun=10.release
            Start  7987: mpi/count_dofs_per_component_01.mpirun=4.release
11140/11593 Test  #7987: mpi/count_dofs_per_component_01.mpirun=4.release .......................................   Passed    3.02 sec
11141/11593 Test  #7988: mpi/crash_01.mpirun=10.debug ...........................................................   Passed   20.31 sec
            Start  7994: mpi/crash_03.mpirun=10.debug
            Start  7990: mpi/crash_01.mpirun=4.debug
11142/11593 Test  #7990: mpi/crash_01.mpirun=4.debug ............................................................   Passed    3.09 sec
11143/11593 Test  #7989: mpi/crash_01.mpirun=10.release .........................................................   Passed   17.97 sec
            Start  7995: mpi/crash_03.mpirun=10.release
            Start  7991: mpi/crash_01.mpirun=4.release
11144/11593 Test  #7991: mpi/crash_01.mpirun=4.release ..........................................................   Passed    2.93 sec
11145/11593 Test  #7994: mpi/crash_03.mpirun=10.debug ...........................................................   Passed   19.09 sec
            Start  8035: mpi/distribute_sp_01.mpirun=10.debug
            Start  7996: mpi/crash_03.mpirun=4.debug
11146/11593 Test  #7996: mpi/crash_03.mpirun=4.debug ............................................................   Passed    3.11 sec
11147/11593 Test  #7995: mpi/crash_03.mpirun=10.release .........................................................   Passed   15.63 sec
            Start  8036: mpi/distribute_sp_01.mpirun=10.release
            Start  7997: mpi/crash_03.mpirun=4.release
11148/11593 Test  #7997: mpi/crash_03.mpirun=4.release ..........................................................   Passed    3.10 sec
11149/11593 Test  #8035: mpi/distribute_sp_01.mpirun=10.debug ...................................................   Passed   14.76 sec
            Start  8039: mpi/distribute_sp_02.mpirun=10.debug
            Start  8037: mpi/distribute_sp_01.mpirun=4.debug
11150/11593 Test  #8037: mpi/distribute_sp_01.mpirun=4.debug ....................................................   Passed    3.07 sec
11151/11593 Test  #8036: mpi/distribute_sp_01.mpirun=10.release .................................................   Passed   12.90 sec
            Start  8040: mpi/distribute_sp_02.mpirun=10.release
            Start  8038: mpi/distribute_sp_01.mpirun=4.release
11152/11593 Test  #8038: mpi/distribute_sp_01.mpirun=4.release ..................................................   Passed    2.93 sec
11153/11593 Test  #8039: mpi/distribute_sp_02.mpirun=10.debug ...................................................   Passed   14.94 sec
            Start  8043: mpi/dof_handler_number_cache.mpirun=10.debug
            Start  8041: mpi/distribute_sp_02.mpirun=4.debug
11154/11593 Test  #8041: mpi/distribute_sp_02.mpirun=4.debug ....................................................   Passed    3.13 sec
11155/11593 Test  #8040: mpi/distribute_sp_02.mpirun=10.release .................................................   Passed   13.46 sec
            Start  8044: mpi/dof_handler_number_cache.mpirun=10.release
            Start  8042: mpi/distribute_sp_02.mpirun=4.release
11156/11593 Test  #8042: mpi/distribute_sp_02.mpirun=4.release ..................................................   Passed    3.02 sec
11157/11593 Test  #8043: mpi/dof_handler_number_cache.mpirun=10.debug ...........................................   Passed   29.17 sec
            Start  8055: mpi/extract_boundary_dofs.mpirun=10.debug
            Start  8045: mpi/dof_handler_number_cache.mpirun=4.debug
11158/11593 Test  #8044: mpi/dof_handler_number_cache.mpirun=10.release .........................................   Passed   26.20 sec
            Start  8056: mpi/extract_boundary_dofs.mpirun=10.release
11159/11593 Test  #8045: mpi/dof_handler_number_cache.mpirun=4.debug ............................................   Passed    4.21 sec
            Start  8046: mpi/dof_handler_number_cache.mpirun=4.release
11160/11593 Test  #8046: mpi/dof_handler_number_cache.mpirun=4.release ..........................................   Passed    3.02 sec
11161/11593 Test  #8056: mpi/extract_boundary_dofs.mpirun=10.release ............................................   Passed   20.14 sec
            Start  8059: mpi/extract_constant_modes_01.mpirun=10.debug
            Start  8058: mpi/extract_boundary_dofs.mpirun=4.release
11162/11593 Test  #8055: mpi/extract_boundary_dofs.mpirun=10.debug ..............................................   Passed   23.14 sec
            Start  8060: mpi/extract_constant_modes_01.mpirun=10.release
11163/11593 Test  #8058: mpi/extract_boundary_dofs.mpirun=4.release .............................................   Passed    3.04 sec
            Start  8057: mpi/extract_boundary_dofs.mpirun=4.debug
11164/11593 Test  #8057: mpi/extract_boundary_dofs.mpirun=4.debug ...............................................   Passed    3.73 sec
11165/11593 Test  #8060: mpi/extract_constant_modes_01.mpirun=10.release ........................................   Passed   18.20 sec
            Start  8065: mpi/extract_locally_active_dofs.mpirun=10.debug
            Start  8062: mpi/extract_constant_modes_01.mpirun=4.release
11166/11593 Test  #8059: mpi/extract_constant_modes_01.mpirun=10.debug ..........................................   Passed   21.13 sec
            Start  8066: mpi/extract_locally_active_dofs.mpirun=10.release
11167/11593 Test  #8062: mpi/extract_constant_modes_01.mpirun=4.release .........................................   Passed    3.02 sec
            Start  8061: mpi/extract_constant_modes_01.mpirun=4.debug
11168/11593 Test  #8061: mpi/extract_constant_modes_01.mpirun=4.debug ...........................................   Passed    3.11 sec
11169/11593 Test  #8066: mpi/extract_locally_active_dofs.mpirun=10.release ......................................   Passed   18.82 sec
            Start  8069: mpi/extract_locally_active_level_dofs.mpirun=10.debug
            Start  8068: mpi/extract_locally_active_dofs.mpirun=4.release
11170/11593 Test  #8065: mpi/extract_locally_active_dofs.mpirun=10.debug ........................................   Passed   22.50 sec
            Start  8070: mpi/extract_locally_active_level_dofs.mpirun=10.release
11171/11593 Test  #8068: mpi/extract_locally_active_dofs.mpirun=4.release .......................................   Passed    3.00 sec
            Start  8067: mpi/extract_locally_active_dofs.mpirun=4.debug
11172/11593 Test  #8067: mpi/extract_locally_active_dofs.mpirun=4.debug .........................................   Passed    3.73 sec
11173/11593 Test  #8069: mpi/extract_locally_active_level_dofs.mpirun=10.debug ..................................   Passed   23.24 sec
            Start  8073: mpi/fe_field_function_01.mpirun=10.debug
            Start  8071: mpi/extract_locally_active_level_dofs.mpirun=4.debug
11174/11593 Test  #8070: mpi/extract_locally_active_level_dofs.mpirun=10.release ................................   Passed   21.25 sec
            Start  8074: mpi/fe_field_function_01.mpirun=10.release
11175/11593 Test  #8071: mpi/extract_locally_active_level_dofs.mpirun=4.debug ...................................   Passed    4.08 sec
            Start  8072: mpi/extract_locally_active_level_dofs.mpirun=4.release
11176/11593 Test  #8072: mpi/extract_locally_active_level_dofs.mpirun=4.release .................................   Passed    3.13 sec
11177/11593 Test  #8074: mpi/fe_field_function_01.mpirun=10.release .............................................   Passed   24.62 sec
            Start  8087: mpi/fe_tools_extrapolate_03.mpirun=10.debug
            Start  8076: mpi/fe_field_function_01.mpirun=4.release
11178/11593 Test  #8076: mpi/fe_field_function_01.mpirun=4.release ..............................................   Passed    4.28 sec
11179/11593 Test  #8073: mpi/fe_field_function_01.mpirun=10.debug ...............................................   Passed   58.10 sec
            Start  8088: mpi/fe_tools_extrapolate_03.mpirun=10.release
            Start  8075: mpi/fe_field_function_01.mpirun=4.debug
11180/11593 Test  #8087: mpi/fe_tools_extrapolate_03.mpirun=10.debug ............................................   Passed   34.25 sec
            Start  8149: mpi/hp_integrate_difference.mpirun=10.debug
11181/11593 Test  #8088: mpi/fe_tools_extrapolate_03.mpirun=10.release ..........................................   Passed    3.41 sec
            Start  8150: mpi/hp_integrate_difference.mpirun=10.release
11182/11593 Test  #8075: mpi/fe_field_function_01.mpirun=4.debug ................................................   Passed   19.08 sec
            Start  8089: mpi/fe_tools_extrapolate_03.mpirun=3.debug
            Start  8090: mpi/fe_tools_extrapolate_03.mpirun=3.release
11183/11593 Test  #8089: mpi/fe_tools_extrapolate_03.mpirun=3.debug .............................................***Failed    3.33 sec
11184/11593 Test  #8090: mpi/fe_tools_extrapolate_03.mpirun=3.release ...........................................***Failed    4.04 sec
11185/11593 Test  #8150: mpi/hp_integrate_difference.mpirun=10.release ..........................................   Passed   25.52 sec
            Start  8211: mpi/integrate_difference.mpirun=10.debug
            Start  8152: mpi/hp_integrate_difference.mpirun=4.release
11186/11593 Test  #8149: mpi/hp_integrate_difference.mpirun=10.debug ............................................   Passed   29.93 sec
            Start  8212: mpi/integrate_difference.mpirun=10.release
11187/11593 Test  #8152: mpi/hp_integrate_difference.mpirun=4.release ...........................................   Passed    3.17 sec
            Start  8151: mpi/hp_integrate_difference.mpirun=4.debug
11188/11593 Test  #8151: mpi/hp_integrate_difference.mpirun=4.debug .............................................   Passed    4.50 sec
11189/11593 Test  #8212: mpi/integrate_difference.mpirun=10.release .............................................   Passed   24.50 sec
            Start  8215: mpi/interpolate_01.mpirun=10.debug
            Start  8214: mpi/integrate_difference.mpirun=4.release
11190/11593 Test  #8211: mpi/integrate_difference.mpirun=10.debug ...............................................   Passed   27.51 sec
            Start  8216: mpi/interpolate_01.mpirun=10.release
11191/11593 Test  #8214: mpi/integrate_difference.mpirun=4.release ..............................................   Passed    3.12 sec
            Start  8213: mpi/integrate_difference.mpirun=4.debug
11192/11593 Test  #8213: mpi/integrate_difference.mpirun=4.debug ................................................   Passed    3.51 sec
11193/11593 Test  #8216: mpi/interpolate_01.mpirun=10.release ...................................................   Passed   23.93 sec
            Start  8219: mpi/interpolate_03.mpirun=10.debug
            Start  8218: mpi/interpolate_01.mpirun=4.release
11194/11593 Test  #8215: mpi/interpolate_01.mpirun=10.debug .....................................................   Passed   27.59 sec
            Start  8220: mpi/interpolate_03.mpirun=10.release
11195/11593 Test  #8218: mpi/interpolate_01.mpirun=4.release ....................................................   Passed    3.09 sec
            Start  8217: mpi/interpolate_01.mpirun=4.debug
11196/11593 Test  #8217: mpi/interpolate_01.mpirun=4.debug ......................................................   Passed    3.11 sec
11197/11593 Test  #8220: mpi/interpolate_03.mpirun=10.release ...................................................   Passed   21.47 sec
            Start  8229: mpi/is_locally_owned.mpirun=10.debug
            Start  8222: mpi/interpolate_03.mpirun=4.release
11198/11593 Test  #8219: mpi/interpolate_03.mpirun=10.debug .....................................................   Passed   24.56 sec
            Start  8230: mpi/is_locally_owned.mpirun=10.release
11199/11593 Test  #8222: mpi/interpolate_03.mpirun=4.release ....................................................   Passed    3.04 sec
            Start  8221: mpi/interpolate_03.mpirun=4.debug
11200/11593 Test  #8221: mpi/interpolate_03.mpirun=4.debug ......................................................   Passed    3.19 sec
11201/11593 Test  #8230: mpi/is_locally_owned.mpirun=10.release .................................................   Passed   18.46 sec
            Start  8255: mpi/make_zero_boundary_values.mpirun=10.debug
            Start  8232: mpi/is_locally_owned.mpirun=4.release
11202/11593 Test  #8232: mpi/is_locally_owned.mpirun=4.release ..................................................   Passed    3.08 sec
11203/11593 Test  #8229: mpi/is_locally_owned.mpirun=10.debug ...................................................   Passed   22.81 sec
            Start  8256: mpi/make_zero_boundary_values.mpirun=10.release
            Start  8231: mpi/is_locally_owned.mpirun=4.debug
11204/11593 Test  #8231: mpi/is_locally_owned.mpirun=4.debug ....................................................   Passed    2.96 sec
11205/11593 Test  #8255: mpi/make_zero_boundary_values.mpirun=10.debug ..........................................   Passed   22.16 sec
            Start  8259: mpi/map_dofs_to_support_points.mpirun=10.debug
            Start  8257: mpi/make_zero_boundary_values.mpirun=4.debug
11206/11593 Test  #8256: mpi/make_zero_boundary_values.mpirun=10.release ........................................   Passed   20.37 sec
            Start  8260: mpi/map_dofs_to_support_points.mpirun=10.release
11207/11593 Test  #8257: mpi/make_zero_boundary_values.mpirun=4.debug ...........................................   Passed    3.69 sec
            Start  8258: mpi/make_zero_boundary_values.mpirun=4.release
11208/11593 Test  #8258: mpi/make_zero_boundary_values.mpirun=4.release .........................................   Passed    2.83 sec
11209/11593 Test  #8259: mpi/map_dofs_to_support_points.mpirun=10.debug .........................................   Passed   22.41 sec
            Start  8281: mpi/mg_01.mpirun=10.debug
            Start  8261: mpi/map_dofs_to_support_points.mpirun=4.debug
11210/11593 Test  #8260: mpi/map_dofs_to_support_points.mpirun=10.release .......................................   Passed   20.58 sec
            Start  8282: mpi/mg_01.mpirun=10.release
11211/11593 Test  #8261: mpi/map_dofs_to_support_points.mpirun=4.debug ..........................................   Passed    3.16 sec
            Start  8262: mpi/map_dofs_to_support_points.mpirun=4.release
11212/11593 Test  #8262: mpi/map_dofs_to_support_points.mpirun=4.release ........................................   Passed    3.02 sec
11213/11593 Test  #8282: mpi/mg_01.mpirun=10.release ............................................................   Passed   15.81 sec
            Start  8285: mpi/mg_02.mpirun=10.debug
            Start  8284: mpi/mg_01.mpirun=4.release
11214/11593 Test  #8281: mpi/mg_01.mpirun=10.debug ..............................................................   Passed   18.59 sec
            Start  8286: mpi/mg_02.mpirun=10.release
11215/11593 Test  #8284: mpi/mg_01.mpirun=4.release .............................................................   Passed    3.00 sec
            Start  8283: mpi/mg_01.mpirun=4.debug
11216/11593 Test  #8283: mpi/mg_01.mpirun=4.debug ...............................................................   Passed    2.95 sec
11217/11593 Test  #8285: mpi/mg_02.mpirun=10.debug ..............................................................   Passed   25.61 sec
            Start  8291: mpi/mg_03.mpirun=10.debug
            Start  8287: mpi/mg_02.mpirun=4.debug
11218/11593 Test  #8286: mpi/mg_02.mpirun=10.release ............................................................   Passed   23.30 sec
            Start  8292: mpi/mg_03.mpirun=10.release
11219/11593 Test  #8287: mpi/mg_02.mpirun=4.debug ...............................................................   Passed    3.18 sec
            Start  8288: mpi/mg_02.mpirun=4.release
11220/11593 Test  #8291: mpi/mg_03.mpirun=10.debug ..............................................................   Passed    3.34 sec
            Start  8361: mpi/p4est_2d_coarse_01.mpirun=10.debug
11221/11593 Test  #8292: mpi/mg_03.mpirun=10.release ............................................................   Passed    3.09 sec
            Start  8362: mpi/p4est_2d_coarse_01.mpirun=10.release
11222/11593 Test  #8288: mpi/mg_02.mpirun=4.release .............................................................   Passed    3.00 sec
            Start  8293: mpi/mg_03.mpirun=4.debug
11223/11593 Test  #8293: mpi/mg_03.mpirun=4.debug ...............................................................   Passed    3.11 sec
            Start  8294: mpi/mg_03.mpirun=4.release
11224/11593 Test  #8294: mpi/mg_03.mpirun=4.release .............................................................   Passed    2.98 sec
11225/11593 Test  #8362: mpi/p4est_2d_coarse_01.mpirun=10.release ...............................................   Passed   19.74 sec
            Start  8365: mpi/p4est_2d_constraintmatrix_01.mpirun=10.debug
            Start  8364: mpi/p4est_2d_coarse_01.mpirun=4.release
11226/11593 Test  #8364: mpi/p4est_2d_coarse_01.mpirun=4.release ................................................   Passed    3.55 sec
11227/11593 Test  #8361: mpi/p4est_2d_coarse_01.mpirun=10.debug .................................................   Passed   33.76 sec
            Start  8366: mpi/p4est_2d_constraintmatrix_01.mpirun=10.release
            Start  8363: mpi/p4est_2d_coarse_01.mpirun=4.debug
11228/11593 Test  #8365: mpi/p4est_2d_constraintmatrix_01.mpirun=10.debug .......................................   Passed   21.06 sec
            Start  8369: mpi/p4est_2d_constraintmatrix_02.mpirun=10.debug
11229/11593 Test  #8363: mpi/p4est_2d_coarse_01.mpirun=4.debug ..................................................   Passed   13.68 sec
            Start  8367: mpi/p4est_2d_constraintmatrix_01.mpirun=4.debug
11230/11593 Test  #8367: mpi/p4est_2d_constraintmatrix_01.mpirun=4.debug ........................................   Passed    3.11 sec
11231/11593 Test  #8366: mpi/p4est_2d_constraintmatrix_01.mpirun=10.release .....................................   Passed   18.13 sec
            Start  8370: mpi/p4est_2d_constraintmatrix_02.mpirun=10.release
            Start  8368: mpi/p4est_2d_constraintmatrix_01.mpirun=4.release
11232/11593 Test  #8368: mpi/p4est_2d_constraintmatrix_01.mpirun=4.release ......................................   Passed    3.04 sec
11233/11593 Test  #8369: mpi/p4est_2d_constraintmatrix_02.mpirun=10.debug .......................................   Passed   21.09 sec
            Start  8373: mpi/p4est_2d_constraintmatrix_03.mpirun=10.debug
            Start  8371: mpi/p4est_2d_constraintmatrix_02.mpirun=4.debug
11234/11593 Test  #8371: mpi/p4est_2d_constraintmatrix_02.mpirun=4.debug ........................................   Passed    3.22 sec
11235/11593 Test  #8370: mpi/p4est_2d_constraintmatrix_02.mpirun=10.release .....................................   Passed   17.89 sec
            Start  8374: mpi/p4est_2d_constraintmatrix_03.mpirun=10.release
            Start  8372: mpi/p4est_2d_constraintmatrix_02.mpirun=4.release
11236/11593 Test  #8372: mpi/p4est_2d_constraintmatrix_02.mpirun=4.release ......................................   Passed    2.98 sec
11237/11593 Test  #8373: mpi/p4est_2d_constraintmatrix_03.mpirun=10.debug .......................................   Passed   25.84 sec
            Start  8377: mpi/p4est_2d_constraintmatrix_04.mpirun=10.debug
            Start  8375: mpi/p4est_2d_constraintmatrix_03.mpirun=4.debug
11238/11593 Test  #8375: mpi/p4est_2d_constraintmatrix_03.mpirun=4.debug ........................................   Passed    3.69 sec
11239/11593 Test  #8374: mpi/p4est_2d_constraintmatrix_03.mpirun=10.release .....................................   Passed   22.60 sec
            Start  8378: mpi/p4est_2d_constraintmatrix_04.mpirun=10.release
            Start  8376: mpi/p4est_2d_constraintmatrix_03.mpirun=4.release
11240/11593 Test  #8376: mpi/p4est_2d_constraintmatrix_03.mpirun=4.release ......................................   Passed    3.09 sec
11241/11593 Test  #8377: mpi/p4est_2d_constraintmatrix_04.mpirun=10.debug .......................................   Passed   26.92 sec
            Start  8383: mpi/p4est_2d_dofhandler_01.mpirun=10.debug
            Start  8379: mpi/p4est_2d_constraintmatrix_04.mpirun=4.debug
11242/11593 Test  #8378: mpi/p4est_2d_constraintmatrix_04.mpirun=10.release .....................................   Passed   23.41 sec
            Start  8384: mpi/p4est_2d_dofhandler_01.mpirun=10.release
11243/11593 Test  #8379: mpi/p4est_2d_constraintmatrix_04.mpirun=4.debug ........................................   Passed    4.79 sec
            Start  8380: mpi/p4est_2d_constraintmatrix_04.mpirun=4.release
11244/11593 Test  #8380: mpi/p4est_2d_constraintmatrix_04.mpirun=4.release ......................................   Passed    3.08 sec
11245/11593 Test  #8384: mpi/p4est_2d_dofhandler_01.mpirun=10.release ...........................................   Passed   18.45 sec
            Start  8387: mpi/p4est_2d_dofhandler_02.mpirun=10.debug
            Start  8386: mpi/p4est_2d_dofhandler_01.mpirun=4.release
11246/11593 Test  #8386: mpi/p4est_2d_dofhandler_01.mpirun=4.release ............................................   Passed    2.99 sec
11247/11593 Test  #8383: mpi/p4est_2d_dofhandler_01.mpirun=10.debug .............................................   Passed   23.22 sec
            Start  8388: mpi/p4est_2d_dofhandler_02.mpirun=10.release
            Start  8385: mpi/p4est_2d_dofhandler_01.mpirun=4.debug
11248/11593 Test  #8385: mpi/p4est_2d_dofhandler_01.mpirun=4.debug ..............................................   Passed    3.07 sec
11249/11593 Test  #8388: mpi/p4est_2d_dofhandler_02.mpirun=10.release ...........................................   Passed   19.11 sec
            Start  8391: mpi/p4est_2d_dofhandler_03.mpirun=10.debug
            Start  8390: mpi/p4est_2d_dofhandler_02.mpirun=4.release
11250/11593 Test  #8390: mpi/p4est_2d_dofhandler_02.mpirun=4.release ............................................   Passed    3.32 sec
11251/11593 Test  #8387: mpi/p4est_2d_dofhandler_02.mpirun=10.debug .............................................   Passed   26.95 sec
            Start  8392: mpi/p4est_2d_dofhandler_03.mpirun=10.release
            Start  8389: mpi/p4est_2d_dofhandler_02.mpirun=4.debug
11252/11593 Test  #8389: mpi/p4est_2d_dofhandler_02.mpirun=4.debug ..............................................   Passed    5.11 sec
11253/11593 Test  #8392: mpi/p4est_2d_dofhandler_03.mpirun=10.release ...........................................   Passed   19.42 sec
            Start  8395: mpi/p4est_2d_dofhandler_04.mpirun=10.debug
            Start  8394: mpi/p4est_2d_dofhandler_03.mpirun=4.release
11254/11593 Test  #8394: mpi/p4est_2d_dofhandler_03.mpirun=4.release ............................................   Passed    3.09 sec
11255/11593 Test  #8391: mpi/p4est_2d_dofhandler_03.mpirun=10.debug .............................................   Passed   27.63 sec
            Start  8396: mpi/p4est_2d_dofhandler_04.mpirun=10.release
            Start  8393: mpi/p4est_2d_dofhandler_03.mpirun=4.debug
11256/11593 Test  #8393: mpi/p4est_2d_dofhandler_03.mpirun=4.debug ..............................................   Passed    5.13 sec
11257/11593 Test  #8396: mpi/p4est_2d_dofhandler_04.mpirun=10.release ...........................................   Passed   19.80 sec
            Start  8399: mpi/p4est_2d_dofhandler_05.mpirun=10.debug
            Start  8398: mpi/p4est_2d_dofhandler_04.mpirun=4.release
11258/11593 Test  #8398: mpi/p4est_2d_dofhandler_04.mpirun=4.release ............................................   Passed    3.26 sec
11259/11593 Test  #8395: mpi/p4est_2d_dofhandler_04.mpirun=10.debug .............................................   Passed   28.48 sec
            Start  8400: mpi/p4est_2d_dofhandler_05.mpirun=10.release
            Start  8397: mpi/p4est_2d_dofhandler_04.mpirun=4.debug
11260/11593 Test  #8397: mpi/p4est_2d_dofhandler_04.mpirun=4.debug ..............................................   Passed    5.13 sec
11261/11593 Test  #8399: mpi/p4est_2d_dofhandler_05.mpirun=10.debug .............................................   Passed   20.56 sec
            Start  8403: mpi/p4est_2d_ghost_01.mpirun=10.debug
            Start  8401: mpi/p4est_2d_dofhandler_05.mpirun=4.debug
11262/11593 Test  #8400: mpi/p4est_2d_dofhandler_05.mpirun=10.release ...........................................   Passed   17.81 sec
            Start  8404: mpi/p4est_2d_ghost_01.mpirun=10.release
11263/11593 Test  #8401: mpi/p4est_2d_dofhandler_05.mpirun=4.debug ..............................................   Passed    3.12 sec
            Start  8402: mpi/p4est_2d_dofhandler_05.mpirun=4.release
11264/11593 Test  #8402: mpi/p4est_2d_dofhandler_05.mpirun=4.release ............................................   Passed    2.96 sec
11265/11593 Test  #8404: mpi/p4est_2d_ghost_01.mpirun=10.release ................................................   Passed   19.46 sec
            Start  8407: mpi/p4est_2d_ghost_02.mpirun=10.debug
            Start  8406: mpi/p4est_2d_ghost_01.mpirun=4.release
11266/11593 Test  #8403: mpi/p4est_2d_ghost_01.mpirun=10.debug ..................................................   Passed   21.85 sec
            Start  8408: mpi/p4est_2d_ghost_02.mpirun=10.release
11267/11593 Test  #8406: mpi/p4est_2d_ghost_01.mpirun=4.release .................................................   Passed    3.04 sec
            Start  8405: mpi/p4est_2d_ghost_01.mpirun=4.debug
11268/11593 Test  #8405: mpi/p4est_2d_ghost_01.mpirun=4.debug ...................................................   Passed    3.10 sec
11269/11593 Test  #8408: mpi/p4est_2d_ghost_02.mpirun=10.release ................................................   Passed   18.68 sec
            Start  8411: mpi/p4est_2d_refine_01.mpirun=10.debug
            Start  8410: mpi/p4est_2d_ghost_02.mpirun=4.release
11270/11593 Test  #8407: mpi/p4est_2d_ghost_02.mpirun=10.debug ..................................................   Passed   22.29 sec
            Start  8412: mpi/p4est_2d_refine_01.mpirun=10.release
11271/11593 Test  #8410: mpi/p4est_2d_ghost_02.mpirun=4.release .................................................   Passed    3.14 sec
            Start  8409: mpi/p4est_2d_ghost_02.mpirun=4.debug
11272/11593 Test  #8409: mpi/p4est_2d_ghost_02.mpirun=4.debug ...................................................   Passed    3.29 sec
11273/11593 Test  #8412: mpi/p4est_2d_refine_01.mpirun=10.release ...............................................   Passed   19.25 sec
            Start  8415: mpi/p4est_2d_refine_02.mpirun=10.debug
            Start  8414: mpi/p4est_2d_refine_01.mpirun=4.release
11274/11593 Test  #8411: mpi/p4est_2d_refine_01.mpirun=10.debug .................................................   Passed   22.40 sec
            Start  8416: mpi/p4est_2d_refine_02.mpirun=10.release
11275/11593 Test  #8414: mpi/p4est_2d_refine_01.mpirun=4.release ................................................   Passed    3.02 sec
            Start  8413: mpi/p4est_2d_refine_01.mpirun=4.debug
11276/11593 Test  #8413: mpi/p4est_2d_refine_01.mpirun=4.debug ..................................................   Passed    3.16 sec
11277/11593 Test  #8416: mpi/p4est_2d_refine_02.mpirun=10.release ...............................................   Passed   19.22 sec
            Start  8419: mpi/p4est_2d_refine_03.mpirun=10.debug
            Start  8418: mpi/p4est_2d_refine_02.mpirun=4.release
11278/11593 Test  #8418: mpi/p4est_2d_refine_02.mpirun=4.release ................................................   Passed    3.19 sec
11279/11593 Test  #8415: mpi/p4est_2d_refine_02.mpirun=10.debug .................................................   Passed   22.71 sec
            Start  8420: mpi/p4est_2d_refine_03.mpirun=10.release
            Start  8417: mpi/p4est_2d_refine_02.mpirun=4.debug
11280/11593 Test  #8417: mpi/p4est_2d_refine_02.mpirun=4.debug ..................................................   Passed    3.14 sec
11281/11593 Test  #8419: mpi/p4est_2d_refine_03.mpirun=10.debug .................................................   Passed   23.41 sec
            Start  8423: mpi/p4est_2d_renumber_01.mpirun=10.debug
            Start  8421: mpi/p4est_2d_refine_03.mpirun=4.debug
11282/11593 Test  #8420: mpi/p4est_2d_refine_03.mpirun=10.release ...............................................   Passed   20.11 sec
            Start  8424: mpi/p4est_2d_renumber_01.mpirun=10.release
11283/11593 Test  #8421: mpi/p4est_2d_refine_03.mpirun=4.debug ..................................................   Passed    4.49 sec
            Start  8422: mpi/p4est_2d_refine_03.mpirun=4.release
11284/11593 Test  #8422: mpi/p4est_2d_refine_03.mpirun=4.release ................................................   Passed    3.10 sec
11285/11593 Test  #8424: mpi/p4est_2d_renumber_01.mpirun=10.release .............................................   Passed   20.32 sec
            Start  8427: mpi/p4est_2d_renumber_02.mpirun=10.debug
            Start  8426: mpi/p4est_2d_renumber_01.mpirun=4.release
11286/11593 Test  #8426: mpi/p4est_2d_renumber_01.mpirun=4.release ..............................................   Passed    3.15 sec
11287/11593 Test  #8423: mpi/p4est_2d_renumber_01.mpirun=10.debug ...............................................   Passed   23.55 sec
            Start  8428: mpi/p4est_2d_renumber_02.mpirun=10.release
            Start  8425: mpi/p4est_2d_renumber_01.mpirun=4.debug
11288/11593 Test  #8425: mpi/p4est_2d_renumber_01.mpirun=4.debug ................................................   Passed    3.20 sec
11289/11593 Test  #8427: mpi/p4est_2d_renumber_02.mpirun=10.debug ...............................................   Passed   24.67 sec
            Start  8431: mpi/p4est_2d_simple.mpirun=10.debug
            Start  8429: mpi/p4est_2d_renumber_02.mpirun=4.debug
11290/11593 Test  #8428: mpi/p4est_2d_renumber_02.mpirun=10.release .............................................   Passed   22.78 sec
            Start  8432: mpi/p4est_2d_simple.mpirun=10.release
11291/11593 Test  #8429: mpi/p4est_2d_renumber_02.mpirun=4.debug ................................................   Passed    3.10 sec
            Start  8430: mpi/p4est_2d_renumber_02.mpirun=4.release
11292/11593 Test  #8430: mpi/p4est_2d_renumber_02.mpirun=4.release ..............................................   Passed    3.07 sec
11293/11593 Test  #8432: mpi/p4est_2d_simple.mpirun=10.release ..................................................   Passed   14.52 sec
            Start  8435: mpi/p4est_3d_constraintmatrix_01.mpirun=10.debug
            Start  8434: mpi/p4est_2d_simple.mpirun=4.release
11294/11593 Test  #8431: mpi/p4est_2d_simple.mpirun=10.debug ....................................................   Passed   17.08 sec
            Start  8436: mpi/p4est_3d_constraintmatrix_01.mpirun=10.release
11295/11593 Test  #8434: mpi/p4est_2d_simple.mpirun=4.release ...................................................   Passed    2.95 sec
            Start  8433: mpi/p4est_2d_simple.mpirun=4.debug
11296/11593 Test  #8433: mpi/p4est_2d_simple.mpirun=4.debug .....................................................   Passed    3.07 sec
11297/11593 Test  #8436: mpi/p4est_3d_constraintmatrix_01.mpirun=10.release .....................................   Passed   18.64 sec
            Start  8439: mpi/p4est_3d_constraintmatrix_02.mpirun=10.debug
            Start  8438: mpi/p4est_3d_constraintmatrix_01.mpirun=4.release
11298/11593 Test  #8435: mpi/p4est_3d_constraintmatrix_01.mpirun=10.debug .......................................   Passed   22.59 sec
            Start  8440: mpi/p4est_3d_constraintmatrix_02.mpirun=10.release
11299/11593 Test  #8438: mpi/p4est_3d_constraintmatrix_01.mpirun=4.release ......................................   Passed    3.10 sec
            Start  8437: mpi/p4est_3d_constraintmatrix_01.mpirun=4.debug
11300/11593 Test  #8437: mpi/p4est_3d_constraintmatrix_01.mpirun=4.debug ........................................   Passed    4.74 sec
11301/11593 Test  #8440: mpi/p4est_3d_constraintmatrix_02.mpirun=10.release .....................................   Passed   18.37 sec
            Start  8443: mpi/p4est_3d_constraintmatrix_03.mpirun=10.debug
            Start  8442: mpi/p4est_3d_constraintmatrix_02.mpirun=4.release
11302/11593 Test  #8439: mpi/p4est_3d_constraintmatrix_02.mpirun=10.debug .......................................   Passed   21.47 sec
            Start  8444: mpi/p4est_3d_constraintmatrix_03.mpirun=10.release
11303/11593 Test  #8442: mpi/p4est_3d_constraintmatrix_02.mpirun=4.release ......................................   Passed    3.07 sec
            Start  8441: mpi/p4est_3d_constraintmatrix_02.mpirun=4.debug
11304/11593 Test  #8441: mpi/p4est_3d_constraintmatrix_02.mpirun=4.debug ........................................   Passed    3.31 sec
11305/11593 Test  #8444: mpi/p4est_3d_constraintmatrix_03.mpirun=10.release .....................................   Passed   23.94 sec
            Start  8449: mpi/p4est_3d_ghost_01.mpirun=10.debug
            Start  8446: mpi/p4est_3d_constraintmatrix_03.mpirun=4.release
11306/11593 Test  #8446: mpi/p4est_3d_constraintmatrix_03.mpirun=4.release ......................................   Passed    5.05 sec
11307/11593 Test  #8443: mpi/p4est_3d_constraintmatrix_03.mpirun=10.debug .......................................   Passed   46.32 sec
            Start  8450: mpi/p4est_3d_ghost_01.mpirun=10.release
            Start  8445: mpi/p4est_3d_constraintmatrix_03.mpirun=4.debug
11308/11593 Test  #8449: mpi/p4est_3d_ghost_01.mpirun=10.debug ..................................................   Passed   22.65 sec
            Start  8453: mpi/p4est_3d_refine_01.mpirun=10.debug
11309/11593 Test  #8450: mpi/p4est_3d_ghost_01.mpirun=10.release ................................................   Passed   19.53 sec
            Start  8454: mpi/p4est_3d_refine_01.mpirun=10.release
11310/11593 Test  #8453: mpi/p4est_3d_refine_01.mpirun=10.debug .................................................   Passed   31.89 sec
            Start  8457: mpi/p4est_3d_refine_02.mpirun=10.debug
11311/11593 Test  #8445: mpi/p4est_3d_constraintmatrix_03.mpirun=4.debug ........................................   Passed   36.19 sec
            Start  8451: mpi/p4est_3d_ghost_01.mpirun=4.debug
11312/11593 Test  #8454: mpi/p4est_3d_refine_01.mpirun=10.release ...............................................   Passed   19.47 sec
            Start  8458: mpi/p4est_3d_refine_02.mpirun=10.release
11313/11593 Test  #8451: mpi/p4est_3d_ghost_01.mpirun=4.debug ...................................................   Passed    3.42 sec
            Start  8452: mpi/p4est_3d_ghost_01.mpirun=4.release
11314/11593 Test  #8452: mpi/p4est_3d_ghost_01.mpirun=4.release .................................................   Passed    3.03 sec
            Start  8455: mpi/p4est_3d_refine_01.mpirun=4.debug
11315/11593 Test  #8455: mpi/p4est_3d_refine_01.mpirun=4.debug ..................................................   Passed   10.51 sec
            Start  8456: mpi/p4est_3d_refine_01.mpirun=4.release
11316/11593 Test  #8457: mpi/p4est_3d_refine_02.mpirun=10.debug .................................................   Passed   22.40 sec
            Start  8461: mpi/p4est_3d_refine_03.mpirun=10.debug
11317/11593 Test  #8456: mpi/p4est_3d_refine_01.mpirun=4.release ................................................   Passed    3.08 sec
            Start  8459: mpi/p4est_3d_refine_02.mpirun=4.debug
11318/11593 Test  #8458: mpi/p4est_3d_refine_02.mpirun=10.release ...............................................   Passed   18.90 sec
            Start  8462: mpi/p4est_3d_refine_03.mpirun=10.release
11319/11593 Test  #8459: mpi/p4est_3d_refine_02.mpirun=4.debug ..................................................   Passed    3.22 sec
            Start  8460: mpi/p4est_3d_refine_02.mpirun=4.release
11320/11593 Test  #8460: mpi/p4est_3d_refine_02.mpirun=4.release ................................................   Passed    2.97 sec
11321/11593 Test  #8462: mpi/p4est_3d_refine_03.mpirun=10.release ...............................................   Passed   19.28 sec
            Start  8474: mpi/p4est_data_out_01.mpirun=10.debug
            Start  8464: mpi/p4est_3d_refine_03.mpirun=4.release
11322/11593 Test  #8461: mpi/p4est_3d_refine_03.mpirun=10.debug .................................................   Passed   22.31 sec
            Start  8475: mpi/p4est_data_out_01.mpirun=10.release
11323/11593 Test  #8464: mpi/p4est_3d_refine_03.mpirun=4.release ................................................   Passed    3.05 sec
            Start  8463: mpi/p4est_3d_refine_03.mpirun=4.debug
11324/11593 Test  #8463: mpi/p4est_3d_refine_03.mpirun=4.debug ..................................................   Passed    3.17 sec
11325/11593 Test  #8475: mpi/p4est_data_out_01.mpirun=10.release ................................................   Passed   19.39 sec
            Start  8478: mpi/p4est_get_subdomain_association.mpirun=10.debug
            Start  8477: mpi/p4est_data_out_01.mpirun=4.release
11326/11593 Test  #8477: mpi/p4est_data_out_01.mpirun=4.release .................................................   Passed    2.98 sec
11327/11593 Test  #8474: mpi/p4est_data_out_01.mpirun=10.debug ..................................................   Passed   24.36 sec
            Start  8479: mpi/p4est_get_subdomain_association.mpirun=10.release
            Start  8476: mpi/p4est_data_out_01.mpirun=4.debug
11328/11593 Test  #8476: mpi/p4est_data_out_01.mpirun=4.debug ...................................................   Passed    3.07 sec
11329/11593 Test  #8478: mpi/p4est_get_subdomain_association.mpirun=10.debug ....................................   Passed   23.66 sec
            Start  8486: mpi/p4est_save_01.mpirun=10.debug
            Start  8480: mpi/p4est_get_subdomain_association.mpirun=4.debug
11330/11593 Test  #8479: mpi/p4est_get_subdomain_association.mpirun=10.release ..................................   Passed   19.26 sec
            Start  8487: mpi/p4est_save_01.mpirun=10.release
11331/11593 Test  #8480: mpi/p4est_get_subdomain_association.mpirun=4.debug .....................................   Passed    3.08 sec
            Start  8481: mpi/p4est_get_subdomain_association.mpirun=4.release
11332/11593 Test  #8481: mpi/p4est_get_subdomain_association.mpirun=4.release ...................................   Passed    3.02 sec
11333/11593 Test  #8487: mpi/p4est_save_01.mpirun=10.release ....................................................   Passed   18.60 sec
            Start  8510: mpi/parallel_block_vector_01.mpirun=10.debug
            Start  8489: mpi/p4est_save_01.mpirun=4.release
11334/11593 Test  #8489: mpi/p4est_save_01.mpirun=4.release .....................................................   Passed    3.32 sec
11335/11593 Test  #8486: mpi/p4est_save_01.mpirun=10.debug ......................................................   Passed   22.52 sec
            Start  8511: mpi/parallel_block_vector_01.mpirun=10.release
            Start  8488: mpi/p4est_save_01.mpirun=4.debug
11336/11593 Test  #8510: mpi/parallel_block_vector_01.mpirun=10.debug ...........................................   Passed    3.58 sec
            Start  8516: mpi/parallel_block_vector_02.mpirun=10.debug
11337/11593 Test  #8511: mpi/parallel_block_vector_01.mpirun=10.release .........................................   Passed    3.10 sec
            Start  8517: mpi/parallel_block_vector_02.mpirun=10.release
11338/11593 Test  #8488: mpi/p4est_save_01.mpirun=4.debug .......................................................   Passed    3.19 sec
            Start  8512: mpi/parallel_block_vector_01.mpirun=4.debug
11339/11593 Test  #8516: mpi/parallel_block_vector_02.mpirun=10.debug ...........................................   Passed    3.24 sec
            Start  8522: mpi/parallel_block_vector_04.mpirun=10.debug
11340/11593 Test  #8517: mpi/parallel_block_vector_02.mpirun=10.release .........................................   Passed    3.13 sec
            Start  8523: mpi/parallel_block_vector_04.mpirun=10.release
11341/11593 Test  #8512: mpi/parallel_block_vector_01.mpirun=4.debug ............................................   Passed    3.23 sec
            Start  8513: mpi/parallel_block_vector_01.mpirun=4.release
11342/11593 Test  #8522: mpi/parallel_block_vector_04.mpirun=10.debug ...........................................   Passed    3.21 sec
            Start  8554: mpi/parallel_partitioner_01.mpirun=10.debug
11343/11593 Test  #8523: mpi/parallel_block_vector_04.mpirun=10.release .........................................   Passed    2.93 sec
            Start  8555: mpi/parallel_partitioner_01.mpirun=10.release
11344/11593 Test  #8513: mpi/parallel_block_vector_01.mpirun=4.release ..........................................   Passed    3.02 sec
            Start  8518: mpi/parallel_block_vector_02.mpirun=4.debug
11345/11593 Test  #8518: mpi/parallel_block_vector_02.mpirun=4.debug ............................................   Passed    3.00 sec
            Start  8519: mpi/parallel_block_vector_02.mpirun=4.release
11346/11593 Test  #8519: mpi/parallel_block_vector_02.mpirun=4.release ..........................................   Passed    2.80 sec
            Start  8524: mpi/parallel_block_vector_04.mpirun=4.debug
11347/11593 Test  #8524: mpi/parallel_block_vector_04.mpirun=4.debug ............................................   Passed    3.02 sec
            Start  8525: mpi/parallel_block_vector_04.mpirun=4.release
11348/11593 Test  #8554: mpi/parallel_partitioner_01.mpirun=10.debug ............................................   Passed   13.80 sec
            Start  8558: mpi/parallel_partitioner_02.mpirun=10.debug
11349/11593 Test  #8525: mpi/parallel_block_vector_04.mpirun=4.release ..........................................   Passed    2.91 sec
            Start  8556: mpi/parallel_partitioner_01.mpirun=4.debug
11350/11593 Test  #8555: mpi/parallel_partitioner_01.mpirun=10.release ..........................................   Passed   12.43 sec
            Start  8559: mpi/parallel_partitioner_02.mpirun=10.release
11351/11593 Test  #8556: mpi/parallel_partitioner_01.mpirun=4.debug .............................................   Passed    3.05 sec
            Start  8557: mpi/parallel_partitioner_01.mpirun=4.release
11352/11593 Test  #8557: mpi/parallel_partitioner_01.mpirun=4.release ...........................................   Passed    2.84 sec
11353/11593 Test  #8559: mpi/parallel_partitioner_02.mpirun=10.release ..........................................   Passed   12.85 sec
            Start  8562: mpi/parallel_partitioner_03.mpirun=10.debug
            Start  8561: mpi/parallel_partitioner_02.mpirun=4.release
11354/11593 Test  #8558: mpi/parallel_partitioner_02.mpirun=10.debug ............................................   Passed   14.10 sec
            Start  8563: mpi/parallel_partitioner_03.mpirun=10.release
11355/11593 Test  #8561: mpi/parallel_partitioner_02.mpirun=4.release ...........................................   Passed    3.00 sec
            Start  8560: mpi/parallel_partitioner_02.mpirun=4.debug
11356/11593 Test  #8560: mpi/parallel_partitioner_02.mpirun=4.debug .............................................   Passed    3.04 sec
11357/11593 Test  #8563: mpi/parallel_partitioner_03.mpirun=10.release ..........................................   Passed   12.43 sec
            Start  8568: mpi/parallel_partitioner_04.mpirun=10.debug
            Start  8565: mpi/parallel_partitioner_03.mpirun=4.release
11358/11593 Test  #8562: mpi/parallel_partitioner_03.mpirun=10.debug ............................................   Passed   13.83 sec
            Start  8569: mpi/parallel_partitioner_04.mpirun=10.release
11359/11593 Test  #8565: mpi/parallel_partitioner_03.mpirun=4.release ...........................................   Passed    2.93 sec
            Start  8564: mpi/parallel_partitioner_03.mpirun=4.debug
11360/11593 Test  #8564: mpi/parallel_partitioner_03.mpirun=4.debug .............................................   Passed    3.08 sec
11361/11593 Test  #8569: mpi/parallel_partitioner_04.mpirun=10.release ..........................................   Passed   12.86 sec
            Start  8582: mpi/parallel_vector_01.mpirun=10.debug
            Start  8571: mpi/parallel_partitioner_04.mpirun=4.release
11362/11593 Test  #8568: mpi/parallel_partitioner_04.mpirun=10.debug ............................................   Passed   14.27 sec
            Start  8583: mpi/parallel_vector_01.mpirun=10.release
11363/11593 Test  #8571: mpi/parallel_partitioner_04.mpirun=4.release ...........................................   Passed    2.92 sec
            Start  8570: mpi/parallel_partitioner_04.mpirun=4.debug
11364/11593 Test  #8570: mpi/parallel_partitioner_04.mpirun=4.debug .............................................   Passed    2.98 sec
11365/11593 Test  #8583: mpi/parallel_vector_01.mpirun=10.release ...............................................   Passed   11.93 sec
            Start  8586: mpi/parallel_vector_02.mpirun=10.debug
            Start  8585: mpi/parallel_vector_01.mpirun=4.release
11366/11593 Test  #8582: mpi/parallel_vector_01.mpirun=10.debug .................................................   Passed   13.65 sec
            Start  8587: mpi/parallel_vector_02.mpirun=10.release
11367/11593 Test  #8585: mpi/parallel_vector_01.mpirun=4.release ................................................   Passed    2.91 sec
            Start  8584: mpi/parallel_vector_01.mpirun=4.debug
11368/11593 Test  #8584: mpi/parallel_vector_01.mpirun=4.debug ..................................................   Passed    3.08 sec
11369/11593 Test  #8586: mpi/parallel_vector_02.mpirun=10.debug .................................................   Passed   13.55 sec
            Start  8590: mpi/parallel_vector_03.mpirun=10.debug
            Start  8588: mpi/parallel_vector_02.mpirun=4.debug
11370/11593 Test  #8587: mpi/parallel_vector_02.mpirun=10.release ...............................................   Passed   12.46 sec
            Start  8591: mpi/parallel_vector_03.mpirun=10.release
11371/11593 Test  #8588: mpi/parallel_vector_02.mpirun=4.debug ..................................................   Passed    3.07 sec
            Start  8589: mpi/parallel_vector_02.mpirun=4.release
11372/11593 Test  #8589: mpi/parallel_vector_02.mpirun=4.release ................................................   Passed    2.86 sec
11373/11593 Test  #8591: mpi/parallel_vector_03.mpirun=10.release ...............................................   Passed   12.48 sec
            Start  8596: mpi/parallel_vector_04.mpirun=10.debug
            Start  8593: mpi/parallel_vector_03.mpirun=4.release
11374/11593 Test  #8590: mpi/parallel_vector_03.mpirun=10.debug .................................................   Passed   13.90 sec
            Start  8597: mpi/parallel_vector_04.mpirun=10.release
11375/11593 Test  #8593: mpi/parallel_vector_03.mpirun=4.release ................................................   Passed    2.97 sec
            Start  8592: mpi/parallel_vector_03.mpirun=4.debug
11376/11593 Test  #8592: mpi/parallel_vector_03.mpirun=4.debug ..................................................   Passed    3.01 sec
11377/11593 Test  #8597: mpi/parallel_vector_04.mpirun=10.release ...............................................   Passed   12.58 sec
            Start  8600: mpi/parallel_vector_05.mpirun=10.debug
            Start  8599: mpi/parallel_vector_04.mpirun=4.release
11378/11593 Test  #8596: mpi/parallel_vector_04.mpirun=10.debug .................................................   Passed   13.72 sec
            Start  8601: mpi/parallel_vector_05.mpirun=10.release
11379/11593 Test  #8599: mpi/parallel_vector_04.mpirun=4.release ................................................   Passed    2.92 sec
            Start  8598: mpi/parallel_vector_04.mpirun=4.debug
11380/11593 Test  #8598: mpi/parallel_vector_04.mpirun=4.debug ..................................................   Passed    3.04 sec
11381/11593 Test  #8601: mpi/parallel_vector_05.mpirun=10.release ...............................................   Passed   12.56 sec
            Start  8606: mpi/parallel_vector_06.mpirun=10.debug
            Start  8603: mpi/parallel_vector_05.mpirun=4.release
11382/11593 Test  #8600: mpi/parallel_vector_05.mpirun=10.debug .................................................   Passed   13.96 sec
            Start  8607: mpi/parallel_vector_06.mpirun=10.release
11383/11593 Test  #8603: mpi/parallel_vector_05.mpirun=4.release ................................................   Passed    3.06 sec
            Start  8602: mpi/parallel_vector_05.mpirun=4.debug
11384/11593 Test  #8606: mpi/parallel_vector_06.mpirun=10.debug .................................................   Passed    3.23 sec
            Start  8610: mpi/parallel_vector_07.mpirun=10.debug
11385/11593 Test  #8607: mpi/parallel_vector_06.mpirun=10.release ...............................................   Passed    3.13 sec
            Start  8611: mpi/parallel_vector_07.mpirun=10.release
11386/11593 Test  #8602: mpi/parallel_vector_05.mpirun=4.debug ..................................................   Passed    3.06 sec
            Start  8608: mpi/parallel_vector_06.mpirun=4.debug
11387/11593 Test  #8608: mpi/parallel_vector_06.mpirun=4.debug ..................................................   Passed    2.98 sec
            Start  8609: mpi/parallel_vector_06.mpirun=4.release
11388/11593 Test  #8609: mpi/parallel_vector_06.mpirun=4.release ................................................   Passed    2.86 sec
11389/11593 Test  #8611: mpi/parallel_vector_07.mpirun=10.release ...............................................   Passed   13.45 sec
            Start  8614: mpi/parallel_vector_08.mpirun=10.debug
            Start  8613: mpi/parallel_vector_07.mpirun=4.release
11390/11593 Test  #8610: mpi/parallel_vector_07.mpirun=10.debug .................................................   Passed   14.49 sec
            Start  8615: mpi/parallel_vector_08.mpirun=10.release
11391/11593 Test  #8613: mpi/parallel_vector_07.mpirun=4.release ................................................   Passed    2.93 sec
            Start  8612: mpi/parallel_vector_07.mpirun=4.debug
11392/11593 Test  #8612: mpi/parallel_vector_07.mpirun=4.debug ..................................................   Passed    3.08 sec
11393/11593 Test  #8615: mpi/parallel_vector_08.mpirun=10.release ...............................................   Passed   13.31 sec
            Start  8618: mpi/parallel_vector_09.mpirun=10.debug
            Start  8617: mpi/parallel_vector_08.mpirun=4.release
11394/11593 Test  #8614: mpi/parallel_vector_08.mpirun=10.debug .................................................   Passed   14.05 sec
            Start  8619: mpi/parallel_vector_09.mpirun=10.release
11395/11593 Test  #8617: mpi/parallel_vector_08.mpirun=4.release ................................................   Passed    2.95 sec
            Start  8616: mpi/parallel_vector_08.mpirun=4.debug
11396/11593 Test  #8616: mpi/parallel_vector_08.mpirun=4.debug ..................................................   Passed    3.03 sec
11397/11593 Test  #8619: mpi/parallel_vector_09.mpirun=10.release ...............................................   Passed   12.71 sec
            Start  8622: mpi/parallel_vector_10.mpirun=10.debug
            Start  8621: mpi/parallel_vector_09.mpirun=4.release
11398/11593 Test  #8618: mpi/parallel_vector_09.mpirun=10.debug .................................................   Passed   14.13 sec
            Start  8623: mpi/parallel_vector_10.mpirun=10.release
11399/11593 Test  #8621: mpi/parallel_vector_09.mpirun=4.release ................................................   Passed    2.99 sec
            Start  8620: mpi/parallel_vector_09.mpirun=4.debug
11400/11593 Test  #8620: mpi/parallel_vector_09.mpirun=4.debug ..................................................   Passed    3.03 sec
11401/11593 Test  #8623: mpi/parallel_vector_10.mpirun=10.release ...............................................   Passed   12.12 sec
            Start  8626: mpi/parallel_vector_11.mpirun=10.debug
            Start  8625: mpi/parallel_vector_10.mpirun=4.release
11402/11593 Test  #8622: mpi/parallel_vector_10.mpirun=10.debug .................................................   Passed   13.79 sec
            Start  8627: mpi/parallel_vector_11.mpirun=10.release
11403/11593 Test  #8625: mpi/parallel_vector_10.mpirun=4.release ................................................   Passed    2.97 sec
            Start  8624: mpi/parallel_vector_10.mpirun=4.debug
11404/11593 Test  #8624: mpi/parallel_vector_10.mpirun=4.debug ..................................................   Passed    3.03 sec
11405/11593 Test  #8626: mpi/parallel_vector_11.mpirun=10.debug .................................................   Passed   13.96 sec
            Start  8632: mpi/parallel_vector_12.mpirun=10.debug
            Start  8628: mpi/parallel_vector_11.mpirun=4.debug
11406/11593 Test  #8627: mpi/parallel_vector_11.mpirun=10.release ...............................................   Passed   13.03 sec
            Start  8633: mpi/parallel_vector_12.mpirun=10.release
11407/11593 Test  #8628: mpi/parallel_vector_11.mpirun=4.debug ..................................................   Passed    3.12 sec
            Start  8629: mpi/parallel_vector_11.mpirun=4.release
11408/11593 Test  #8633: mpi/parallel_vector_12.mpirun=10.release ...............................................   Passed    3.27 sec
            Start  8638: mpi/parallel_vector_12a.mpirun=10.debug
11409/11593 Test  #8632: mpi/parallel_vector_12.mpirun=10.debug .................................................   Passed    3.32 sec
            Start  8639: mpi/parallel_vector_12a.mpirun=10.release
11410/11593 Test  #8629: mpi/parallel_vector_11.mpirun=4.release ................................................   Passed    3.24 sec
            Start  8634: mpi/parallel_vector_12.mpirun=4.debug
11411/11593 Test  #8638: mpi/parallel_vector_12a.mpirun=10.debug ................................................   Passed    3.20 sec
            Start  8642: mpi/parallel_vector_13.mpirun=10.debug
11412/11593 Test  #8639: mpi/parallel_vector_12a.mpirun=10.release ..............................................   Passed    3.20 sec
            Start  8643: mpi/parallel_vector_13.mpirun=10.release
11413/11593 Test  #8634: mpi/parallel_vector_12.mpirun=4.debug ..................................................   Passed    2.94 sec
            Start  8635: mpi/parallel_vector_12.mpirun=4.release
11414/11593 Test  #8635: mpi/parallel_vector_12.mpirun=4.release ................................................   Passed    2.96 sec
            Start  8640: mpi/parallel_vector_12a.mpirun=4.debug
11415/11593 Test  #8640: mpi/parallel_vector_12a.mpirun=4.debug .................................................   Passed    2.99 sec
            Start  8641: mpi/parallel_vector_12a.mpirun=4.release
11416/11593 Test  #8641: mpi/parallel_vector_12a.mpirun=4.release ...............................................   Passed    2.92 sec
11417/11593 Test  #8643: mpi/parallel_vector_13.mpirun=10.release ...............................................   Passed   12.68 sec
            Start  8658: mpi/parallel_vector_18.mpirun=10.debug
            Start  8645: mpi/parallel_vector_13.mpirun=4.release
11418/11593 Test  #8642: mpi/parallel_vector_13.mpirun=10.debug .................................................   Passed   14.05 sec
            Start  8659: mpi/parallel_vector_18.mpirun=10.release
11419/11593 Test  #8645: mpi/parallel_vector_13.mpirun=4.release ................................................   Passed    3.05 sec
            Start  8644: mpi/parallel_vector_13.mpirun=4.debug
11420/11593 Test  #8658: mpi/parallel_vector_18.mpirun=10.debug .................................................   Passed    3.18 sec
            Start  8664: mpi/parallel_vector_19.mpirun=10.debug
11421/11593 Test  #8659: mpi/parallel_vector_18.mpirun=10.release ...............................................   Passed    3.09 sec
            Start  8665: mpi/parallel_vector_19.mpirun=10.release
11422/11593 Test  #8644: mpi/parallel_vector_13.mpirun=4.debug ..................................................   Passed    3.18 sec
            Start  8660: mpi/parallel_vector_18.mpirun=4.debug
11423/11593 Test  #8664: mpi/parallel_vector_19.mpirun=10.debug .................................................   Passed    3.09 sec
            Start  8672: mpi/parallel_vector_22.mpirun=10.debug
11424/11593 Test  #8665: mpi/parallel_vector_19.mpirun=10.release ...............................................   Passed    3.00 sec
            Start  8673: mpi/parallel_vector_22.mpirun=10.release
11425/11593 Test  #8660: mpi/parallel_vector_18.mpirun=4.debug ..................................................   Passed    3.05 sec
            Start  8661: mpi/parallel_vector_18.mpirun=4.release
11426/11593 Test  #8661: mpi/parallel_vector_18.mpirun=4.release ................................................   Passed    2.95 sec
            Start  8666: mpi/parallel_vector_19.mpirun=4.debug
11427/11593 Test  #8666: mpi/parallel_vector_19.mpirun=4.debug ..................................................   Passed    2.91 sec
            Start  8667: mpi/parallel_vector_19.mpirun=4.release
11428/11593 Test  #8667: mpi/parallel_vector_19.mpirun=4.release ................................................   Passed    2.92 sec
11429/11593 Test  #8673: mpi/parallel_vector_22.mpirun=10.release ...............................................   Passed   12.39 sec
            Start  8734: mpi/refine_and_coarsen_fixed_fraction_01.mpirun=10.debug
            Start  8675: mpi/parallel_vector_22.mpirun=4.release
11430/11593 Test  #8672: mpi/parallel_vector_22.mpirun=10.debug .................................................   Passed   14.19 sec
            Start  8735: mpi/refine_and_coarsen_fixed_fraction_01.mpirun=10.release
11431/11593 Test  #8675: mpi/parallel_vector_22.mpirun=4.release ................................................   Passed    3.01 sec
            Start  8674: mpi/parallel_vector_22.mpirun=4.debug
11432/11593 Test  #8674: mpi/parallel_vector_22.mpirun=4.debug ..................................................   Passed    3.04 sec
11433/11593 Test  #8735: mpi/refine_and_coarsen_fixed_fraction_01.mpirun=10.release .............................   Passed   18.65 sec
            Start  8738: mpi/refine_and_coarsen_fixed_fraction_02.mpirun=10.debug
            Start  8737: mpi/refine_and_coarsen_fixed_fraction_01.mpirun=4.release
11434/11593 Test  #8737: mpi/refine_and_coarsen_fixed_fraction_01.mpirun=4.release ..............................   Passed    3.06 sec
11435/11593 Test  #8734: mpi/refine_and_coarsen_fixed_fraction_01.mpirun=10.debug ...............................   Passed   22.88 sec
            Start  8739: mpi/refine_and_coarsen_fixed_fraction_02.mpirun=10.release
            Start  8736: mpi/refine_and_coarsen_fixed_fraction_01.mpirun=4.debug
11436/11593 Test  #8736: mpi/refine_and_coarsen_fixed_fraction_01.mpirun=4.debug ................................   Passed    3.22 sec
11437/11593 Test  #8738: mpi/refine_and_coarsen_fixed_fraction_02.mpirun=10.debug ...............................   Passed   22.89 sec
            Start  8742: mpi/refine_and_coarsen_fixed_fraction_03.mpirun=10.debug
            Start  8740: mpi/refine_and_coarsen_fixed_fraction_02.mpirun=4.debug
11438/11593 Test  #8739: mpi/refine_and_coarsen_fixed_fraction_02.mpirun=10.release .............................   Passed   19.40 sec
            Start  8743: mpi/refine_and_coarsen_fixed_fraction_03.mpirun=10.release
11439/11593 Test  #8740: mpi/refine_and_coarsen_fixed_fraction_02.mpirun=4.debug ................................   Passed    3.12 sec
            Start  8741: mpi/refine_and_coarsen_fixed_fraction_02.mpirun=4.release
11440/11593 Test  #8741: mpi/refine_and_coarsen_fixed_fraction_02.mpirun=4.release ..............................   Passed    3.01 sec
11441/11593 Test  #8743: mpi/refine_and_coarsen_fixed_fraction_03.mpirun=10.release .............................   Passed   19.41 sec
            Start  8762: mpi/refine_and_coarsen_fixed_number_01.mpirun=10.debug
            Start  8745: mpi/refine_and_coarsen_fixed_fraction_03.mpirun=4.release
11442/11593 Test  #8745: mpi/refine_and_coarsen_fixed_fraction_03.mpirun=4.release ..............................   Passed    3.13 sec
11443/11593 Test  #8742: mpi/refine_and_coarsen_fixed_fraction_03.mpirun=10.debug ...............................   Passed   22.69 sec
            Start  8763: mpi/refine_and_coarsen_fixed_number_01.mpirun=10.release
            Start  8744: mpi/refine_and_coarsen_fixed_fraction_03.mpirun=4.debug
11444/11593 Test  #8744: mpi/refine_and_coarsen_fixed_fraction_03.mpirun=4.debug ................................   Passed    3.09 sec
11445/11593 Test  #8763: mpi/refine_and_coarsen_fixed_number_01.mpirun=10.release ...............................   Passed   19.29 sec
            Start  8766: mpi/refine_and_coarsen_fixed_number_02.mpirun=10.debug
            Start  8765: mpi/refine_and_coarsen_fixed_number_01.mpirun=4.release
11446/11593 Test  #8762: mpi/refine_and_coarsen_fixed_number_01.mpirun=10.debug .................................   Passed   23.20 sec
            Start  8767: mpi/refine_and_coarsen_fixed_number_02.mpirun=10.release
11447/11593 Test  #8765: mpi/refine_and_coarsen_fixed_number_01.mpirun=4.release ................................   Passed    3.05 sec
            Start  8764: mpi/refine_and_coarsen_fixed_number_01.mpirun=4.debug
11448/11593 Test  #8764: mpi/refine_and_coarsen_fixed_number_01.mpirun=4.debug ..................................   Passed    3.15 sec
11449/11593 Test  #8767: mpi/refine_and_coarsen_fixed_number_02.mpirun=10.release ...............................   Passed   19.20 sec
            Start  8770: mpi/refine_and_coarsen_fixed_number_03.mpirun=10.debug
            Start  8769: mpi/refine_and_coarsen_fixed_number_02.mpirun=4.release
11450/11593 Test  #8766: mpi/refine_and_coarsen_fixed_number_02.mpirun=10.debug .................................   Passed   22.93 sec
            Start  8771: mpi/refine_and_coarsen_fixed_number_03.mpirun=10.release
11451/11593 Test  #8769: mpi/refine_and_coarsen_fixed_number_02.mpirun=4.release ................................   Passed    3.09 sec
            Start  8768: mpi/refine_and_coarsen_fixed_number_02.mpirun=4.debug
11452/11593 Test  #8768: mpi/refine_and_coarsen_fixed_number_02.mpirun=4.debug ..................................   Passed    3.19 sec
11453/11593 Test  #8771: mpi/refine_and_coarsen_fixed_number_03.mpirun=10.release ...............................   Passed   18.91 sec
            Start  8780: mpi/refine_and_coarsen_fixed_number_06.mpirun=10.debug
            Start  8773: mpi/refine_and_coarsen_fixed_number_03.mpirun=4.release
11454/11593 Test  #8770: mpi/refine_and_coarsen_fixed_number_03.mpirun=10.debug .................................   Passed   22.92 sec
            Start  8781: mpi/refine_and_coarsen_fixed_number_06.mpirun=10.release
11455/11593 Test  #8773: mpi/refine_and_coarsen_fixed_number_03.mpirun=4.release ................................   Passed    3.15 sec
            Start  8772: mpi/refine_and_coarsen_fixed_number_03.mpirun=4.debug
11456/11593 Test  #8780: mpi/refine_and_coarsen_fixed_number_06.mpirun=10.debug .................................   Passed    3.20 sec
            Start  8786: mpi/refine_and_coarsen_fixed_number_07.mpirun=10.debug
11457/11593 Test  #8781: mpi/refine_and_coarsen_fixed_number_06.mpirun=10.release ...............................   Passed    3.03 sec
            Start  8787: mpi/refine_and_coarsen_fixed_number_07.mpirun=10.release
11458/11593 Test  #8772: mpi/refine_and_coarsen_fixed_number_03.mpirun=4.debug ..................................   Passed    3.19 sec
            Start  8782: mpi/refine_and_coarsen_fixed_number_06.mpirun=4.debug
11459/11593 Test  #8786: mpi/refine_and_coarsen_fixed_number_07.mpirun=10.debug .................................   Passed    4.15 sec
            Start  8816: mpi/renumber_z_order_01.mpirun=10.debug
11460/11593 Test  #8787: mpi/refine_and_coarsen_fixed_number_07.mpirun=10.release ...............................   Passed    3.32 sec
            Start  8817: mpi/renumber_z_order_01.mpirun=10.release
11461/11593 Test  #8782: mpi/refine_and_coarsen_fixed_number_06.mpirun=4.debug ..................................   Passed    3.06 sec
            Start  8783: mpi/refine_and_coarsen_fixed_number_06.mpirun=4.release
11462/11593 Test  #8817: mpi/renumber_z_order_01.mpirun=10.release ..............................................   Passed    4.88 sec
            Start  8822: mpi/renumber_z_order_02.mpirun=10.debug
11463/11593 Test  #8816: mpi/renumber_z_order_01.mpirun=10.debug ................................................   Passed    4.94 sec
            Start  8823: mpi/renumber_z_order_02.mpirun=10.release
11464/11593 Test  #8783: mpi/refine_and_coarsen_fixed_number_06.mpirun=4.release ................................   Passed    3.80 sec
            Start  8788: mpi/refine_and_coarsen_fixed_number_07.mpirun=4.debug
11465/11593 Test  #8823: mpi/renumber_z_order_02.mpirun=10.release ..............................................   Passed    3.30 sec
            Start  8898: mpi/tria_ghost_owners_02.mpirun=11.debug
11466/11593 Test  #8822: mpi/renumber_z_order_02.mpirun=10.debug ................................................   Passed    3.42 sec
            Start  8899: mpi/tria_ghost_owners_02.mpirun=11.release
11467/11593 Test  #8788: mpi/refine_and_coarsen_fixed_number_07.mpirun=4.debug ..................................   Passed    3.86 sec
            Start  8789: mpi/refine_and_coarsen_fixed_number_07.mpirun=4.release
11468/11593 Test  #8789: mpi/refine_and_coarsen_fixed_number_07.mpirun=4.release ................................   Passed    3.04 sec
            Start  8818: mpi/renumber_z_order_01.mpirun=4.debug
11469/11593 Test  #8818: mpi/renumber_z_order_01.mpirun=4.debug .................................................   Passed    3.00 sec
            Start  8819: mpi/renumber_z_order_01.mpirun=4.release
11470/11593 Test  #8819: mpi/renumber_z_order_01.mpirun=4.release ...............................................   Passed    2.87 sec
            Start  8824: mpi/renumber_z_order_02.mpirun=4.debug
11471/11593 Test  #8824: mpi/renumber_z_order_02.mpirun=4.debug .................................................   Passed    3.08 sec
            Start  8825: mpi/renumber_z_order_02.mpirun=4.release
11472/11593 Test  #8825: mpi/renumber_z_order_02.mpirun=4.release ...............................................   Passed    2.96 sec
11473/11593 Test  #8899: mpi/tria_ghost_owners_02.mpirun=11.release .............................................   Passed   20.04 sec
            Start  8904: mpi/tria_signals_01.mpirun=11.debug
            Start  8901: mpi/tria_ghost_owners_02.mpirun=5.release
11474/11593 Test  #8901: mpi/tria_ghost_owners_02.mpirun=5.release ..............................................   Passed    4.21 sec
11475/11593 Test  #8898: mpi/tria_ghost_owners_02.mpirun=11.debug ...............................................   Passed   43.00 sec
            Start  8905: mpi/tria_signals_01.mpirun=11.release
            Start  8900: mpi/tria_ghost_owners_02.mpirun=5.debug
11476/11593 Test  #8904: mpi/tria_signals_01.mpirun=11.debug ....................................................   Passed   22.87 sec
            Start  8910: mpi/tria_signals_02.mpirun=11.debug
11477/11593 Test  #8910: mpi/tria_signals_02.mpirun=11.debug ....................................................   Passed   14.54 sec
            Start  8911: mpi/tria_signals_02.mpirun=11.release
11478/11593 Test  #8905: mpi/tria_signals_01.mpirun=11.release ..................................................   Passed   14.57 sec
            Start  8916: mpi/tria_signals_03.mpirun=11.debug
11479/11593 Test  #8900: mpi/tria_ghost_owners_02.mpirun=5.debug ................................................   Passed   26.34 sec
            Start  8906: mpi/tria_signals_01.mpirun=4.debug
11480/11593 Test  #8911: mpi/tria_signals_02.mpirun=11.release ..................................................   Passed   13.83 sec
            Start  8917: mpi/tria_signals_03.mpirun=11.release
11481/11593 Test  #8906: mpi/tria_signals_01.mpirun=4.debug .....................................................   Passed    3.82 sec
            Start  8907: mpi/tria_signals_01.mpirun=4.release
11482/11593 Test  #8907: mpi/tria_signals_01.mpirun=4.release ...................................................   Passed    7.83 sec
            Start  8912: mpi/tria_signals_02.mpirun=4.debug
11483/11593 Test  #8912: mpi/tria_signals_02.mpirun=4.debug .....................................................   Passed    8.71 sec
            Start  8913: mpi/tria_signals_02.mpirun=4.release
11484/11593 Test  #8913: mpi/tria_signals_02.mpirun=4.release ...................................................   Passed    8.52 sec
11485/11593 Test  #8917: mpi/tria_signals_03.mpirun=11.release ..................................................   Passed   31.37 sec
            Start  8922: mpi/tria_signals_04.mpirun=11.debug
            Start  8919: mpi/tria_signals_03.mpirun=4.release
11486/11593 Test  #8919: mpi/tria_signals_03.mpirun=4.release ...................................................   Passed   10.20 sec
11487/11593 Test  #8916: mpi/tria_signals_03.mpirun=11.debug ....................................................   Passed   78.17 sec
            Start  8923: mpi/tria_signals_04.mpirun=11.release
            Start  8918: mpi/tria_signals_03.mpirun=4.debug
11488/11593 Test  #8923: mpi/tria_signals_04.mpirun=11.release ..................................................   Passed   40.34 sec
            Start  8928: mpi/tria_signals_05.mpirun=11.debug
11489/11593 Test  #8922: mpi/tria_signals_04.mpirun=11.debug ....................................................   Passed   82.53 sec
            Start  8929: mpi/tria_signals_05.mpirun=11.release
11490/11593 Test  #8928: mpi/tria_signals_05.mpirun=11.debug ....................................................   Passed    9.61 sec
            Start  8934: mpi/trilinos_01.mpirun=10.debug
11491/11593 Test  #8929: mpi/tria_signals_05.mpirun=11.release ..................................................   Passed    3.16 sec
            Start  8935: mpi/trilinos_01.mpirun=10.release
11492/11593 Test  #8934: mpi/trilinos_01.mpirun=10.debug ........................................................   Passed   17.08 sec
            Start  8938: mpi/trilinos_02.mpirun=10.debug
11493/11593 Test  #8935: mpi/trilinos_01.mpirun=10.release ......................................................   Passed   14.66 sec
            Start  8939: mpi/trilinos_02.mpirun=10.release
11494/11593 Test  #8939: mpi/trilinos_02.mpirun=10.release ......................................................   Passed   12.03 sec
            Start  8978: mpi/trilinos_ghost_01.mpirun=10.debug
11495/11593 Test  #8918: mpi/tria_signals_03.mpirun=4.debug .....................................................   Passed   80.04 sec
            Start  8924: mpi/tria_signals_04.mpirun=4.debug
11496/11593 Test  #8938: mpi/trilinos_02.mpirun=10.debug ........................................................   Passed   14.07 sec
            Start  8979: mpi/trilinos_ghost_01.mpirun=10.release
11497/11593 Test  #8979: mpi/trilinos_ghost_01.mpirun=10.release ................................................   Passed   12.49 sec
            Start  8982: mpi/trilinos_ghost_02.mpirun=10.debug
11498/11593 Test  #8978: mpi/trilinos_ghost_01.mpirun=10.debug ..................................................   Passed   14.26 sec
            Start  8983: mpi/trilinos_ghost_02.mpirun=10.release
11499/11593 Test  #8983: mpi/trilinos_ghost_02.mpirun=10.release ................................................   Passed   12.29 sec
            Start  8986: mpi/trilinos_ghost_03.mpirun=10.debug
11500/11593 Test  #8982: mpi/trilinos_ghost_02.mpirun=10.debug ..................................................   Passed   14.19 sec
            Start  8988: mpi/trilinos_ghost_03_linfty.mpirun=10.debug
11501/11593 Test  #8986: mpi/trilinos_ghost_03.mpirun=10.debug ..................................................   Passed   13.94 sec
            Start  8990: mpi/trilinos_ghost_05.mpirun=10.debug
11502/11593 Test  #8988: mpi/trilinos_ghost_03_linfty.mpirun=10.debug ...........................................   Passed   14.00 sec
            Start  8991: mpi/trilinos_ghost_05.mpirun=10.release
11503/11593 Test  #8990: mpi/trilinos_ghost_05.mpirun=10.debug ..................................................   Passed   14.31 sec
            Start  9235: multigrid/transfer_matrix_free_06.mpirun=10.debug
11504/11593 Test  #8991: mpi/trilinos_ghost_05.mpirun=10.release ................................................   Passed   12.45 sec
            Start  9236: multigrid/transfer_matrix_free_06.mpirun=10.release
11505/11593 Test  #8924: mpi/tria_signals_04.mpirun=4.debug .....................................................   Passed   56.96 sec
            Start  8925: mpi/tria_signals_04.mpirun=4.release
11506/11593 Test  #8925: mpi/tria_signals_04.mpirun=4.release ...................................................   Passed    4.31 sec
            Start  8930: mpi/tria_signals_05.mpirun=4.debug
11507/11593 Test  #8930: mpi/tria_signals_05.mpirun=4.debug .....................................................   Passed    3.41 sec
            Start  8931: mpi/tria_signals_05.mpirun=4.release
11508/11593 Test  #8931: mpi/tria_signals_05.mpirun=4.release ...................................................   Passed    2.94 sec
            Start  8936: mpi/trilinos_01.mpirun=4.debug
11509/11593 Test  #8936: mpi/trilinos_01.mpirun=4.debug .........................................................   Passed    5.98 sec
            Start  8937: mpi/trilinos_01.mpirun=4.release
11510/11593 Test  #9236: multigrid/transfer_matrix_free_06.mpirun=10.release ....................................   Passed   23.29 sec
            Start  7452: matrix_free/matrix_vector_faces_16.mpirun=11.debug
11511/11593 Test  #8937: mpi/trilinos_01.mpirun=4.release .......................................................   Passed    5.91 sec
            Start  8940: mpi/trilinos_02.mpirun=4.debug
11512/11593 Test  #8940: mpi/trilinos_02.mpirun=4.debug .........................................................   Passed    3.15 sec
            Start  8941: mpi/trilinos_02.mpirun=4.release
11513/11593 Test  #9235: multigrid/transfer_matrix_free_06.mpirun=10.debug ......................................   Passed   30.15 sec
            Start  7453: matrix_free/matrix_vector_faces_16.mpirun=11.release
11514/11593 Test  #8941: mpi/trilinos_02.mpirun=4.release .......................................................   Passed    2.91 sec
            Start  8980: mpi/trilinos_ghost_01.mpirun=4.debug
11515/11593 Test  #8980: mpi/trilinos_ghost_01.mpirun=4.debug ...................................................   Passed    3.10 sec
            Start  8981: mpi/trilinos_ghost_01.mpirun=4.release
11516/11593 Test  #8981: mpi/trilinos_ghost_01.mpirun=4.release .................................................   Passed    2.92 sec
            Start  8984: mpi/trilinos_ghost_02.mpirun=4.debug
11517/11593 Test  #8984: mpi/trilinos_ghost_02.mpirun=4.debug ...................................................   Passed    3.00 sec
            Start  8985: mpi/trilinos_ghost_02.mpirun=4.release
11518/11593 Test  #8985: mpi/trilinos_ghost_02.mpirun=4.release .................................................   Passed    2.92 sec
            Start  8987: mpi/trilinos_ghost_03.mpirun=4.debug
11519/11593 Test  #8987: mpi/trilinos_ghost_03.mpirun=4.debug ...................................................   Passed    3.04 sec
            Start  8989: mpi/trilinos_ghost_03_linfty.mpirun=4.debug
11520/11593 Test  #8989: mpi/trilinos_ghost_03_linfty.mpirun=4.debug ............................................   Passed    3.05 sec
            Start  8992: mpi/trilinos_ghost_05.mpirun=4.debug
11521/11593 Test  #8992: mpi/trilinos_ghost_05.mpirun=4.debug ...................................................   Passed    2.97 sec
            Start  8993: mpi/trilinos_ghost_05.mpirun=4.release
11522/11593 Test  #8993: mpi/trilinos_ghost_05.mpirun=4.release .................................................   Passed    2.97 sec
            Start  9237: multigrid/transfer_matrix_free_06.mpirun=5.debug
11523/11593 Test  #9237: multigrid/transfer_matrix_free_06.mpirun=5.debug .......................................   Passed    6.40 sec
            Start  9238: multigrid/transfer_matrix_free_06.mpirun=5.release
11524/11593 Test  #9238: multigrid/transfer_matrix_free_06.mpirun=5.release .....................................   Passed    1.60 sec
11525/11593 Test  #7452: matrix_free/matrix_vector_faces_16.mpirun=11.debug .....................................   Passed   41.84 sec
            Start  8097: mpi/fe_tools_extrapolate_06.mpirun=10.debug
11526/11593 Test  #7453: matrix_free/matrix_vector_faces_16.mpirun=11.release ...................................   Passed   35.21 sec
            Start  8098: mpi/fe_tools_extrapolate_06.mpirun=10.release
11527/11593 Test  #8098: mpi/fe_tools_extrapolate_06.mpirun=10.release ..........................................   Passed   14.25 sec
            Start  8103: mpi/has_active_dofs_01.mpirun=10.debug
11528/11593 Test  #8097: mpi/fe_tools_extrapolate_06.mpirun=10.debug ............................................   Passed   15.54 sec
            Start  8104: mpi/has_active_dofs_01.mpirun=10.release
11529/11593 Test  #8104: mpi/has_active_dofs_01.mpirun=10.release ...............................................   Passed   19.90 sec
            Start  8105: mpi/has_active_dofs_02.mpirun=10.debug
11530/11593 Test  #8103: mpi/has_active_dofs_01.mpirun=10.debug .................................................   Passed   22.37 sec
            Start  8106: mpi/has_active_dofs_02.mpirun=10.release
11531/11593 Test  #8106: mpi/has_active_dofs_02.mpirun=10.release ...............................................   Passed   16.62 sec
            Start  8189: mpi/hp_unify_dof_indices_09.mpirun=10.debug
11532/11593 Test  #8105: mpi/has_active_dofs_02.mpirun=10.debug .................................................   Passed   19.31 sec
            Start  8190: mpi/hp_unify_dof_indices_09.mpirun=10.release
11533/11593 Test  #8190: mpi/hp_unify_dof_indices_09.mpirun=10.release ..........................................   Passed   18.29 sec
            Start  8303: mpi/mg_05.mpirun=10.debug
11534/11593 Test  #8189: mpi/hp_unify_dof_indices_09.mpirun=10.debug ............................................   Passed   21.95 sec
            Start  8304: mpi/mg_05.mpirun=10.release
11535/11593 Test  #8304: mpi/mg_05.mpirun=10.release ............................................................   Passed   19.32 sec
            Start  8354: mpi/no_flux_constraints_03.mpirun=9.release
            Start  8874: mpi/step-39.mpirun=6.debug
11536/11593 Test  #8303: mpi/mg_05.mpirun=10.debug ..............................................................   Passed   22.00 sec
            Start  8355: mpi/normal_flux_constraints.mpirun=9.debug
11537/11593 Test  #8354: mpi/no_flux_constraints_03.mpirun=9.release ............................................   Passed    4.54 sec
            Start  8356: mpi/normal_flux_constraints.mpirun=9.release
11538/11593 Test  #8874: mpi/step-39.mpirun=6.debug .............................................................   Passed    5.39 sec
            Start  8500: mpi/p_adaptivity_fixed_number.mpirun=8.debug
11539/11593 Test  #8500: mpi/p_adaptivity_fixed_number.mpirun=8.debug ...........................................   Passed    3.14 sec
            Start  8501: mpi/p_adaptivity_fixed_number.mpirun=8.release
11540/11593 Test  #8501: mpi/p_adaptivity_fixed_number.mpirun=8.release .........................................   Passed    2.99 sec
            Start  8506: mpi/p_refinement_and_coarsening.mpirun=8.debug
11541/11593 Test  #8506: mpi/p_refinement_and_coarsening.mpirun=8.debug .........................................   Passed    3.35 sec
            Start  8507: mpi/p_refinement_and_coarsening.mpirun=8.release
11542/11593 Test  #8507: mpi/p_refinement_and_coarsening.mpirun=8.release .......................................   Passed    3.02 sec
            Start  8708: mpi/periodicity_05.mpirun=9.debug
11543/11593 Test  #8356: mpi/normal_flux_constraints.mpirun=9.release ...........................................   Passed   25.05 sec
            Start  8709: mpi/periodicity_05.mpirun=9.release
11544/11593 Test  #8355: mpi/normal_flux_constraints.mpirun=9.debug .............................................   Passed   32.45 sec
            Start  8875: mpi/step-39.mpirun=6.release
11545/11593 Test  #8875: mpi/step-39.mpirun=6.release ...........................................................   Passed    3.99 sec
            Start  8896: mpi/tria_ghost_owners_01.mpirun=7.debug
11546/11593 Test  #8708: mpi/periodicity_05.mpirun=9.debug ......................................................   Passed   26.20 sec
            Start  8552: mpi/parallel_block_vector_13.mpirun=10.debug
11547/11593 Test  #8709: mpi/periodicity_05.mpirun=9.release ....................................................   Passed   20.80 sec
            Start  8897: mpi/tria_ghost_owners_01.mpirun=7.release
11548/11593 Test  #8552: mpi/parallel_block_vector_13.mpirun=10.debug ...........................................   Passed   14.30 sec
            Start  8553: mpi/parallel_block_vector_13.mpirun=10.release
11549/11593 Test  #8897: mpi/tria_ghost_owners_01.mpirun=7.release ..............................................   Passed   20.88 sec
            Start  9050: multigrid/constrained_dofs_02.mpirun=8.debug
11550/11593 Test  #8553: mpi/parallel_block_vector_13.mpirun=10.release .........................................   Passed   22.33 sec
            Start  9051: multigrid/constrained_dofs_02.mpirun=8.release
11551/11593 Test  #9050: multigrid/constrained_dofs_02.mpirun=8.debug ...........................................   Passed    9.49 sec
            Start  9163: multigrid/step-16-50-mpi.mpirun=7.debug
11552/11593 Test  #9051: multigrid/constrained_dofs_02.mpirun=8.release .........................................   Passed    1.96 sec
            Start  8712: mpi/periodicity_07.mpirun=13.debug
11553/11593 Test  #9163: multigrid/step-16-50-mpi.mpirun=7.debug ................................................   Passed    4.55 sec
            Start  9164: multigrid/step-16-50-mpi.mpirun=7.release
11554/11593 Test  #9164: multigrid/step-16-50-mpi.mpirun=7.release ..............................................   Passed    1.49 sec
            Start  9213: multigrid/transfer_matrix_free_01.mpirun=7.debug
11555/11593 Test  #8896: mpi/tria_ghost_owners_01.mpirun=7.debug ................................................   Passed   52.89 sec
            Start  9214: multigrid/transfer_matrix_free_01.mpirun=7.release
11556/11593 Test  #9214: multigrid/transfer_matrix_free_01.mpirun=7.release .....................................   Passed    1.80 sec
            Start  9229: multigrid/transfer_matrix_free_04.mpirun=7.debug
11557/11593 Test  #9213: multigrid/transfer_matrix_free_01.mpirun=7.debug .......................................   Passed   23.05 sec
            Start  9230: multigrid/transfer_matrix_free_04.mpirun=7.release
11558/11593 Test  #9230: multigrid/transfer_matrix_free_04.mpirun=7.release .....................................   Passed    2.00 sec
11559/11593 Test  #9229: multigrid/transfer_matrix_free_04.mpirun=7.debug .......................................   Passed   32.71 sec
            Start  8713: mpi/periodicity_07.mpirun=13.release
11560/11593 Test  #8712: mpi/periodicity_07.mpirun=13.debug .....................................................   Passed   42.03 sec
            Start  9183: multigrid/step-50_01.mpirun=8.debug
11561/11593 Test  #9183: multigrid/step-50_01.mpirun=8.debug ....................................................   Passed    1.56 sec
            Start  9184: multigrid/step-50_01.mpirun=8.release
11562/11593 Test  #9184: multigrid/step-50_01.mpirun=8.release ..................................................   Passed    1.03 sec
            Start 10284: remote_point_evaluation/remote_point_evaluation_03.mpirun=8.debug
11563/11593 Test  #8713: mpi/periodicity_07.mpirun=13.release ...................................................   Passed   27.88 sec
            Start 10285: remote_point_evaluation/remote_point_evaluation_03.mpirun=8.release
            Start 10286: remote_point_evaluation/vector_tools_evaluate_at_points_01.mpirun=8.debug
11564/11593 Test #10284: remote_point_evaluation/remote_point_evaluation_03.mpirun=8.debug ......................   Passed   41.14 sec
            Start 10287: remote_point_evaluation/vector_tools_evaluate_at_points_01.mpirun=8.release
11565/11593 Test #10286: remote_point_evaluation/vector_tools_evaluate_at_points_01.mpirun=8.debug ..............   Passed   30.95 sec
            Start 10288: remote_point_evaluation/vector_tools_evaluate_at_points_02.mpirun=8.debug
11566/11593 Test #10285: remote_point_evaluation/remote_point_evaluation_03.mpirun=8.release ....................   Passed   34.19 sec
            Start 10289: remote_point_evaluation/vector_tools_evaluate_at_points_02.mpirun=8.release
11567/11593 Test #10287: remote_point_evaluation/vector_tools_evaluate_at_points_01.mpirun=8.release ............   Passed   29.11 sec
            Start 11132: trilinos/n_nonzeros_02_parallel.mpirun=9.debug
11568/11593 Test #11132: trilinos/n_nonzeros_02_parallel.mpirun=9.debug .........................................   Passed   20.11 sec
            Start 11133: trilinos/n_nonzeros_02_parallel.mpirun=9.release
11569/11593 Test #10288: remote_point_evaluation/vector_tools_evaluate_at_points_02.mpirun=8.debug ..............***Failed   42.36 sec
11570/11593 Test #10289: remote_point_evaluation/vector_tools_evaluate_at_points_02.mpirun=8.release ............***Failed   39.43 sec
11571/11593 Test #11133: trilinos/n_nonzeros_02_parallel.mpirun=9.release .......................................   Passed   17.38 sec
            Start  8317: mpi/mg_ghost_dofs_periodic_05.mpirun=28.debug
11572/11593 Test  #8317: mpi/mg_ghost_dofs_periodic_05.mpirun=28.debug ..........................................   Passed   40.92 sec
            Start  8318: mpi/mg_ghost_dofs_periodic_05.mpirun=28.release
11573/11593 Test  #8318: mpi/mg_ghost_dofs_periodic_05.mpirun=28.release ........................................   Passed   24.51 sec
            Start  8469: mpi/p4est_3d_refine_04.mpirun=24.debug
11574/11593 Test  #8469: mpi/p4est_3d_refine_04.mpirun=24.debug .................................................   Passed    8.84 sec
            Start  8470: mpi/p4est_3d_refine_04.mpirun=24.release
11575/11593 Test  #8470: mpi/p4est_3d_refine_04.mpirun=24.release ...............................................   Passed    3.23 sec
            Start  8796: mpi/refinement_listener_01.mpirun=20.debug
            Start  8471: mpi/p4est_3d_refine_04.mpirun=4.debug
11576/11593 Test  #8796: mpi/refinement_listener_01.mpirun=20.debug .............................................   Passed    5.06 sec
            Start  8797: mpi/refinement_listener_01.mpirun=20.release
11577/11593 Test  #8797: mpi/refinement_listener_01.mpirun=20.release ...........................................   Passed    3.60 sec
            Start  8802: mpi/refinement_listener_02.mpirun=20.debug
11578/11593 Test  #8471: mpi/p4est_3d_refine_04.mpirun=4.debug ..................................................   Passed   10.35 sec
            Start  8472: mpi/p4est_3d_refine_04.mpirun=4.release
11579/11593 Test  #8802: mpi/refinement_listener_02.mpirun=20.debug .............................................   Passed    4.14 sec
            Start  8803: mpi/refinement_listener_02.mpirun=20.release
11580/11593 Test  #8472: mpi/p4est_3d_refine_04.mpirun=4.release ................................................   Passed    3.42 sec
            Start  8798: mpi/refinement_listener_01.mpirun=4.debug
11581/11593 Test  #8803: mpi/refinement_listener_02.mpirun=20.release ...........................................   Passed    3.32 sec
            Start  9067: multigrid/distribute_bug_01.mpirun=20.debug
11582/11593 Test  #8798: mpi/refinement_listener_01.mpirun=4.debug ..............................................   Passed    4.30 sec
            Start  8799: mpi/refinement_listener_01.mpirun=4.release
11583/11593 Test  #9067: multigrid/distribute_bug_01.mpirun=20.debug ............................................   Passed    5.31 sec
            Start  9068: multigrid/distribute_bug_01.mpirun=20.release
11584/11593 Test  #8799: mpi/refinement_listener_01.mpirun=4.release ............................................   Passed    3.37 sec
            Start  8804: mpi/refinement_listener_02.mpirun=4.debug
11585/11593 Test  #9068: multigrid/distribute_bug_01.mpirun=20.release ..........................................   Passed    1.15 sec
            Start  8319: mpi/mg_ghost_dofs_periodic_05.mpirun=6.debug
            Start  8320: mpi/mg_ghost_dofs_periodic_05.mpirun=6.release
            Start  8805: mpi/refinement_listener_02.mpirun=4.release
11586/11593 Test  #8804: mpi/refinement_listener_02.mpirun=4.debug ..............................................   Passed    3.53 sec
            Start  9069: multigrid/distribute_bug_01.mpirun=6.debug
11587/11593 Test  #8805: mpi/refinement_listener_02.mpirun=4.release ............................................   Passed    3.38 sec
            Start  9070: multigrid/distribute_bug_01.mpirun=6.release
11588/11593 Test  #8320: mpi/mg_ghost_dofs_periodic_05.mpirun=6.release .........................................   Passed    4.27 sec
11589/11593 Test  #9070: multigrid/distribute_bug_01.mpirun=6.release ...........................................   Passed    1.70 sec
11590/11593 Test  #9069: multigrid/distribute_bug_01.mpirun=6.debug .............................................   Passed    3.74 sec
11591/11593 Test  #8319: mpi/mg_ghost_dofs_periodic_05.mpirun=6.debug ...........................................   Passed   21.18 sec
            Start  8325: mpi/mg_ghost_dofs_periodic_07.mpirun=43.debug
11592/11593 Test  #8325: mpi/mg_ghost_dofs_periodic_07.mpirun=43.debug ..........................................   Passed    7.38 sec
            Start  8326: mpi/mg_ghost_dofs_periodic_07.mpirun=43.release
11593/11593 Test  #8326: mpi/mg_ghost_dofs_periodic_07.mpirun=43.release ........................................   Passed    4.05 sec

99% tests passed, 19 tests failed out of 11593

Total Test time (real) = 22981.25 sec

The following tests FAILED:
	2921 - cuda/precondition_03.mpirun=2.debug (Failed)
	2937 - cuda/solver_08.debug (Failed)
	2938 - cuda/solver_08.release (Failed)
	3175 - distributed_grids/3d_coarse_grid_02.debug (Failed)
	4864 - fullydistributed_grids/repartitioning_05.mpirun=4.debug (Failed)
	4865 - fullydistributed_grids/repartitioning_05.mpirun=4.release (Failed)
	5663 - hp/distribute_dofs_linear_time.debug (Timeout)
	8083 - mpi/fe_tools_extrapolate_01.mpirun=3.debug (Failed)
	8084 - mpi/fe_tools_extrapolate_01.mpirun=3.release (Failed)
	8089 - mpi/fe_tools_extrapolate_03.mpirun=3.debug (Failed)
	8090 - mpi/fe_tools_extrapolate_03.mpirun=3.release (Failed)
	8093 - mpi/fe_tools_extrapolate_04.mpirun=3.debug (Failed)
	8094 - mpi/fe_tools_extrapolate_04.mpirun=3.release (Failed)
	9730 - numerics/project_parallel_qp_q_01.mpirun=3.release (Failed)
	9732 - numerics/project_parallel_qp_q_02.mpirun=3.release (Failed)
	10288 - remote_point_evaluation/vector_tools_evaluate_at_points_02.mpirun=8.debug (Failed)
	10289 - remote_point_evaluation/vector_tools_evaluate_at_points_02.mpirun=8.release (Failed)
	11126 - trilinos/mg_transfer_prebuilt_01.mpirun=1.debug (Failed)
	11127 - trilinos/mg_transfer_prebuilt_01.mpirun=1.release (Failed)
-- Running CTEST_SUBMIT()
	Add file: /home/build/revision.log
	Add file: /home/build/summary.log
	Add file: /home/build/detailed.log
	Add file: /home/build/include/deal.II/base/config.h
Submit files
   Send to group: Continuous
   SubmitURL: https://cdash.43-1.org/submit.php?project=deal.II
   Uploaded: /home/build/Testing/20210926-0500/Update.xml
   Uploaded: /home/build/Testing/20210926-0500/Configure.xml
   Uploaded: /home/build/Testing/20210926-0500/Build.xml
   Error when uploading file: /home/build/Testing/20210926-0500/Test.xml
   Error message was: Operation too slow. Less than 1 bytes/sec transferred the last 120 seconds
   Problems when submitting via HTTP
mv: cannot create regular file '/var/jenkins/workspace/deal.II-CUDA11.0/build/tests/trilinos/block_sparse_matrix_add_01.debug/stdout': No space left on device
mv: cannot create regular file '/var/jenkins/workspace/deal.II-CUDA11.0/build/tests/trilinos/block_sparse_matrix_add_01.debug/diff': No space left on device
mv: cannot create regular file '/var/jenkins/workspace/deal.II-CUDA11.0/build/tests/trilinos/block_sparse_matrix_add_01.debug/output': No space left on device
mv: cannot create directory '/var/jenkins/workspace/deal.II-CUDA11.0/build/tests/trilinos/elide_zeros.debug': No space left on device
mv: cannot create directory '/var/jenkins/workspace/deal.II-CUDA11.0/build/tests/trilinos/45.debug': No space left on device
mv: cannot create directory '/var/jenkins/workspace/deal.II-CUDA11.0/build/tests/trilinos/54.debug': No space left on device
mv: cannot create directory '/var/jenkins/workspace/deal.II-CUDA11.0/build/tests/trilinos/68.release': No space left on device
mv: cannot create directory '/var/jenkins/workspace/deal.II-CUDA11.0/build/tests/trilinos/precondition_amg_smoother.debug': No space left on device
mv: cannot create directory '/var/jenkins/workspace/deal.II-CUDA11.0/build/tests/trilinos/sparse_matrix_add_01.release': No space left on device
mv: cannot create directory '/var/jenkins/workspace/deal.II-CUDA11.0/build/tests/trilinos/05.debug': No space left on device
mv: cannot create directory '/var/jenkins/workspace/deal.II-CUDA11.0/build/tests/trilinos/sparse_matrix_vector_08.debug': No space left on device
mv: cannot create directory '/var/jenkins/workspace/deal.II-CUDA11.0/build/tests/trilinos/trilinos_sparsity_pattern_04.debug': No space left on device
mv: cannot create directory '/var/jenkins/workspace/deal.II-CUDA11.0/build/tests/trilinos/vector_swap_01.debug': No space left on device
mv: cannot create directory '/var/jenkins/workspace/deal.II-CUDA11.0/build/tests/trilinos/21.debug': No space left on device
mv: cannot create directory '/var/jenkins/workspace/deal.II-CUDA11.0/build/tests/trilinos/assemble_matrix_parallel_01.debug': No space left on device
mv: cannot create directory '/var/jenkins/workspace/deal.II-CUDA11.0/build/tests/trilinos/block_sparse_matrix_add_01.release': No space left on device
mv: cannot create directory '/var/jenkins/workspace/deal.II-CUDA11.0/build/tests/trilinos/precondition_amg_smoother.release': No space left on device
mv: cannot create directory '/var/jenkins/workspace/deal.II-CUDA11.0/build/tests/trilinos/solver_03.debug': No space left on device
mv: cannot create directory '/var/jenkins/workspace/deal.II-CUDA11.0/build/tests/trilinos/33.release': No space left on device
mv: cannot create directory '/var/jenkins/workspace/deal.II-CUDA11.0/build/tests/trilinos/trilinos_sparse_matrix_iterator_01.debug': No space left on device
mv: cannot create directory '/var/jenkins/workspace/deal.II-CUDA11.0/build/tests/trilinos/vector_swap_01.release': No space left on device
mv: cannot create directory '/var/jenkins/workspace/deal.II-CUDA11.0/build/tests/trilinos/45.release': No space left on device
mv: cannot create directory '/var/jenkins/workspace/deal.II-CUDA11.0/build/tests/trilinos/54.release': No space left on device
mv: cannot create directory '/var/jenkins/workspace/deal.II-CUDA11.0/build/tests/trilinos/elide_zeros.release': No space left on device
mv: cannot create directory '/var/jenkins/workspace/deal.II-CUDA11.0/build/tests/trilinos/sparse_matrix_add_02.debug': No space left on device
mv: cannot create directory '/var/jenkins/workspace/deal.II-CUDA11.0/build/tests/trilinos/sparse_matrix_vector_08.release': No space left on device
mv: cannot create directory '/var/jenkins/workspace/deal.II-CUDA11.0/build/tests/trilinos/05.release': No space left on device
mv: cannot create directory '/var/jenkins/workspace/deal.II-CUDA11.0/build/tests/trilinos/69.debug': No space left on device
mv: cannot create directory '/var/jenkins/workspace/deal.II-CUDA11.0/build/tests/trilinos/precondition_muelu_dgp.debug': No space left on device
mv: cannot create directory '/var/jenkins/workspace/deal.II-CUDA11.0/build/tests/trilinos/trilinos_sparsity_pattern_04.release': No space left on device
mv: cannot create directory '/var/jenkins/workspace/deal.II-CUDA11.0/build/tests/trilinos/vector_swap_02.debug': No space left on device
mv: cannot create directory '/var/jenkins/workspace/deal.II-CUDA11.0/build/tests/trilinos/21.release': No space left on device
mv: cannot create directory '/var/jenkins/workspace/deal.II-CUDA11.0/build/tests/trilinos/block_sparse_matrix_set_01.debug': No space left on device
mv: cannot create directory '/var/jenkins/workspace/deal.II-CUDA11.0/build/tests/trilinos/precondition_muelu_dgp.release': No space left on device
mv: cannot create directory '/var/jenkins/workspace/deal.II-CUDA11.0/build/tests/trilinos/06.debug': No space left on device
mv: cannot create directory '/var/jenkins/workspace/deal.II-CUDA11.0/build/tests/trilinos/assemble_matrix_parallel_01.release': No space left on device
mv: cannot create directory '/var/jenkins/workspace/deal.II-CUDA11.0/build/tests/trilinos/solver_03.release': No space left on device
mv: cannot create directory '/var/jenkins/workspace/deal.II-CUDA11.0/build/tests/trilinos/sparse_matrix_add_02.release': No space left on device
mv: cannot create directory '/var/jenkins/workspace/deal.II-CUDA11.0/build/tests/trilinos/trilinos_sparse_matrix_iterator_01.release': No space left on device
mv: cannot create directory '/var/jenkins/workspace/deal.II-CUDA11.0/build/tests/trilinos/34.debug': No space left on device
mv: cannot create directory '/var/jenkins/workspace/deal.II-CUDA11.0/build/tests/trilinos/55.debug': No space left on device
mv: cannot create directory '/var/jenkins/workspace/deal.II-CUDA11.0/build/tests/trilinos/sparse_matrix_vector_09.debug': No space left on device
mv: cannot create directory '/var/jenkins/workspace/deal.II-CUDA11.0/build/tests/trilinos/trilinos_sparsity_pattern_05.debug': No space left on device
mv: cannot create directory '/var/jenkins/workspace/deal.II-CUDA11.0/build/tests/trilinos/vector_swap_02.release': No space left on device
mv: cannot create directory '/var/jenkins/workspace/deal.II-CUDA11.0/build/tests/trilinos/block_sparse_matrix_set_01.release': No space left on device
mv: cannot create directory '/var/jenkins/workspace/deal.II-CUDA11.0/build/tests/trilinos/epetra_vector_01.debug': No space left on device
mv: cannot create directory '/var/jenkins/workspace/deal.II-CUDA11.0/build/tests/trilinos/precondition_muelu_q_iso_q1.debug': No space left on device
mv: cannot create directory '/var/jenkins/workspace/deal.II-CUDA11.0/build/tests/trilinos/22.debug': No space left on device
mv: cannot create directory '/var/jenkins/workspace/deal.II-CUDA11.0/build/tests/trilinos/precondition_muelu_q_iso_q1.release': No space left on device
mv: cannot create directory '/var/jenkins/workspace/deal.II-CUDA11.0/build/tests/trilinos/sparse_matrix_add_03.debug': No space left on device
mv: cannot create directory '/var/jenkins/workspace/deal.II-CUDA11.0/build/tests/trilinos/06.release': No space left on device
mv: cannot create directory '/var/jenkins/workspace/deal.II-CUDA11.0/build/tests/trilinos/46.debug': No space left on device
mv: cannot create directory '/var/jenkins/workspace/deal.II-CUDA11.0/build/tests/trilinos/69.release': No space left on device
mv: cannot create directory '/var/jenkins/workspace/deal.II-CUDA11.0/build/tests/trilinos/solver_05.debug': No space left on device
mv: cannot create directory '/var/jenkins/workspace/deal.II-CUDA11.0/build/tests/trilinos/sparse_matrix_vector_09.release': No space left on device
mv: cannot create directory '/var/jenkins/workspace/deal.II-CUDA11.0/build/tests/trilinos/trilinos_sparsity_pattern_05.release': No space left on device
mv: cannot create directory '/var/jenkins/workspace/deal.II-CUDA11.0/build/tests/trilinos/block_sparse_matrix_vector_01.debug': No space left on device
mv: cannot create directory '/var/jenkins/workspace/deal.II-CUDA11.0/build/tests/trilinos/trilinos_sparse_matrix_iterator_02.debug': No space left on device
mv: cannot create directory '/var/jenkins/workspace/deal.II-CUDA11.0/build/tests/trilinos/07.debug': No space left on device
mv: cannot create directory '/var/jenkins/workspace/deal.II-CUDA11.0/build/tests/trilinos/34.release': No space left on device
mv: cannot create directory '/var/jenkins/workspace/deal.II-CUDA11.0/build/tests/trilinos/46.release': No space left on device
mv: cannot create directory '/var/jenkins/workspace/deal.II-CUDA11.0/build/tests/trilinos/55.release': No space left on device
mv: cannot create directory '/var/jenkins/workspace/deal.II-CUDA11.0/build/tests/trilinos/epetra_vector_01.release': No space left on device
mv: cannot create directory '/var/jenkins/workspace/deal.II-CUDA11.0/build/tests/trilinos/precondition_muelu_smoother.debug': No space left on device
mv: cannot create directory '/var/jenkins/workspace/deal.II-CUDA11.0/build/tests/trilinos/22.release': No space left on device
mv: cannot create directory '/var/jenkins/workspace/deal.II-CUDA11.0/build/tests/trilinos/block_sparse_matrix_vector_01.release': No space left on device
mv: cannot create directory '/var/jenkins/workspace/deal.II-CUDA11.0/build/tests/trilinos/sparse_matrix_vector_10.debug': No space left on device
mv: cannot create directory '/var/jenkins/workspace/deal.II-CUDA11.0/build/tests/trilinos/trilinos_sparse_matrix_iterator_02.release': No space left on device
mv: cannot create directory '/var/jenkins/workspace/deal.II-CUDA11.0/build/tests/trilinos/trilinos_sparsity_pattern_iterators_01.debug': No space left on device
mv: cannot create directory '/var/jenkins/workspace/deal.II-CUDA11.0/build/tests/trilinos/70.debug': No space left on device
mv: cannot create directory '/var/jenkins/workspace/deal.II-CUDA11.0/build/tests/trilinos/assemble_matrix_parallel_02.debug': No space left on device
mv: cannot create directory '/var/jenkins/workspace/deal.II-CUDA11.0/build/tests/trilinos/precondition_muelu_smoother.release': No space left on device
mv: cannot create directory '/var/jenkins/workspace/deal.II-CUDA11.0/build/tests/trilinos/solver_05.release': No space left on device
mv: cannot create directory '/var/jenkins/workspace/deal.II-CUDA11.0/build/tests/trilinos/sparse_matrix_add_03.release': No space left on device
mv: cannot create directory '/var/jenkins/workspace/deal.II-CUDA11.0/build/tests/trilinos/block_sparse_matrix_vector_02.debug': No space left on device
mv: cannot create directory '/var/jenkins/workspace/deal.II-CUDA11.0/build/tests/trilinos/sparse_matrix_vector_10.release': No space left on device
mv: cannot create directory '/var/jenkins/workspace/deal.II-CUDA11.0/build/tests/trilinos/trilinos_sparse_matrix_iterator_03.debug': No space left on device
mv: cannot create directory '/var/jenkins/workspace/deal.II-CUDA11.0/build/tests/trilinos/56.debug': No space left on device
mv: cannot create directory '/var/jenkins/workspace/deal.II-CUDA11.0/build/tests/trilinos/epetra_vector_02.debug': No space left on device
mv: cannot create directory '/var/jenkins/workspace/deal.II-CUDA11.0/build/tests/trilinos/trilinos_sparsity_pattern_iterators_01.release': No space left on device
mv: cannot create directory '/var/jenkins/workspace/deal.II-CUDA11.0/build/tests/trilinos/07.release': No space left on device
mv: cannot create directory '/var/jenkins/workspace/deal.II-CUDA11.0/build/tests/trilinos/23.debug': No space left on device
mv: cannot create directory '/var/jenkins/workspace/deal.II-CUDA11.0/build/tests/trilinos/block_sparse_matrix_vector_02.release': No space left on device
mv: cannot create directory '/var/jenkins/workspace/deal.II-CUDA11.0/build/tests/trilinos/precondition_q_iso_q1.debug': No space left on device
mv: cannot create directory '/var/jenkins/workspace/deal.II-CUDA11.0/build/tests/trilinos/solver_07.debug': No space left on device
mv: cannot create directory '/var/jenkins/workspace/deal.II-CUDA11.0/build/tests/trilinos/trilinos_sparse_matrix_iterator_03.release': No space left on device
mv: cannot create directory '/var/jenkins/workspace/deal.II-CUDA11.0/build/tests/trilinos/35.debug': No space left on device
mv: cannot create directory '/var/jenkins/workspace/deal.II-CUDA11.0/build/tests/trilinos/70.release': No space left on device
mv: cannot create directory '/var/jenkins/workspace/deal.II-CUDA11.0/build/tests/trilinos/sparse_matrix_vector_11.debug': No space left on device
mv: cannot create directory '/var/jenkins/workspace/deal.II-CUDA11.0/build/tests/trilinos/08.debug': No space left on device
mv: cannot create directory '/var/jenkins/workspace/deal.II-CUDA11.0/build/tests/trilinos/block_sparse_matrix_vector_03.debug': No space left on device
mv: cannot create directory '/var/jenkins/workspace/deal.II-CUDA11.0/build/tests/trilinos/sparse_matrix_copy_from_01.debug': No space left on device
mv: cannot create directory '/var/jenkins/workspace/deal.II-CUDA11.0/build/tests/trilinos/trilinos_sparsity_pattern_iterators_02.debug': No space left on device
mv: cannot create directory '/var/jenkins/workspace/deal.II-CUDA11.0/build/tests/trilinos/49.debug': No space left on device
mv: cannot create directory '/var/jenkins/workspace/deal.II-CUDA11.0/build/tests/trilinos/56.release': No space left on device
mv: cannot create directory '/var/jenkins/workspace/deal.II-CUDA11.0/build/tests/trilinos/epetra_vector_02.release': No space left on device
mv: cannot create directory '/var/jenkins/workspace/deal.II-CUDA11.0/build/tests/trilinos/solver_07.release': No space left on device
mv: cannot create directory '/var/jenkins/workspace/deal.II-CUDA11.0/build/tests/trilinos/trilinos_sparse_matrix_iterator_04.debug': No space left on device
mv: cannot create directory '/var/jenkins/workspace/deal.II-CUDA11.0/build/tests/trilinos/23.release': No space left on device
mv: cannot create directory '/var/jenkins/workspace/deal.II-CUDA11.0/build/tests/trilinos/assemble_matrix_parallel_02.release': No space left on device
mv: cannot create directory '/var/jenkins/workspace/deal.II-CUDA11.0/build/tests/trilinos/block_sparse_matrix_vector_03.release': No space left on device
mv: cannot create directory '/var/jenkins/workspace/deal.II-CUDA11.0/build/tests/trilinos/precondition_q_iso_q1.release': No space left on device
mv: cannot create directory '/var/jenkins/workspace/deal.II-CUDA11.0/build/tests/trilinos/sparse_matrix_copy_from_01.release': No space left on device
mv: cannot create directory '/var/jenkins/workspace/deal.II-CUDA11.0/build/tests/trilinos/sparse_matrix_vector_11.release': No space left on device
mv: cannot create directory '/var/jenkins/workspace/deal.II-CUDA11.0/build/tests/trilinos/trilinos_sparsity_pattern_iterators_02.release': No space left on device
mv: cannot create directory '/var/jenkins/workspace/deal.II-CUDA11.0/build/tests/trilinos/add_matrices_01.debug': No space left on device
mv: cannot create directory '/var/jenkins/workspace/deal.II-CUDA11.0/build/tests/trilinos/trilinos_sparse_matrix_iterator_04.release': No space left on device
mv: cannot create directory '/var/jenkins/workspace/deal.II-CUDA11.0/build/tests/trilinos/08.release': No space left on device
mv: cannot create directory '/var/jenkins/workspace/deal.II-CUDA11.0/build/tests/trilinos/35.release': No space left on device
mv: cannot create directory '/var/jenkins/workspace/deal.II-CUDA11.0/build/tests/trilinos/49.release': No space left on device
mv: cannot create directory '/var/jenkins/workspace/deal.II-CUDA11.0/build/tests/trilinos/solver_control_01.debug': No space left on device
mv: cannot create directory '/var/jenkins/workspace/deal.II-CUDA11.0/build/tests/trilinos/57.debug': No space left on device
mv: cannot create directory '/var/jenkins/workspace/deal.II-CUDA11.0/build/tests/trilinos/block_sparse_matrix_vector_04.debug': No space left on device
mv: cannot create directory '/var/jenkins/workspace/deal.II-CUDA11.0/build/tests/trilinos/epetra_vector_03.debug': No space left on device
mv: cannot create directory '/var/jenkins/workspace/deal.II-CUDA11.0/build/tests/trilinos/sparse_matrix_vector_12.debug': No space left on device
mv: cannot create directory '/var/jenkins/workspace/deal.II-CUDA11.0/build/tests/trilinos/update_ghosts.debug': No space left on device
mv: cannot create directory '/var/jenkins/workspace/deal.II-CUDA11.0/build/tests/trilinos/24.debug': No space left on device
mv: cannot create directory '/var/jenkins/workspace/deal.II-CUDA11.0/build/tests/trilinos/print_01.debug': No space left on device
mv: cannot create directory '/var/jenkins/workspace/deal.II-CUDA11.0/build/tests/trilinos/solver_control_01.release': No space left on device
mv: cannot create directory '/var/jenkins/workspace/deal.II-CUDA11.0/build/tests/trilinos/sparse_matrix_copy_from_02.debug': No space left on device
mv: cannot create directory '/var/jenkins/workspace/deal.II-CUDA11.0/build/tests/trilinos/09.debug': No space left on device
mv: cannot create directory '/var/jenkins/workspace/deal.II-CUDA11.0/build/tests/trilinos/add_matrices_01.release': No space left on device
mv: cannot create directory '/var/jenkins/workspace/deal.II-CUDA11.0/build/tests/trilinos/sparse_matrix_vector_12.release': No space left on device
mv: cannot create directory '/var/jenkins/workspace/deal.II-CUDA11.0/build/tests/trilinos/update_ghosts.release': No space left on device
mv: cannot create directory '/var/jenkins/workspace/deal.II-CUDA11.0/build/tests/trilinos/epetra_vector_03.release': No space left on device
mv: cannot create directory '/var/jenkins/workspace/deal.II-CUDA11.0/build/tests/trilinos/solver_control_02.debug': No space left on device
mv: cannot create directory '/var/jenkins/workspace/deal.II-CUDA11.0/build/tests/trilinos/sparse_matrix_copy_from_02.release': No space left on device
mv: cannot create directory '/var/jenkins/workspace/deal.II-CUDA11.0/build/tests/trilinos/trilinos_sparse_matrix_iterator_05.debug': No space left on device
mv: cannot create directory '/var/jenkins/workspace/deal.II-CUDA11.0/build/tests/trilinos/57.release': No space left on device
mv: cannot create directory '/var/jenkins/workspace/deal.II-CUDA11.0/build/tests/trilinos/36.debug': No space left on device
mv: cannot create directory '/var/jenkins/workspace/deal.II-CUDA11.0/build/tests/trilinos/block_sparse_matrix_vector_04.release': No space left on device
mv: cannot create directory '/var/jenkins/workspace/deal.II-CUDA11.0/build/tests/trilinos/print_01.release': No space left on device
mv: cannot create directory '/var/jenkins/workspace/deal.II-CUDA11.0/build/tests/trilinos/sparse_matrix_vector_13.debug': No space left on device
mv: cannot create directory '/var/jenkins/workspace/deal.II-CUDA11.0/build/tests/trilinos/09.release': No space left on device
mv: cannot create directory '/var/jenkins/workspace/deal.II-CUDA11.0/build/tests/trilinos/24.release': No space left on device
mv: cannot create directory '/var/jenkins/workspace/deal.II-CUDA11.0/build/tests/trilinos/solver_control_02.release': No space left on device
mv: cannot create directory '/var/jenkins/workspace/deal.II-CUDA11.0/build/tests/trilinos/trilinos_sparse_matrix_iterator_05.release': No space left on device
mv: cannot create directory '/var/jenkins/workspace/deal.II-CUDA11.0/build/tests/trilinos/index_set_01.debug': No space left on device
mv: cannot create directory '/var/jenkins/workspace/deal.II-CUDA11.0/build/tests/trilinos/sparse_matrix_vector_13.release': No space left on device
mv: cannot create directory '/var/jenkins/workspace/deal.II-CUDA11.0/build/tests/trilinos/vector_assign_01.debug': No space left on device
mv: cannot create directory '/var/jenkins/workspace/deal.II-CUDA11.0/build/tests/trilinos/49a.debug': No space left on device
mv: cannot create directory '/var/jenkins/workspace/deal.II-CUDA11.0/build/tests/trilinos/add_matrices_02.debug': No space left on device
mv: cannot create directory '/var/jenkins/workspace/deal.II-CUDA11.0/build/tests/trilinos/block_vector_iterator_01.debug': No space left on device
mv: cannot create directory '/var/jenkins/workspace/deal.II-CUDA11.0/build/tests/trilinos/solver_control_03.debug': No space left on device
mv: cannot create directory '/var/jenkins/workspace/deal.II-CUDA11.0/build/tests/trilinos/sparse_matrix_iterator.debug': No space left on device
mv: cannot create directory '/var/jenkins/workspace/deal.II-CUDA11.0/build/tests/trilinos/10.debug': No space left on device
mv: cannot create directory '/var/jenkins/workspace/deal.II-CUDA11.0/build/tests/trilinos/36.release': No space left on device
mv: cannot create directory '/var/jenkins/workspace/deal.II-CUDA11.0/build/tests/trilinos/sparse_matrix_iterator.release': No space left on device
mv: cannot create directory '/var/jenkins/workspace/deal.II-CUDA11.0/build/tests/trilinos/sparsity_pattern_01.debug': No space left on device
mv: cannot create directory '/var/jenkins/workspace/deal.II-CUDA11.0/build/tests/trilinos/26.debug': No space left on device
mv: cannot create directory '/var/jenkins/workspace/deal.II-CUDA11.0/build/tests/trilinos/58.debug': No space left on device
mv: cannot create directory '/var/jenkins/workspace/deal.II-CUDA11.0/build/tests/trilinos/block_vector_iterator_01.release': No space left on device
mv: cannot create directory '/var/jenkins/workspace/deal.II-CUDA11.0/build/tests/trilinos/index_set_01.release': No space left on device
mv: cannot create directory '/var/jenkins/workspace/deal.II-CUDA11.0/build/tests/trilinos/solver_control_03.release': No space left on device
mv: cannot create directory '/var/jenkins/workspace/deal.II-CUDA11.0/build/tests/trilinos/trilinos_sparse_matrix_iterator_06.debug': No space left on device
mv: cannot create directory '/var/jenkins/workspace/deal.II-CUDA11.0/build/tests/trilinos/vector_assign_01.release': No space left on device
mv: cannot create directory '/var/jenkins/workspace/deal.II-CUDA11.0/build/tests/trilinos/CMakeFiles': No space left on device
mv: cannot create directory '/var/jenkins/workspace/deal.II-CUDA11.0/build/tests/trilinos/readwritevector.debug': No space left on device
mv: cannot create directory '/var/jenkins/workspace/deal.II-CUDA11.0/build/tests/trilinos/sparsity_pattern_01.release': No space left on device
mv: cannot create directory '/var/jenkins/workspace/deal.II-CUDA11.0/build/tests/trilinos/10.release': No space left on device
mv: cannot create directory '/var/jenkins/workspace/deal.II-CUDA11.0/build/tests/trilinos/block_vector_iterator_02.debug': No space left on device
mv: cannot create directory '/var/jenkins/workspace/deal.II-CUDA11.0/build/tests/trilinos/solver_control_04.debug': No space left on device
mv: cannot create directory '/var/jenkins/workspace/deal.II-CUDA11.0/build/tests/trilinos/sparse_matrix_iterator_01.debug': No space left on device
mv: cannot create directory '/var/jenkins/workspace/deal.II-CUDA11.0/build/tests/trilinos/trilinos_sparse_matrix_iterator_06.release': No space left on device
mv: cannot create directory '/var/jenkins/workspace/deal.II-CUDA11.0/build/tests/trilinos/49a.release': No space left on device
mv: cannot create directory '/var/jenkins/workspace/deal.II-CUDA11.0/build/tests/trilinos/add_matrices_02.release': No space left on device
mv: cannot create directory '/var/jenkins/workspace/deal.II-CUDA11.0/build/tests/trilinos/index_set_02.debug': No space left on device
mv: cannot create directory '/var/jenkins/workspace/deal.II-CUDA11.0/build/tests/trilinos/sparsity_pattern_02.debug': No space left on device
mv: cannot create directory '/var/jenkins/workspace/deal.II-CUDA11.0/build/tests/trilinos/26.release': No space left on device
mv: cannot create directory '/var/jenkins/workspace/deal.II-CUDA11.0/build/tests/trilinos/58.release': No space left on device
mv: cannot create directory '/var/jenkins/workspace/deal.II-CUDA11.0/build/tests/trilinos/block_vector_iterator_02.release': No space left on device
mv: cannot create directory '/var/jenkins/workspace/deal.II-CUDA11.0/build/tests/trilinos/solver_control_04.release': No space left on device
mv: cannot create directory '/var/jenkins/workspace/deal.II-CUDA11.0/build/tests/trilinos/sparse_matrix_iterator_01.release': No space left on device
mv: cannot create directory '/var/jenkins/workspace/deal.II-CUDA11.0/build/tests/trilinos/trilinos_sparse_matrix_iterator_07.debug': No space left on device
mv: cannot create directory '/var/jenkins/workspace/deal.II-CUDA11.0/build/tests/trilinos/vector_assign_02.debug': No space left on device
mv: cannot create directory '/var/jenkins/workspace/deal.II-CUDA11.0/build/tests/trilinos/11.debug': No space left on device
mv: cannot create directory '/var/jenkins/workspace/deal.II-CUDA11.0/build/tests/trilinos/37.debug': No space left on device
mv: cannot create directory '/var/jenkins/workspace/deal.II-CUDA11.0/build/tests/trilinos/readwritevector.release': No space left on device
mv: cannot create directory '/var/jenkins/workspace/deal.II-CUDA11.0/build/tests/trilinos/assemble_matrix_parallel_03.debug': No space left on device
mv: cannot create directory '/var/jenkins/workspace/deal.II-CUDA11.0/build/tests/trilinos/block_vector_iterator_03.debug': No space left on device
mv: cannot create directory '/var/jenkins/workspace/deal.II-CUDA11.0/build/tests/trilinos/index_set_02.release': No space left on device
mv: cannot create directory '/var/jenkins/workspace/deal.II-CUDA11.0/build/tests/trilinos/solver_control_05.debug': No space left on device
mv: cannot create directory '/var/jenkins/workspace/deal.II-CUDA11.0/build/tests/trilinos/sparsity_pattern_02.release': No space left on device
mv: cannot create directory '/var/jenkins/workspace/deal.II-CUDA11.0/build/tests/trilinos/vector_assign_02.release': No space left on device
mv: cannot create directory '/var/jenkins/workspace/deal.II-CUDA11.0/build/tests/trilinos/11.release': No space left on device
mv: cannot create directory '/var/jenkins/workspace/deal.II-CUDA11.0/build/tests/trilinos/add_matrices_03.debug': No space left on device
mv: cannot create directory '/var/jenkins/workspace/deal.II-CUDA11.0/build/tests/trilinos/block_vector_iterator_03.release': No space left on device
mv: cannot create directory '/var/jenkins/workspace/deal.II-CUDA11.0/build/tests/trilinos/solver_control_05.release': No space left on device
mv: cannot create directory '/var/jenkins/workspace/deal.II-CUDA11.0/build/tests/trilinos/sparse_matrix_set_01.debug': No space left on device
mv: cannot create directory '/var/jenkins/workspace/deal.II-CUDA11.0/build/tests/trilinos/vector_equality_1.debug': No space left on device
mv: cannot create directory '/var/jenkins/workspace/deal.II-CUDA11.0/build/tests/trilinos/27.debug': No space left on device
mv: cannot create directory '/var/jenkins/workspace/deal.II-CUDA11.0/build/tests/trilinos/49b.debug': No space left on device
mv: cannot create directory '/var/jenkins/workspace/deal.II-CUDA11.0/build/tests/trilinos/60.debug': No space left on device
mv: cannot create directory '/var/jenkins/workspace/deal.II-CUDA11.0/build/tests/trilinos/sparsity_pattern_03.debug': No space left on device
mv: cannot create directory '/var/jenkins/workspace/deal.II-CUDA11.0/build/tests/trilinos/block_vector_move_operations.debug': No space left on device
mv: cannot create directory '/var/jenkins/workspace/deal.II-CUDA11.0/build/tests/trilinos/solver_control_06.debug': No space left on device
mv: cannot create directory '/var/jenkins/workspace/deal.II-CUDA11.0/build/tests/trilinos/sparse_matrix_set_01.release': No space left on device
mv: cannot create directory '/var/jenkins/workspace/deal.II-CUDA11.0/build/tests/trilinos/trilinos_sparse_matrix_iterator_07.release': No space left on device
mv: cannot create directory '/var/jenkins/workspace/deal.II-CUDA11.0/build/tests/trilinos/vector_equality_1.release': No space left on device
mv: cannot create directory '/var/jenkins/workspace/deal.II-CUDA11.0/build/tests/trilinos/37.release': No space left on device
mv: cannot create directory '/var/jenkins/workspace/deal.II-CUDA11.0/build/tests/trilinos/mg_transfer_prebuilt_01.debug': No space left on device
mv: cannot create directory '/var/jenkins/workspace/deal.II-CUDA11.0/build/tests/trilinos/readwritevector_02.debug': No space left on device
mv: cannot create directory '/var/jenkins/workspace/deal.II-CUDA11.0/build/tests/trilinos/12.debug': No space left on device
mv: cannot create directory '/var/jenkins/workspace/deal.II-CUDA11.0/build/tests/trilinos/27.release': No space left on device
mv: cannot create directory '/var/jenkins/workspace/deal.II-CUDA11.0/build/tests/trilinos/60.release': No space left on device
mv: cannot create directory '/var/jenkins/workspace/deal.II-CUDA11.0/build/tests/trilinos/assemble_matrix_parallel_03.release': No space left on device
mv: cannot create directory '/var/jenkins/workspace/deal.II-CUDA11.0/build/tests/trilinos/block_vector_move_operations.release': No space left on device
mv: cannot create directory '/var/jenkins/workspace/deal.II-CUDA11.0/build/tests/trilinos/vector_equality_2.debug': No space left on device
mv: cannot create directory '/var/jenkins/workspace/deal.II-CUDA11.0/build/tests/trilinos/49b.release': No space left on device
mv: cannot create directory '/var/jenkins/workspace/deal.II-CUDA11.0/build/tests/trilinos/solver_control_06.release': No space left on device
mv: cannot create directory '/var/jenkins/workspace/deal.II-CUDA11.0/build/tests/trilinos/sparse_matrix_set_02.debug': No space left on device
mv: cannot create directory '/var/jenkins/workspace/deal.II-CUDA11.0/build/tests/trilinos/sparsity_pattern_03.release': No space left on device
mv: cannot create directory '/var/jenkins/workspace/deal.II-CUDA11.0/build/tests/trilinos/trilinos_sparse_matrix_iterator_08.debug': No space left on device
mv: cannot create directory '/var/jenkins/workspace/deal.II-CUDA11.0/build/tests/trilinos/copy_to_dealvec_block.debug': No space left on device
mv: cannot create directory '/var/jenkins/workspace/deal.II-CUDA11.0/build/tests/trilinos/sparse_matrix_set_02.release': No space left on device
mv: cannot create directory '/var/jenkins/workspace/deal.II-CUDA11.0/build/tests/trilinos/vector_equality_2.release': No space left on device
mv: cannot create directory '/var/jenkins/workspace/deal.II-CUDA11.0/build/tests/trilinos/add_matrices_03.release': No space left on device
mv: cannot create directory '/var/jenkins/workspace/deal.II-CUDA11.0/build/tests/trilinos/mg_transfer_prebuilt_01.release': No space left on device
mv: cannot create directory '/var/jenkins/workspace/deal.II-CUDA11.0/build/tests/trilinos/readwritevector_02.release': No space left on device
mv: cannot create directory '/var/jenkins/workspace/deal.II-CUDA11.0/build/tests/trilinos/sparsity_pattern_04.debug': No space left on device
mv: cannot create directory '/var/jenkins/workspace/deal.II-CUDA11.0/build/tests/trilinos/trilinos_sparse_matrix_iterator_08.release': No space left on device
mv: cannot create directory '/var/jenkins/workspace/deal.II-CUDA11.0/build/tests/trilinos/12.release': No space left on device
mv: cannot create directory '/var/jenkins/workspace/deal.II-CUDA11.0/build/tests/trilinos/vector_equality_3.debug': No space left on device
mv: cannot create directory '/var/jenkins/workspace/deal.II-CUDA11.0/build/tests/trilinos/38.debug': No space left on device
mv: cannot create directory '/var/jenkins/workspace/deal.II-CUDA11.0/build/tests/trilinos/assemble_matrix_parallel_04.debug': No space left on device
mv: cannot create directory '/var/jenkins/workspace/deal.II-CUDA11.0/build/tests/trilinos/copy_to_dealvec_block.release': No space left on device
mv: cannot create directory '/var/jenkins/workspace/deal.II-CUDA11.0/build/tests/trilinos/sparse_matrix_set_03.debug': No space left on device
mv: cannot create directory '/var/jenkins/workspace/deal.II-CUDA11.0/build/tests/trilinos/28.debug': No space left on device
mv: cannot create directory '/var/jenkins/workspace/deal.II-CUDA11.0/build/tests/trilinos/61.debug': No space left on device
mv: cannot create directory '/var/jenkins/workspace/deal.II-CUDA11.0/build/tests/trilinos/trilinos_sparse_matrix_iterator_09.debug': No space left on device
mv: cannot create directory '/var/jenkins/workspace/deal.II-CUDA11.0/build/tests/trilinos/vector_equality_3.release': No space left on device
mv: cannot create directory '/var/jenkins/workspace/deal.II-CUDA11.0/build/tests/trilinos/13.debug': No space left on device
mv: cannot create directory '/var/jenkins/workspace/deal.II-CUDA11.0/build/tests/trilinos/50.debug': No space left on device
mv: cannot create directory '/var/jenkins/workspace/deal.II-CUDA11.0/build/tests/trilinos/n_nonzeros_01.debug': No space left on device
mv: cannot create directory '/var/jenkins/workspace/deal.II-CUDA11.0/build/tests/trilinos/readwritevector_03.debug': No space left on device
mv: cannot create directory '/var/jenkins/workspace/deal.II-CUDA11.0/build/tests/trilinos/sparsity_pattern_04.release': No space left on device
mv: cannot create directory '/var/jenkins/workspace/deal.II-CUDA11.0/build/tests/trilinos/28.release': No space left on device
mv: cannot create directory '/var/jenkins/workspace/deal.II-CUDA11.0/build/tests/trilinos/assemble_matrix_parallel_04.release': No space left on device
mv: cannot create directory '/var/jenkins/workspace/deal.II-CUDA11.0/build/tests/trilinos/deal_solver_01.debug': No space left on device
mv: cannot create directory '/var/jenkins/workspace/deal.II-CUDA11.0/build/tests/trilinos/sparse_matrix_set_03.release': No space left on device
mv: cannot create directory '/var/jenkins/workspace/deal.II-CUDA11.0/build/tests/trilinos/trilinos_sparse_matrix_iterator_09.release': No space left on device
mv: cannot create directory '/var/jenkins/workspace/deal.II-CUDA11.0/build/tests/trilinos/38.release': No space left on device
mv: cannot create directory '/var/jenkins/workspace/deal.II-CUDA11.0/build/tests/trilinos/n_nonzeros_01.release': No space left on device
mv: cannot create directory '/var/jenkins/workspace/deal.II-CUDA11.0/build/tests/trilinos/vector_equality_4.debug': No space left on device
mv: cannot create directory '/var/jenkins/workspace/deal.II-CUDA11.0/build/tests/trilinos/13.release': No space left on device
mv: cannot create directory '/var/jenkins/workspace/deal.II-CUDA11.0/build/tests/trilinos/deal_solver_01.release': No space left on device
mv: cannot create directory '/var/jenkins/workspace/deal.II-CUDA11.0/build/tests/trilinos/61.release': No space left on device
mv: cannot create directory '/var/jenkins/workspace/deal.II-CUDA11.0/build/tests/trilinos/add_matrices_04.debug': No space left on device
mv: cannot create directory '/var/jenkins/workspace/deal.II-CUDA11.0/build/tests/trilinos/n_nonzeros_02.debug': No space left on device
mv: cannot create directory '/var/jenkins/workspace/deal.II-CUDA11.0/build/tests/trilinos/sparsity_pattern_05.debug': No space left on device
mv: cannot create directory '/var/jenkins/workspace/deal.II-CUDA11.0/build/tests/trilinos/trilinos_sparse_matrix_iterator_10.debug': No space left on device
mv: cannot create directory '/var/jenkins/workspace/deal.II-CUDA11.0/build/tests/trilinos/50.release': No space left on device
mv: cannot create directory '/var/jenkins/workspace/deal.II-CUDA11.0/build/tests/trilinos/deal_solver_02.debug': No space left on device
mv: cannot create directory '/var/jenkins/workspace/deal.II-CUDA11.0/build/tests/trilinos/readwritevector_03.release': No space left on device
mv: cannot create directory '/var/jenkins/workspace/deal.II-CUDA11.0/build/tests/trilinos/14.debug': No space left on device
mv: cannot create directory '/var/jenkins/workspace/deal.II-CUDA11.0/build/tests/trilinos/assemble_matrix_parallel_05.debug': No space left on device
mv: cannot create directory '/var/jenkins/workspace/deal.II-CUDA11.0/build/tests/trilinos/n_nonzeros_02.release': No space left on device
mv: cannot create directory '/var/jenkins/workspace/deal.II-CUDA11.0/build/tests/trilinos/trilinos_sparse_matrix_iterator_10.release': No space left on device
mv: cannot create directory '/var/jenkins/workspace/deal.II-CUDA11.0/build/tests/trilinos/vector_equality_4.release': No space left on device
mv: cannot create directory '/var/jenkins/workspace/deal.II-CUDA11.0/build/tests/trilinos/39.debug': No space left on device
mv: cannot create directory '/var/jenkins/workspace/deal.II-CUDA11.0/build/tests/trilinos/deal_solver_02.release': No space left on device
mv: cannot create directory '/var/jenkins/workspace/deal.II-CUDA11.0/build/tests/trilinos/sparsity_pattern_05.release': No space left on device
mv: cannot create directory '/var/jenkins/workspace/deal.II-CUDA11.0/build/tests/trilinos/62.debug': No space left on device
mv: cannot create directory '/var/jenkins/workspace/deal.II-CUDA11.0/build/tests/trilinos/n_nonzeros_02_parallel.debug': No space left on device
mv: cannot create directory '/var/jenkins/workspace/deal.II-CUDA11.0/build/tests/trilinos/sparse_matrix_01.debug': No space left on device
mv: cannot create directory '/var/jenkins/workspace/deal.II-CUDA11.0/build/tests/trilinos/vector_local_copy_01.debug': No space left on device
mv: cannot create directory '/var/jenkins/workspace/deal.II-CUDA11.0/build/tests/trilinos/29.debug': No space left on device
mv: cannot create directory '/var/jenkins/workspace/deal.II-CUDA11.0/build/tests/trilinos/add_matrices_04.release': No space left on device
mv: cannot create directory '/var/jenkins/workspace/deal.II-CUDA11.0/build/tests/trilinos/trilinos_sparse_matrix_iterator_11.debug': No space left on device
mv: cannot create directory '/var/jenkins/workspace/deal.II-CUDA11.0/build/tests/trilinos/14.release': No space left on device
mv: cannot create directory '/var/jenkins/workspace/deal.II-CUDA11.0/build/tests/trilinos/39.release': No space left on device
mv: cannot create directory '/var/jenkins/workspace/deal.II-CUDA11.0/build/tests/trilinos/deal_solver_03.debug': No space left on device
mv: cannot create directory '/var/jenkins/workspace/deal.II-CUDA11.0/build/tests/trilinos/readwritevector_04.debug': No space left on device
mv: cannot create directory '/var/jenkins/workspace/deal.II-CUDA11.0/build/tests/trilinos/n_nonzeros_02_parallel.release': No space left on device
mv: cannot create directory '/var/jenkins/workspace/deal.II-CUDA11.0/build/tests/trilinos/sparse_matrix_vector_01.debug': No space left on device
mv: cannot create directory '/var/jenkins/workspace/deal.II-CUDA11.0/build/tests/trilinos/sparsity_pattern_06.debug': No space left on device
mv: cannot create directory '/var/jenkins/workspace/deal.II-CUDA11.0/build/tests/trilinos/15.debug': No space left on device
mv: cannot create directory '/var/jenkins/workspace/deal.II-CUDA11.0/build/tests/trilinos/51.debug': No space left on device
mv: cannot create directory '/var/jenkins/workspace/deal.II-CUDA11.0/build/tests/trilinos/deal_solver_03.release': No space left on device
mv: cannot create directory '/var/jenkins/workspace/deal.II-CUDA11.0/build/tests/trilinos/vector_local_copy_01.release': No space left on device
mv: cannot create directory '/var/jenkins/workspace/deal.II-CUDA11.0/build/tests/trilinos/62.release': No space left on device
mv: cannot create directory '/var/jenkins/workspace/deal.II-CUDA11.0/build/tests/trilinos/assemble_matrix_parallel_05.release': No space left on device
mv: cannot create directory '/var/jenkins/workspace/deal.II-CUDA11.0/build/tests/trilinos/readwritevector_04.release': No space left on device
mv: cannot create directory '/var/jenkins/workspace/deal.II-CUDA11.0/build/tests/trilinos/sparse_matrix_01.release': No space left on device
mv: cannot create directory '/var/jenkins/workspace/deal.II-CUDA11.0/build/tests/trilinos/29.release': No space left on device
mv: cannot create directory '/var/jenkins/workspace/deal.II-CUDA11.0/build/tests/trilinos/add_matrices_05.debug': No space left on device
mv: cannot create directory '/var/jenkins/workspace/deal.II-CUDA11.0/build/tests/trilinos/parallel_block_vector_copy_01.debug': No space left on device
mv: cannot create directory '/var/jenkins/workspace/deal.II-CUDA11.0/build/tests/trilinos/sparse_matrix_vector_01.release': No space left on device
mv: cannot create directory '/var/jenkins/workspace/deal.II-CUDA11.0/build/tests/trilinos/trilinos_sparse_matrix_iterator_11.release': No space left on device
mv: cannot create directory '/var/jenkins/workspace/deal.II-CUDA11.0/build/tests/trilinos/15.release': No space left on device
mv: cannot create directory '/var/jenkins/workspace/deal.II-CUDA11.0/build/tests/trilinos/sparsity_pattern_06.release': No space left on device
mv: cannot create directory '/var/jenkins/workspace/deal.II-CUDA11.0/build/tests/trilinos/deal_solver_04.debug': No space left on device
mv: cannot create directory '/var/jenkins/workspace/deal.II-CUDA11.0/build/tests/trilinos/sparse_matrix_02.debug': No space left on device
mv: cannot create directory '/var/jenkins/workspace/deal.II-CUDA11.0/build/tests/trilinos/63.debug': No space left on device
mv: cannot create directory '/var/jenkins/workspace/deal.II-CUDA11.0/build/tests/trilinos/parallel_block_vector_copy_01.release': No space left on device
mv: cannot create directory '/var/jenkins/workspace/deal.II-CUDA11.0/build/tests/trilinos/sparse_matrix_vector_02.debug': No space left on device
mv: cannot create directory '/var/jenkins/workspace/deal.II-CUDA11.0/build/tests/trilinos/40.debug': No space left on device
mv: cannot create directory '/var/jenkins/workspace/deal.II-CUDA11.0/build/tests/trilinos/51.release': No space left on device
mv: cannot create directory '/var/jenkins/workspace/deal.II-CUDA11.0/build/tests/trilinos/add_matrices_05.release': No space left on device
mv: cannot create directory '/var/jenkins/workspace/deal.II-CUDA11.0/build/tests/trilinos/deal_solver_04.release': No space left on device
mv: cannot create directory '/var/jenkins/workspace/deal.II-CUDA11.0/build/tests/trilinos/renumbering_01.debug': No space left on device
mv: cannot create directory '/var/jenkins/workspace/deal.II-CUDA11.0/build/tests/trilinos/16.debug': No space left on device
mv: cannot create directory '/var/jenkins/workspace/deal.II-CUDA11.0/build/tests/trilinos/sparse_matrix_02.release': No space left on device
mv: cannot create directory '/var/jenkins/workspace/deal.II-CUDA11.0/build/tests/trilinos/30.debug': No space left on device
mv: cannot create directory '/var/jenkins/workspace/deal.II-CUDA11.0/build/tests/trilinos/sparsity_pattern_07.debug': No space left on device
mv: cannot create directory '/var/jenkins/workspace/deal.II-CUDA11.0/build/tests/trilinos/parallel_sparse_matrix_01.debug': No space left on device
mv: cannot create directory '/var/jenkins/workspace/deal.II-CUDA11.0/build/tests/trilinos/sparse_matrix_vector_02.release': No space left on device
mv: cannot create directory '/var/jenkins/workspace/deal.II-CUDA11.0/build/tests/trilinos/trilinos_sparse_matrix_iterator_12.debug': No space left on device
mv: cannot create directory '/var/jenkins/workspace/deal.II-CUDA11.0/build/tests/trilinos/16.release': No space left on device
mv: cannot create directory '/var/jenkins/workspace/deal.II-CUDA11.0/build/tests/trilinos/63.release': No space left on device
mv: cannot create directory '/var/jenkins/workspace/deal.II-CUDA11.0/build/tests/trilinos/add_matrices_06.debug': No space left on device
mv: cannot create directory '/var/jenkins/workspace/deal.II-CUDA11.0/build/tests/trilinos/deal_solver_05.debug': No space left on device
mv: cannot create directory '/var/jenkins/workspace/deal.II-CUDA11.0/build/tests/trilinos/renumbering_01.release': No space left on device
mv: cannot create directory '/var/jenkins/workspace/deal.II-CUDA11.0/build/tests/trilinos/sparse_matrix_03.debug': No space left on device
mv: cannot create directory '/var/jenkins/workspace/deal.II-CUDA11.0/build/tests/trilinos/01.debug': No space left on device
mv: cannot create directory '/var/jenkins/workspace/deal.II-CUDA11.0/build/tests/trilinos/40.release': No space left on device
mv: cannot create directory '/var/jenkins/workspace/deal.II-CUDA11.0/build/tests/trilinos/deal_solver_05.release': No space left on device
mv: cannot create directory '/var/jenkins/workspace/deal.II-CUDA11.0/build/tests/trilinos/vector_move_operations.debug': No space left on device
mv: cannot create directory '/var/jenkins/workspace/deal.II-CUDA11.0/build/tests/trilinos/52.debug': No space left on device
mv: cannot create directory '/var/jenkins/workspace/deal.II-CUDA11.0/build/tests/trilinos/assemble_matrix_parallel_06.debug': No space left on device
mv: cannot create directory '/var/jenkins/workspace/deal.II-CUDA11.0/build/tests/trilinos/parallel_sparse_matrix_01.release': No space left on device
mv: cannot create directory '/var/jenkins/workspace/deal.II-CUDA11.0/build/tests/trilinos/sparsity_pattern_07.release': No space left on device
mv: cannot create directory '/var/jenkins/workspace/deal.II-CUDA11.0/build/tests/trilinos/trilinos_sparse_matrix_iterator_12.release': No space left on device
mv: cannot create directory '/var/jenkins/workspace/deal.II-CUDA11.0/build/tests/trilinos/01.release': No space left on device
mv: cannot create directory '/var/jenkins/workspace/deal.II-CUDA11.0/build/tests/trilinos/17.debug': No space left on device
mv: cannot create directory '/var/jenkins/workspace/deal.II-CUDA11.0/build/tests/trilinos/30.release': No space left on device
mv: cannot create directory '/var/jenkins/workspace/deal.II-CUDA11.0/build/tests/trilinos/64.debug': No space left on device
mv: cannot create directory '/var/jenkins/workspace/deal.II-CUDA11.0/build/tests/trilinos/sparse_matrix_03.release': No space left on device
mv: cannot create directory '/var/jenkins/workspace/deal.II-CUDA11.0/build/tests/trilinos/sparse_matrix_vector_03.debug': No space left on device
mv: cannot create directory '/var/jenkins/workspace/deal.II-CUDA11.0/build/tests/trilinos/trilinos_sparsity_pattern_01.debug': No space left on device
mv: cannot create directory '/var/jenkins/workspace/deal.II-CUDA11.0/build/tests/trilinos/add_matrices_06.release': No space left on device
mv: cannot create directory '/var/jenkins/workspace/deal.II-CUDA11.0/build/tests/trilinos/deal_solver_06.debug': No space left on device
mv: cannot create directory '/var/jenkins/workspace/deal.II-CUDA11.0/build/tests/trilinos/02.debug': No space left on device
mv: cannot create directory '/var/jenkins/workspace/deal.II-CUDA11.0/build/tests/trilinos/assemble_matrix_parallel_06.release': No space left on device
mv: cannot create directory '/var/jenkins/workspace/deal.II-CUDA11.0/build/tests/trilinos/deal_solver_06.release': No space left on device
mv: cannot create directory '/var/jenkins/workspace/deal.II-CUDA11.0/build/tests/trilinos/sparse_matrix_04.debug': No space left on device
mv: cannot create directory '/var/jenkins/workspace/deal.II-CUDA11.0/build/tests/trilinos/vector_move_operations.release': No space left on device
mv: cannot create directory '/var/jenkins/workspace/deal.II-CUDA11.0/build/tests/trilinos/17.release': No space left on device
mv: cannot create directory '/var/jenkins/workspace/deal.II-CUDA11.0/build/tests/trilinos/64.release': No space left on device
mv: cannot create directory '/var/jenkins/workspace/deal.II-CUDA11.0/build/tests/trilinos/precondition.debug': No space left on device
mv: cannot create directory '/var/jenkins/workspace/deal.II-CUDA11.0/build/tests/trilinos/slowness_01.debug': No space left on device
mv: cannot create directory '/var/jenkins/workspace/deal.II-CUDA11.0/build/tests/trilinos/sparse_matrix_vector_03.release': No space left on device
mv: cannot create directory '/var/jenkins/workspace/deal.II-CUDA11.0/build/tests/trilinos/trilinos_sparsity_pattern_01.release': No space left on device
mv: cannot create directory '/var/jenkins/workspace/deal.II-CUDA11.0/build/tests/trilinos/41.debug': No space left on device
mv: cannot create directory '/var/jenkins/workspace/deal.II-CUDA11.0/build/tests/trilinos/52.release': No space left on device
mv: cannot create directory '/var/jenkins/workspace/deal.II-CUDA11.0/build/tests/trilinos/sparse_matrix_04.release': No space left on device
mv: cannot create directory '/var/jenkins/workspace/deal.II-CUDA11.0/build/tests/trilinos/02.release': No space left on device
mv: cannot create directory '/var/jenkins/workspace/deal.II-CUDA11.0/build/tests/trilinos/31.debug': No space left on device
mv: cannot create directory '/var/jenkins/workspace/deal.II-CUDA11.0/build/tests/trilinos/amg_nondeterministic_01.debug': No space left on device
mv: cannot create directory '/var/jenkins/workspace/deal.II-CUDA11.0/build/tests/trilinos/direct_solver.debug': No space left on device
mv: cannot create directory '/var/jenkins/workspace/deal.II-CUDA11.0/build/tests/trilinos/slowness_01.release': No space left on device
mv: cannot create directory '/var/jenkins/workspace/deal.II-CUDA11.0/build/tests/trilinos/sparse_matrix_vector_04.debug': No space left on device
mv: cannot create directory '/var/jenkins/workspace/deal.II-CUDA11.0/build/tests/trilinos/vector_reference_01.debug': No space left on device
mv: cannot create directory '/var/jenkins/workspace/deal.II-CUDA11.0/build/tests/trilinos/18.debug': No space left on device
mv: cannot create directory '/var/jenkins/workspace/deal.II-CUDA11.0/build/tests/trilinos/66.debug': No space left on device
mv: cannot create directory '/var/jenkins/workspace/deal.II-CUDA11.0/build/tests/trilinos/direct_solver.release': No space left on device
mv: cannot create directory '/var/jenkins/workspace/deal.II-CUDA11.0/build/tests/trilinos/sparse_matrix_05.debug': No space left on device
mv: cannot create regular file '/var/jenkins/workspace/deal.II-CUDA11.0/build/tests/trilinos/CMakeCache.txt': No space left on device
mv: cannot create regular file '/var/jenkins/workspace/deal.II-CUDA11.0/build/tests/trilinos/Makefile': No space left on device
mv: cannot create regular file '/var/jenkins/workspace/deal.II-CUDA11.0/build/tests/trilinos/cmake_install.cmake': No space left on device
mv: cannot create regular file '/var/jenkins/workspace/deal.II-CUDA11.0/build/tests/trilinos/CTestTestfile.cmake': No space left on device
mv: cannot create directory '/var/jenkins/workspace/deal.II-CUDA11.0/build/tests/trilinos/assemble_matrix_parallel_07.debug': No space left on device
mv: cannot create directory '/var/jenkins/workspace/deal.II-CUDA11.0/build/tests/trilinos/precondition.release': No space left on device
mv: cannot create directory '/var/jenkins/workspace/deal.II-CUDA11.0/build/tests/trilinos/slowness_02.debug': No space left on device
mv: cannot create directory '/var/jenkins/workspace/deal.II-CUDA11.0/build/tests/trilinos/sparse_matrix_vector_04.release': No space left on device
mv: cannot create directory '/var/jenkins/workspace/deal.II-CUDA11.0/build/tests/trilinos/03a.debug': No space left on device
mv: cannot create directory '/var/jenkins/workspace/deal.II-CUDA11.0/build/tests/trilinos/41.release': No space left on device
mv: cannot create directory '/var/jenkins/workspace/deal.II-CUDA11.0/build/tests/trilinos/amg_nondeterministic_01.release': No space left on device
mv: cannot create directory '/var/jenkins/workspace/deal.II-CUDA11.0/build/tests/trilinos/sparse_matrix_05.release': No space left on device
mv: cannot create directory '/var/jenkins/workspace/deal.II-CUDA11.0/build/tests/trilinos/trilinos_sparsity_pattern_02.debug': No space left on device
mv: cannot create directory '/var/jenkins/workspace/deal.II-CUDA11.0/build/tests/trilinos/vector_reference_01.release': No space left on device
mv: cannot create directory '/var/jenkins/workspace/deal.II-CUDA11.0/build/tests/trilinos/18.release': No space left on device
mv: cannot create directory '/var/jenkins/workspace/deal.II-CUDA11.0/build/tests/trilinos/31.release': No space left on device
mv: cannot create directory '/var/jenkins/workspace/deal.II-CUDA11.0/build/tests/trilinos/66.release': No space left on device
mv: cannot create directory '/var/jenkins/workspace/deal.II-CUDA11.0/build/tests/trilinos/direct_solver_2.debug': No space left on device
mv: cannot create directory '/var/jenkins/workspace/deal.II-CUDA11.0/build/tests/trilinos/slowness_02.release': No space left on device
mv: cannot create directory '/var/jenkins/workspace/deal.II-CUDA11.0/build/tests/trilinos/subtract_mean_value_04.debug': No space left on device
mv: cannot create directory '/var/jenkins/workspace/deal.II-CUDA11.0/build/tests/trilinos/assemble_matrix_parallel_07.release': No space left on device
mv: cannot create directory '/var/jenkins/workspace/deal.II-CUDA11.0/build/tests/trilinos/sparse_matrix_07.debug': No space left on device
mv: cannot create directory '/var/jenkins/workspace/deal.II-CUDA11.0/build/tests/trilinos/sparse_matrix_vector_05.debug': No space left on device
mv: cannot create directory '/var/jenkins/workspace/deal.II-CUDA11.0/build/tests/trilinos/03a.release': No space left on device
mv: cannot create directory '/var/jenkins/workspace/deal.II-CUDA11.0/build/tests/trilinos/53.debug': No space left on device
mv: cannot create directory '/var/jenkins/workspace/deal.II-CUDA11.0/build/tests/trilinos/precondition_amg_dgp_01.debug': No space left on device
mv: cannot create directory '/var/jenkins/workspace/deal.II-CUDA11.0/build/tests/trilinos/slowness_03.debug': No space left on device
mv: cannot create directory '/var/jenkins/workspace/deal.II-CUDA11.0/build/tests/umfpack': No space left on device
mv: cannot create directory '/var/jenkins/workspace/deal.II-CUDA11.0/build/tests/vector': No space left on device
mv: cannot create directory '/var/jenkins/workspace/deal.II-CUDA11.0/build/tests/vector_tools': No space left on device
mv: cannot create directory '/var/jenkins/workspace/deal.II-CUDA11.0/build/tests/zoltan': No space left on device
mv: cannot create directory '/var/jenkins/workspace/deal.II-CUDA11.0/build/doc': No space left on device
mv: cannot create directory '/var/jenkins/workspace/deal.II-CUDA11.0/build/bundled': No space left on device
mv: cannot create regular file '/var/jenkins/workspace/deal.II-CUDA11.0/build/revision.log': No space left on device
mv: cannot create regular file '/var/jenkins/workspace/deal.II-CUDA11.0/build/detailed.log': No space left on device
mv: cannot create regular file '/var/jenkins/workspace/deal.II-CUDA11.0/build/summary.log': No space left on device
mv: cannot create regular file '/var/jenkins/workspace/deal.II-CUDA11.0/build/CTestTestfile.cmake': No space left on device
mv: cannot create regular file '/var/jenkins/workspace/deal.II-CUDA11.0/build/Makefile': No space left on device
mv: cannot create regular file '/var/jenkins/workspace/deal.II-CUDA11.0/build/cmake_install.cmake': No space left on device
mv: cannot create regular file '/var/jenkins/workspace/deal.II-CUDA11.0/build/CMakeCache.txt': No space left on device
mv: cannot create directory '/var/jenkins/workspace/deal.II-CUDA11.0/build/CMakeFiles': No space left on device
mv: cannot create directory '/var/jenkins/workspace/deal.II-CUDA11.0/build/source': No space left on device
+ docker rm -f cuda11_deal_ci
cuda11_deal_ci
Build step 'Execute shell' marked build as failure
INFO: Processing CTest-Version 3.x (default)
INFO: [CTest-Version 3.x (default)] - 1 test report file(s) were found with the pattern 'build/Testing/**/Test.xml' relative to '/var/jenkins/workspace/deal.II-CUDA11.0' for the testing framework 'CTest-Version 3.x (default)'.
INFO: Check 'Failed Tests' threshold.
INFO: The total number of tests for the threshold 'Failed Tests' exceeds the specified "failure threshold" value.
INFO: Setting the build status to FAILURE
Finished: FAILURE