Console Output

Skipping 2,143 KB.. Full Log
            Start 10377: sharedtria/limit_p_level_difference_01.mpirun=4.release
10828/11571 Test #10377: sharedtria/limit_p_level_difference_01.mpirun=4.release ................................   Passed    0.63 sec
            Start 10380: sharedtria/limit_p_level_difference_02.mpirun=4.debug
10829/11571 Test #10380: sharedtria/limit_p_level_difference_02.mpirun=4.debug ..................................   Passed    0.97 sec
            Start 10381: sharedtria/limit_p_level_difference_02.mpirun=4.release
10830/11571 Test  #9705: numerics/project_parallel_q_05.mpirun=4.debug ..........................................   Passed   28.19 sec
            Start 10384: sharedtria/limit_p_level_difference_03.mpirun=4.debug
10831/11571 Test #10381: sharedtria/limit_p_level_difference_02.mpirun=4.release ................................   Passed    0.69 sec
            Start 10385: sharedtria/limit_p_level_difference_03.mpirun=4.release
10832/11571 Test #10385: sharedtria/limit_p_level_difference_03.mpirun=4.release ................................   Passed    0.68 sec
            Start 10430: simplex/extract_boundary_dofs.mpirun=5.debug
10833/11571 Test #10384: sharedtria/limit_p_level_difference_03.mpirun=4.debug ..................................   Passed    1.07 sec
            Start 10431: simplex/extract_boundary_dofs.mpirun=5.release
10834/11571 Test #10430: simplex/extract_boundary_dofs.mpirun=5.debug ...........................................   Passed    1.12 sec
            Start 10552: simplex/step-68.mpirun=4.debug
10835/11571 Test #10431: simplex/extract_boundary_dofs.mpirun=5.release .........................................   Passed    0.76 sec
            Start 10553: simplex/step-68.mpirun=4.release
10836/11571 Test #10553: simplex/step-68.mpirun=4.release .......................................................   Passed    1.62 sec
            Start 11036: trilinos/assemble_matrix_parallel_02.mpirun=4.debug
10837/11571 Test #10269: remote_point_evaluation/vector_tools_evaluate_at_points_03.mpirun=4.release ............   Passed   30.77 sec
            Start 11037: trilinos/assemble_matrix_parallel_02.mpirun=4.release
10838/11571 Test #11036: trilinos/assemble_matrix_parallel_02.mpirun=4.debug ....................................   Passed    8.48 sec
            Start 11038: trilinos/assemble_matrix_parallel_03.mpirun=4.debug
10839/11571 Test #11037: trilinos/assemble_matrix_parallel_02.mpirun=4.release ..................................   Passed    2.28 sec
            Start 11039: trilinos/assemble_matrix_parallel_03.mpirun=4.release
10840/11571 Test #10268: remote_point_evaluation/vector_tools_evaluate_at_points_03.mpirun=4.debug ..............   Passed   33.42 sec
            Start 11040: trilinos/assemble_matrix_parallel_04.mpirun=4.debug
10841/11571 Test #10274: remote_point_evaluation/vector_tools_evaluate_at_points_05.mpirun=4.debug ..............   Passed   33.74 sec
            Start 11041: trilinos/assemble_matrix_parallel_04.mpirun=4.release
10842/11571 Test #10275: remote_point_evaluation/vector_tools_evaluate_at_points_05.mpirun=4.release ............   Passed   33.07 sec
            Start 11044: trilinos/assemble_matrix_parallel_05.mpirun=4.debug
10843/11571 Test #10552: simplex/step-68.mpirun=4.debug .........................................................   Passed   20.67 sec
            Start 11045: trilinos/assemble_matrix_parallel_05.mpirun=4.release
10844/11571 Test #11045: trilinos/assemble_matrix_parallel_05.mpirun=4.release ..................................   Passed    1.55 sec
            Start 11046: trilinos/assemble_matrix_parallel_06.mpirun=4.debug
10845/11571 Test #11044: trilinos/assemble_matrix_parallel_05.mpirun=4.debug ....................................   Passed    7.55 sec
            Start 11047: trilinos/assemble_matrix_parallel_06.mpirun=4.release
10846/11571 Test #11039: trilinos/assemble_matrix_parallel_03.mpirun=4.release ..................................   Passed   26.52 sec
            Start 11048: trilinos/assemble_matrix_parallel_07.mpirun=4.debug
10847/11571 Test #11038: trilinos/assemble_matrix_parallel_03.mpirun=4.debug ....................................   Passed   32.37 sec
            Start 11049: trilinos/assemble_matrix_parallel_07.mpirun=4.release
10848/11571 Test #11041: trilinos/assemble_matrix_parallel_04.mpirun=4.release ..................................   Passed   32.36 sec
            Start 11072: trilinos/copy_to_dealvec_block.mpirun=4.debug
10849/11571 Test #11040: trilinos/assemble_matrix_parallel_04.mpirun=4.debug ....................................   Passed   36.16 sec
            Start 11073: trilinos/copy_to_dealvec_block.mpirun=4.release
10850/11571 Test #11047: trilinos/assemble_matrix_parallel_06.mpirun=4.release ..................................   Passed   31.74 sec
            Start 11284: trilinos/trilinos_sparsity_pattern_02.mpirun=4.debug
10851/11571 Test #11046: trilinos/assemble_matrix_parallel_06.mpirun=4.debug ....................................   Passed   36.12 sec
            Start 11285: trilinos/trilinos_sparsity_pattern_02.mpirun=4.release
10852/11571 Test #11072: trilinos/copy_to_dealvec_block.mpirun=4.debug ..........................................   Passed   13.22 sec
            Start 11286: trilinos/trilinos_sparsity_pattern_03.mpirun=4.debug
10853/11571 Test #11073: trilinos/copy_to_dealvec_block.mpirun=4.release ........................................   Passed   11.81 sec
            Start 11287: trilinos/trilinos_sparsity_pattern_03.mpirun=4.release
10854/11571 Test #11287: trilinos/trilinos_sparsity_pattern_03.mpirun=4.release .................................   Passed   10.03 sec
10855/11571 Test #11049: trilinos/assemble_matrix_parallel_07.mpirun=4.release ..................................   Passed   27.07 sec
            Start  1618: base/mpi_all_gather_01.mpirun=6.debug
10856/11571 Test #11286: trilinos/trilinos_sparsity_pattern_03.mpirun=4.debug ...................................   Passed   11.55 sec
            Start  1619: base/mpi_all_gather_01.mpirun=6.release
10857/11571 Test  #1618: base/mpi_all_gather_01.mpirun=6.debug ..................................................   Passed    2.46 sec
            Start  1638: base/mpi_gather_01.mpirun=6.debug
10858/11571 Test  #1619: base/mpi_all_gather_01.mpirun=6.release ................................................   Passed    2.38 sec
            Start  1639: base/mpi_gather_01.mpirun=6.release
10859/11571 Test  #1638: base/mpi_gather_01.mpirun=6.debug ......................................................   Passed    2.58 sec
            Start  1658: base/mpi_some_to_some_01.mpirun=6.debug
10860/11571 Test #11048: trilinos/assemble_matrix_parallel_07.mpirun=4.debug ....................................   Passed   37.20 sec
10861/11571 Test #11285: trilinos/trilinos_sparsity_pattern_02.mpirun=4.release .................................   Passed   16.98 sec
            Start  1659: base/mpi_some_to_some_01.mpirun=6.release
10862/11571 Test  #1639: base/mpi_gather_01.mpirun=6.release ....................................................   Passed    2.50 sec
            Start  4828: fullydistributed_grids/copy_serial_tria_05.mpirun=9.debug
10863/11571 Test  #1658: base/mpi_some_to_some_01.mpirun=6.debug ................................................   Passed    2.42 sec
            Start  4850: fullydistributed_grids/copy_serial_tria_grouped_01.mpirun=7.debug
10864/11571 Test  #1659: base/mpi_some_to_some_01.mpirun=6.release ..............................................   Passed    2.44 sec
            Start  4851: fullydistributed_grids/copy_serial_tria_grouped_01.mpirun=7.release
10865/11571 Test #11284: trilinos/trilinos_sparsity_pattern_02.mpirun=4.debug ...................................   Passed   19.70 sec
10866/11571 Test  #4828: fullydistributed_grids/copy_serial_tria_05.mpirun=9.debug ..............................   Passed   26.59 sec
            Start  9041: multigrid/distribute_bug_01.mpirun=13.debug
10867/11571 Test  #9041: multigrid/distribute_bug_01.mpirun=13.debug ............................................   Passed   22.02 sec
            Start  9042: multigrid/distribute_bug_01.mpirun=13.release
10868/11571 Test  #4851: fullydistributed_grids/copy_serial_tria_grouped_01.mpirun=7.release ....................   Passed   63.71 sec
            Start  9043: multigrid/distribute_bug_01.mpirun=2.debug
10869/11571 Test  #9042: multigrid/distribute_bug_01.mpirun=13.release ..........................................   Passed   18.22 sec
            Start  8275: mpi/mg_04.mpirun=10.debug
            Start  9044: multigrid/distribute_bug_01.mpirun=2.release
10870/11571 Test  #9044: multigrid/distribute_bug_01.mpirun=2.release ...........................................   Passed    1.25 sec
            Start  6319: lac/diagonal_matrix_02.mpirun=7.debug
10871/11571 Test  #4850: fullydistributed_grids/copy_serial_tria_grouped_01.mpirun=7.debug ......................   Passed   67.28 sec
            Start  6320: lac/diagonal_matrix_02.mpirun=7.release
10872/11571 Test  #9043: multigrid/distribute_bug_01.mpirun=2.debug .............................................   Passed    2.87 sec
10873/11571 Test  #6319: lac/diagonal_matrix_02.mpirun=7.debug ..................................................   Passed    1.96 sec
            Start  4829: fullydistributed_grids/copy_serial_tria_05.mpirun=9.release
10874/11571 Test  #6320: lac/diagonal_matrix_02.mpirun=7.release ................................................   Passed    1.76 sec
            Start  7128: matrix_free/cell_categorization.mpirun=7.debug
10875/11571 Test  #8275: mpi/mg_04.mpirun=10.debug ..............................................................   Passed    3.63 sec
            Start  8276: mpi/mg_04.mpirun=10.release
10876/11571 Test  #7128: matrix_free/cell_categorization.mpirun=7.debug .........................................   Passed    2.01 sec
            Start  8277: mpi/mg_04.mpirun=2.debug
10877/11571 Test  #8276: mpi/mg_04.mpirun=10.release ............................................................   Passed    3.00 sec
            Start  8445: mpi/p4est_3d_refine_04.mpirun=10.debug
            Start  8278: mpi/mg_04.mpirun=2.release
10878/11571 Test  #8277: mpi/mg_04.mpirun=2.debug ...............................................................   Passed    3.11 sec
            Start  8279: mpi/mg_04.mpirun=4.debug
10879/11571 Test  #8278: mpi/mg_04.mpirun=2.release .............................................................   Passed    2.91 sec
10880/11571 Test  #8279: mpi/mg_04.mpirun=4.debug ...............................................................   Passed    3.37 sec
            Start  7129: matrix_free/cell_categorization.mpirun=7.release
10881/11571 Test  #8445: mpi/p4est_3d_refine_04.mpirun=10.debug .................................................   Passed    7.64 sec
            Start  8446: mpi/p4est_3d_refine_04.mpirun=10.release
10882/11571 Test  #7129: matrix_free/cell_categorization.mpirun=7.release .......................................   Passed    2.39 sec
            Start  7134: matrix_free/cell_categorization_02.mpirun=7.debug
10883/11571 Test  #8446: mpi/p4est_3d_refine_04.mpirun=10.release ...............................................   Passed    4.34 sec
            Start  8696: mpi/point_to_point_pattern_01.mpirun=10.debug
10884/11571 Test  #7134: matrix_free/cell_categorization_02.mpirun=7.debug ......................................   Passed    9.59 sec
            Start  7135: matrix_free/cell_categorization_02.mpirun=7.release
10885/11571 Test  #7135: matrix_free/cell_categorization_02.mpirun=7.release ....................................   Passed    1.88 sec
            Start  7166: matrix_free/dg_pbc_01.mpirun=7.debug
10886/11571 Test  #4829: fullydistributed_grids/copy_serial_tria_05.mpirun=9.release ............................   Passed   22.72 sec
            Start  7167: matrix_free/dg_pbc_01.mpirun=7.release
10887/11571 Test  #7167: matrix_free/dg_pbc_01.mpirun=7.release .................................................   Passed    1.59 sec
            Start  7170: matrix_free/dg_pbc_02.mpirun=7.debug
10888/11571 Test  #7166: matrix_free/dg_pbc_01.mpirun=7.debug ...................................................   Passed    1.82 sec
            Start  7171: matrix_free/dg_pbc_02.mpirun=7.release
10889/11571 Test  #7171: matrix_free/dg_pbc_02.mpirun=7.release .................................................   Passed    1.75 sec
            Start  7531: matrix_free/parallel_multigrid.mpirun=7.debug
10890/11571 Test  #7170: matrix_free/dg_pbc_02.mpirun=7.debug ...................................................   Passed    2.30 sec
            Start  7532: matrix_free/parallel_multigrid.mpirun=7.release
10891/11571 Test  #8696: mpi/point_to_point_pattern_01.mpirun=10.debug ..........................................   Passed   14.08 sec
            Start  8697: mpi/point_to_point_pattern_01.mpirun=10.release
            Start  8698: mpi/point_to_point_pattern_01.mpirun=3.debug
10892/11571 Test  #7532: matrix_free/parallel_multigrid.mpirun=7.release ........................................   Passed    3.28 sec
            Start  7535: matrix_free/parallel_multigrid_02.mpirun=7.debug
10893/11571 Test  #8698: mpi/point_to_point_pattern_01.mpirun=3.debug ...........................................   Passed    4.31 sec
10894/11571 Test  #7535: matrix_free/parallel_multigrid_02.mpirun=7.debug .......................................   Passed    6.48 sec
            Start  7536: matrix_free/parallel_multigrid_02.mpirun=7.release
10895/11571 Test  #7536: matrix_free/parallel_multigrid_02.mpirun=7.release .....................................   Passed    1.66 sec
            Start  7539: matrix_free/parallel_multigrid_adaptive_01.mpirun=7.debug
10896/11571 Test  #8697: mpi/point_to_point_pattern_01.mpirun=10.release ........................................   Passed   13.36 sec
            Start  8772: mpi/refinement_listener_01.mpirun=10.debug
            Start  8699: mpi/point_to_point_pattern_01.mpirun=3.release
10897/11571 Test  #7531: matrix_free/parallel_multigrid.mpirun=7.debug ..........................................   Passed   19.55 sec
            Start  7540: matrix_free/parallel_multigrid_adaptive_01.mpirun=7.release
10898/11571 Test  #8699: mpi/point_to_point_pattern_01.mpirun=3.release .........................................   Passed    3.14 sec
10899/11571 Test  #7540: matrix_free/parallel_multigrid_adaptive_01.mpirun=7.release ............................   Passed    2.71 sec
            Start  7543: matrix_free/parallel_multigrid_adaptive_02.mpirun=7.debug
10900/11571 Test  #7539: matrix_free/parallel_multigrid_adaptive_01.mpirun=7.debug ..............................   Passed   29.28 sec
            Start  7544: matrix_free/parallel_multigrid_adaptive_02.mpirun=7.release
10901/11571 Test  #8772: mpi/refinement_listener_01.mpirun=10.debug .............................................   Passed   36.18 sec
            Start  8773: mpi/refinement_listener_01.mpirun=10.release
10902/11571 Test  #7544: matrix_free/parallel_multigrid_adaptive_02.mpirun=7.release ............................   Passed   12.12 sec
            Start  7561: matrix_free/parallel_multigrid_mf.mpirun=7.debug
10903/11571 Test  #7543: matrix_free/parallel_multigrid_adaptive_02.mpirun=7.debug ..............................   Passed   47.27 sec
            Start  7562: matrix_free/parallel_multigrid_mf.mpirun=7.release
10904/11571 Test  #8773: mpi/refinement_listener_01.mpirun=10.release ...........................................   Passed   20.42 sec
            Start  8778: mpi/refinement_listener_02.mpirun=10.debug
10905/11571 Test  #8778: mpi/refinement_listener_02.mpirun=10.debug .............................................   Passed   24.06 sec
            Start  8779: mpi/refinement_listener_02.mpirun=10.release
10906/11571 Test  #8779: mpi/refinement_listener_02.mpirun=10.release ...........................................   Passed   21.08 sec
            Start  8818: mpi/simple_mpi_01.mpirun=10.debug
10907/11571 Test  #7561: matrix_free/parallel_multigrid_mf.mpirun=7.debug .......................................   Passed   68.54 sec
            Start  7711: mpi/attach_data_01.mpirun=8.debug
10908/11571 Test  #7711: mpi/attach_data_01.mpirun=8.debug ......................................................   Passed    3.39 sec
            Start  7712: mpi/attach_data_01.mpirun=8.release
10909/11571 Test  #7712: mpi/attach_data_01.mpirun=8.release ....................................................   Passed    3.10 sec
            Start  7717: mpi/attach_data_02.mpirun=8.debug
10910/11571 Test  #8818: mpi/simple_mpi_01.mpirun=10.debug ......................................................   Passed   13.19 sec
            Start  8819: mpi/simple_mpi_01.mpirun=10.release
10911/11571 Test  #7717: mpi/attach_data_02.mpirun=8.debug ......................................................   Passed    3.37 sec
            Start  8820: mpi/simple_mpi_01.mpirun=3.debug
            Start  7995: mpi/derivative_approximation_02.mpirun=7.debug
10912/11571 Test  #8820: mpi/simple_mpi_01.mpirun=3.debug .......................................................   Passed    3.09 sec
10913/11571 Test  #7995: mpi/derivative_approximation_02.mpirun=7.debug .........................................   Passed    3.42 sec
            Start  7718: mpi/attach_data_02.mpirun=8.release
10914/11571 Test  #7718: mpi/attach_data_02.mpirun=8.release ....................................................   Passed    3.09 sec
            Start  7729: mpi/cell_data_transfer_01.mpirun=8.debug
10915/11571 Test  #7729: mpi/cell_data_transfer_01.mpirun=8.debug ...............................................   Passed    3.25 sec
            Start  7730: mpi/cell_data_transfer_01.mpirun=8.release
10916/11571 Test  #8819: mpi/simple_mpi_01.mpirun=10.release ....................................................   Passed   11.32 sec
            Start  8856: mpi/tria_01.mpirun=10.debug
10917/11571 Test  #7730: mpi/cell_data_transfer_01.mpirun=8.release .............................................   Passed    3.07 sec
            Start  8821: mpi/simple_mpi_01.mpirun=3.release
            Start  7996: mpi/derivative_approximation_02.mpirun=7.release
10918/11571 Test  #7562: matrix_free/parallel_multigrid_mf.mpirun=7.release .....................................   Passed   76.56 sec
            Start  8087: mpi/has_hanging_nodes.mpirun=7.debug
10919/11571 Test  #8821: mpi/simple_mpi_01.mpirun=3.release .....................................................   Passed    3.14 sec
10920/11571 Test  #7996: mpi/derivative_approximation_02.mpirun=7.release .......................................   Passed    3.13 sec
            Start  7733: mpi/cell_data_transfer_02.mpirun=8.debug
10921/11571 Test  #8087: mpi/has_hanging_nodes.mpirun=7.debug ...................................................   Passed    4.86 sec
            Start  8088: mpi/has_hanging_nodes.mpirun=7.release
10922/11571 Test  #7733: mpi/cell_data_transfer_02.mpirun=8.debug ...............................................   Passed    3.54 sec
            Start  7734: mpi/cell_data_transfer_02.mpirun=8.release
10923/11571 Test  #7734: mpi/cell_data_transfer_02.mpirun=8.release .............................................   Passed    3.28 sec
            Start  7737: mpi/cell_data_transfer_03.mpirun=8.debug
10924/11571 Test  #8088: mpi/has_hanging_nodes.mpirun=7.release .................................................   Passed    3.47 sec
            Start  8165: mpi/hp_unify_dof_indices_08.mpirun=7.debug
10925/11571 Test  #7737: mpi/cell_data_transfer_03.mpirun=8.debug ...............................................   Passed    3.29 sec
            Start  7738: mpi/cell_data_transfer_03.mpirun=8.release
10926/11571 Test  #7738: mpi/cell_data_transfer_03.mpirun=8.release .............................................   Passed    3.23 sec
            Start  8001: mpi/distort_random_01.mpirun=8.debug
10927/11571 Test  #8001: mpi/distort_random_01.mpirun=8.debug ...................................................   Passed    4.36 sec
            Start  8002: mpi/distort_random_01.mpirun=8.release
10928/11571 Test  #8856: mpi/tria_01.mpirun=10.debug ............................................................   Passed   24.21 sec
            Start  8857: mpi/tria_01.mpirun=10.release
10929/11571 Test  #8002: mpi/distort_random_01.mpirun=8.release .................................................   Passed    4.57 sec
            Start  8858: mpi/tria_01.mpirun=2.debug
            Start  8166: mpi/hp_unify_dof_indices_08.mpirun=7.release
10930/11571 Test  #8858: mpi/tria_01.mpirun=2.debug .............................................................   Passed    3.77 sec
10931/11571 Test  #8166: mpi/hp_unify_dof_indices_08.mpirun=7.release ...........................................   Passed    4.59 sec
            Start  8007: mpi/distort_random_02.mpirun=8.debug
10932/11571 Test  #8007: mpi/distort_random_02.mpirun=8.debug ...................................................   Passed    4.64 sec
            Start  8008: mpi/distort_random_02.mpirun=8.release
10933/11571 Test  #8008: mpi/distort_random_02.mpirun=8.release .................................................   Passed    4.19 sec
            Start  8091: mpi/hp_active_fe_indices_transfer_01.mpirun=8.debug
10934/11571 Test  #8091: mpi/hp_active_fe_indices_transfer_01.mpirun=8.debug ....................................   Passed    4.33 sec
            Start  8092: mpi/hp_active_fe_indices_transfer_01.mpirun=8.release
10935/11571 Test  #8857: mpi/tria_01.mpirun=10.release ..........................................................   Passed   20.70 sec
            Start  8926: mpi/trilinos_distribute_01.mpirun=10.debug
10936/11571 Test  #8092: mpi/hp_active_fe_indices_transfer_01.mpirun=8.release ..................................   Passed    4.39 sec
            Start  8859: mpi/tria_01.mpirun=2.release
            Start  8280: mpi/mg_04.mpirun=4.release
10937/11571 Test  #8926: mpi/trilinos_distribute_01.mpirun=10.debug .............................................   Passed    4.41 sec
            Start  8927: mpi/trilinos_distribute_01.mpirun=10.release
            Start  8928: mpi/trilinos_distribute_01.mpirun=2.debug
10938/11571 Test  #8165: mpi/hp_unify_dof_indices_08.mpirun=7.debug .............................................   Passed   38.40 sec
            Start  8283: mpi/mg_06.mpirun=7.debug
10939/11571 Test  #8280: mpi/mg_04.mpirun=4.release .............................................................   Passed    3.05 sec
            Start  8700: mpi/point_to_point_pattern_01.mpirun=4.debug
10940/11571 Test  #8928: mpi/trilinos_distribute_01.mpirun=2.debug ..............................................   Passed    3.02 sec
10941/11571 Test  #8859: mpi/tria_01.mpirun=2.release ...........................................................   Passed    3.18 sec
            Start  8701: mpi/point_to_point_pattern_01.mpirun=4.release
10942/11571 Test  #8927: mpi/trilinos_distribute_01.mpirun=10.release ...........................................   Passed    3.10 sec
            Start  8934: mpi/trilinos_distribute_01_block.mpirun=10.debug
10943/11571 Test  #8700: mpi/point_to_point_pattern_01.mpirun=4.debug ...........................................   Passed    3.18 sec
            Start  8929: mpi/trilinos_distribute_01.mpirun=2.release
10944/11571 Test  #8701: mpi/point_to_point_pattern_01.mpirun=4.release .........................................   Passed    3.15 sec
            Start  8284: mpi/mg_06.mpirun=7.release
10945/11571 Test  #8934: mpi/trilinos_distribute_01_block.mpirun=10.debug .......................................   Passed    3.30 sec
            Start  8935: mpi/trilinos_distribute_01_block.mpirun=10.release
10946/11571 Test  #8929: mpi/trilinos_distribute_01.mpirun=2.release ............................................   Passed    2.96 sec
            Start  8936: mpi/trilinos_distribute_01_block.mpirun=2.debug
10947/11571 Test  #8935: mpi/trilinos_distribute_01_block.mpirun=10.release .....................................   Passed    3.04 sec
            Start  8942: mpi/trilinos_distribute_01_inhomogenous.mpirun=10.debug
10948/11571 Test  #8936: mpi/trilinos_distribute_01_block.mpirun=2.debug ........................................   Passed    2.93 sec
            Start  8937: mpi/trilinos_distribute_01_block.mpirun=2.release
10949/11571 Test  #8942: mpi/trilinos_distribute_01_inhomogenous.mpirun=10.debug ................................   Passed    3.14 sec
            Start  8943: mpi/trilinos_distribute_01_inhomogenous.mpirun=10.release
10950/11571 Test  #8937: mpi/trilinos_distribute_01_block.mpirun=2.release ......................................   Passed    3.07 sec
            Start  8944: mpi/trilinos_distribute_01_inhomogenous.mpirun=2.debug
10951/11571 Test  #8943: mpi/trilinos_distribute_01_inhomogenous.mpirun=10.release ..............................   Passed    3.07 sec
            Start  7354: matrix_free/matrix_vector_10.mpirun=10.debug
10952/11571 Test  #8944: mpi/trilinos_distribute_01_inhomogenous.mpirun=2.debug .................................   Passed    3.20 sec
            Start  8945: mpi/trilinos_distribute_01_inhomogenous.mpirun=2.release
10953/11571 Test  #7354: matrix_free/matrix_vector_10.mpirun=10.debug ...........................................   Passed    4.16 sec
            Start  7355: matrix_free/matrix_vector_10.mpirun=10.release
10954/11571 Test  #8945: mpi/trilinos_distribute_01_inhomogenous.mpirun=2.release ...............................   Passed    3.18 sec
10955/11571 Test  #7355: matrix_free/matrix_vector_10.mpirun=10.release .........................................   Passed    1.80 sec
            Start  3215: distributed_grids/grid_tools_exchange_bounding_boxes_1.mpirun=12.debug
10956/11571 Test  #8283: mpi/mg_06.mpirun=7.debug ...............................................................   Passed   23.30 sec
            Start  7356: matrix_free/matrix_vector_10.mpirun=4.debug
10957/11571 Test  #8284: mpi/mg_06.mpirun=7.release .............................................................   Passed   18.99 sec
            Start  7357: matrix_free/matrix_vector_10.mpirun=4.release
            Start  8822: mpi/simple_mpi_01.mpirun=4.debug
10958/11571 Test  #7357: matrix_free/matrix_vector_10.mpirun=4.release ..........................................   Passed    1.54 sec
            Start  8823: mpi/simple_mpi_01.mpirun=4.release
10959/11571 Test  #8822: mpi/simple_mpi_01.mpirun=4.debug .......................................................   Passed    3.01 sec
            Start  8860: mpi/tria_01.mpirun=4.debug
10960/11571 Test  #7356: matrix_free/matrix_vector_10.mpirun=4.debug ............................................   Passed    4.26 sec
            Start  8861: mpi/tria_01.mpirun=4.release
10961/11571 Test  #8823: mpi/simple_mpi_01.mpirun=4.release .....................................................   Passed    2.89 sec
            Start  8930: mpi/trilinos_distribute_01.mpirun=4.debug
10962/11571 Test  #8861: mpi/tria_01.mpirun=4.release ...........................................................   Passed    3.00 sec
            Start  8931: mpi/trilinos_distribute_01.mpirun=4.release
10963/11571 Test  #8860: mpi/tria_01.mpirun=4.debug .............................................................   Passed    3.17 sec
            Start  8938: mpi/trilinos_distribute_01_block.mpirun=4.debug
10964/11571 Test  #8930: mpi/trilinos_distribute_01.mpirun=4.debug ..............................................   Passed    3.06 sec
            Start  8939: mpi/trilinos_distribute_01_block.mpirun=4.release
10965/11571 Test  #8931: mpi/trilinos_distribute_01.mpirun=4.release ............................................   Passed    3.02 sec
            Start  8946: mpi/trilinos_distribute_01_inhomogenous.mpirun=4.debug
10966/11571 Test  #8938: mpi/trilinos_distribute_01_block.mpirun=4.debug ........................................   Passed    3.07 sec
            Start  8947: mpi/trilinos_distribute_01_inhomogenous.mpirun=4.release
10967/11571 Test  #8939: mpi/trilinos_distribute_01_block.mpirun=4.release ......................................   Passed    2.93 sec
10968/11571 Test  #8946: mpi/trilinos_distribute_01_inhomogenous.mpirun=4.debug .................................   Passed    3.01 sec
            Start  8095: mpi/hp_active_fe_indices_transfer_02.mpirun=8.debug
10969/11571 Test  #8947: mpi/trilinos_distribute_01_inhomogenous.mpirun=4.release ...............................   Passed    2.96 sec
10970/11571 Test  #8095: mpi/hp_active_fe_indices_transfer_02.mpirun=8.debug ....................................   Passed    3.56 sec
            Start  3216: distributed_grids/grid_tools_exchange_bounding_boxes_1.mpirun=12.release
10971/11571 Test  #3215: distributed_grids/grid_tools_exchange_bounding_boxes_1.mpirun=12.debug .................   Passed   20.18 sec
            Start  7358: matrix_free/matrix_vector_11.mpirun=10.debug
10972/11571 Test  #3216: distributed_grids/grid_tools_exchange_bounding_boxes_1.mpirun=12.release ...............   Passed   17.40 sec
            Start  7359: matrix_free/matrix_vector_11.mpirun=10.release
            Start  3217: distributed_grids/grid_tools_exchange_bounding_boxes_1.mpirun=4.debug
10973/11571 Test  #3217: distributed_grids/grid_tools_exchange_bounding_boxes_1.mpirun=4.debug ..................   Passed    0.74 sec
            Start  3218: distributed_grids/grid_tools_exchange_bounding_boxes_1.mpirun=4.release
10974/11571 Test  #3218: distributed_grids/grid_tools_exchange_bounding_boxes_1.mpirun=4.release ................   Passed    0.65 sec
10975/11571 Test  #7358: matrix_free/matrix_vector_11.mpirun=10.debug ...........................................   Passed   45.40 sec
            Start  7364: matrix_free/matrix_vector_12.mpirun=10.debug
            Start  7360: matrix_free/matrix_vector_11.mpirun=4.debug
10976/11571 Test  #7364: matrix_free/matrix_vector_12.mpirun=10.debug ...........................................   Passed    4.44 sec
            Start  7365: matrix_free/matrix_vector_12.mpirun=10.release
10977/11571 Test  #7365: matrix_free/matrix_vector_12.mpirun=10.release .........................................   Passed    2.07 sec
            Start  7627: matrix_free/step-48.mpirun=10.debug
10978/11571 Test  #7627: matrix_free/step-48.mpirun=10.debug ....................................................   Passed    5.61 sec
            Start  7628: matrix_free/step-48.mpirun=10.release
10979/11571 Test  #7360: matrix_free/matrix_vector_11.mpirun=4.debug ............................................   Passed   12.28 sec
            Start  7366: matrix_free/matrix_vector_12.mpirun=3.debug
            Start  7367: matrix_free/matrix_vector_12.mpirun=3.release
10980/11571 Test  #7367: matrix_free/matrix_vector_12.mpirun=3.release ..........................................   Passed    3.50 sec
10981/11571 Test  #7628: matrix_free/step-48.mpirun=10.release ..................................................   Passed    5.63 sec
            Start  7762: mpi/collective_01.mpirun=10.debug
10982/11571 Test  #7359: matrix_free/matrix_vector_11.mpirun=10.release .........................................   Passed   47.72 sec
            Start  7763: mpi/collective_01.mpirun=10.release
10983/11571 Test  #7366: matrix_free/matrix_vector_12.mpirun=3.debug ............................................   Passed    7.52 sec
            Start  7361: matrix_free/matrix_vector_11.mpirun=4.release
10984/11571 Test  #7762: mpi/collective_01.mpirun=10.debug ......................................................   Passed    3.18 sec
            Start  7768: mpi/collective_02.mpirun=10.debug
10985/11571 Test  #7361: matrix_free/matrix_vector_11.mpirun=4.release ..........................................   Passed    1.70 sec
            Start  7629: matrix_free/step-48.mpirun=4.debug
10986/11571 Test  #7763: mpi/collective_01.mpirun=10.release ....................................................   Passed    3.06 sec
            Start  7769: mpi/collective_02.mpirun=10.release
10987/11571 Test  #7768: mpi/collective_02.mpirun=10.debug ......................................................   Passed    3.21 sec
            Start  7774: mpi/collective_02_array.mpirun=10.debug
10988/11571 Test  #7769: mpi/collective_02.mpirun=10.release ....................................................   Passed    3.22 sec
            Start  7775: mpi/collective_02_array.mpirun=10.release
10989/11571 Test  #7629: matrix_free/step-48.mpirun=4.debug .....................................................   Passed    3.67 sec
            Start  7630: matrix_free/step-48.mpirun=4.release
10990/11571 Test  #7630: matrix_free/step-48.mpirun=4.release ...................................................   Passed    1.37 sec
            Start  7764: mpi/collective_01.mpirun=4.debug
10991/11571 Test  #7774: mpi/collective_02_array.mpirun=10.debug ................................................   Passed    3.17 sec
            Start  7780: mpi/collective_02_array_in_place.mpirun=10.debug
10992/11571 Test  #7775: mpi/collective_02_array.mpirun=10.release ..............................................   Passed    2.95 sec
            Start  7781: mpi/collective_02_array_in_place.mpirun=10.release
10993/11571 Test  #7764: mpi/collective_01.mpirun=4.debug .......................................................   Passed    3.04 sec
            Start  7765: mpi/collective_01.mpirun=4.release
10994/11571 Test  #7780: mpi/collective_02_array_in_place.mpirun=10.debug .......................................   Passed    3.09 sec
            Start  7794: mpi/collective_02_vector.mpirun=10.debug
10995/11571 Test  #7781: mpi/collective_02_array_in_place.mpirun=10.release .....................................   Passed    3.03 sec
            Start  7795: mpi/collective_02_vector.mpirun=10.release
10996/11571 Test  #7765: mpi/collective_01.mpirun=4.release .....................................................   Passed    3.08 sec
            Start  7770: mpi/collective_02.mpirun=4.debug
10997/11571 Test  #7794: mpi/collective_02_vector.mpirun=10.debug ...............................................   Passed    3.03 sec
            Start  7800: mpi/collective_02_vector_in_place.mpirun=10.debug
10998/11571 Test  #7795: mpi/collective_02_vector.mpirun=10.release .............................................   Passed    2.96 sec
            Start  7801: mpi/collective_02_vector_in_place.mpirun=10.release
10999/11571 Test  #7770: mpi/collective_02.mpirun=4.debug .......................................................   Passed    3.06 sec
            Start  7771: mpi/collective_02.mpirun=4.release
11000/11571 Test  #7800: mpi/collective_02_vector_in_place.mpirun=10.debug ......................................   Passed    3.06 sec
            Start  7806: mpi/collective_full_matrix.mpirun=10.debug
11001/11571 Test  #7801: mpi/collective_02_vector_in_place.mpirun=10.release ....................................   Passed    2.99 sec
            Start  7807: mpi/collective_full_matrix.mpirun=10.release
11002/11571 Test  #7771: mpi/collective_02.mpirun=4.release .....................................................   Passed    2.81 sec
            Start  7776: mpi/collective_02_array.mpirun=4.debug
11003/11571 Test  #7806: mpi/collective_full_matrix.mpirun=10.debug .............................................   Passed    3.13 sec
            Start  7816: mpi/collective_logical_or.mpirun=10.debug
11004/11571 Test  #7807: mpi/collective_full_matrix.mpirun=10.release ...........................................   Passed    3.01 sec
            Start  7817: mpi/collective_logical_or.mpirun=10.release
11005/11571 Test  #7776: mpi/collective_02_array.mpirun=4.debug .................................................   Passed    3.04 sec
            Start  7777: mpi/collective_02_array.mpirun=4.release
11006/11571 Test  #7816: mpi/collective_logical_or.mpirun=10.debug ..............................................   Passed    3.14 sec
            Start  7822: mpi/collective_logical_or_array.mpirun=10.debug
11007/11571 Test  #7817: mpi/collective_logical_or.mpirun=10.release ............................................   Passed    3.02 sec
            Start  7823: mpi/collective_logical_or_array.mpirun=10.release
11008/11571 Test  #7777: mpi/collective_02_array.mpirun=4.release ...............................................   Passed    3.00 sec
            Start  7782: mpi/collective_02_array_in_place.mpirun=4.debug
11009/11571 Test  #7822: mpi/collective_logical_or_array.mpirun=10.debug ........................................   Passed    3.18 sec
            Start  7828: mpi/collective_logical_or_array_in_place.mpirun=10.debug
11010/11571 Test  #7823: mpi/collective_logical_or_array.mpirun=10.release ......................................   Passed    3.07 sec
            Start  7829: mpi/collective_logical_or_array_in_place.mpirun=10.release
11011/11571 Test  #7782: mpi/collective_02_array_in_place.mpirun=4.debug ........................................   Passed    3.02 sec
            Start  7783: mpi/collective_02_array_in_place.mpirun=4.release
11012/11571 Test  #7828: mpi/collective_logical_or_array_in_place.mpirun=10.debug ...............................   Passed    3.28 sec
            Start  7834: mpi/collective_logical_or_vector.mpirun=10.debug
11013/11571 Test  #7829: mpi/collective_logical_or_array_in_place.mpirun=10.release .............................   Passed    3.15 sec
            Start  7835: mpi/collective_logical_or_vector.mpirun=10.release
11014/11571 Test  #7783: mpi/collective_02_array_in_place.mpirun=4.release ......................................   Passed    2.92 sec
            Start  7796: mpi/collective_02_vector.mpirun=4.debug
11015/11571 Test  #7834: mpi/collective_logical_or_vector.mpirun=10.debug .......................................   Passed    3.15 sec
            Start  7840: mpi/collective_logical_or_vector_in_place.mpirun=10.debug
11016/11571 Test  #7835: mpi/collective_logical_or_vector.mpirun=10.release .....................................   Passed    3.18 sec
            Start  7841: mpi/collective_logical_or_vector_in_place.mpirun=10.release
11017/11571 Test  #7796: mpi/collective_02_vector.mpirun=4.debug ................................................   Passed    3.19 sec
            Start  7797: mpi/collective_02_vector.mpirun=4.release
11018/11571 Test  #7841: mpi/collective_logical_or_vector_in_place.mpirun=10.release ............................   Passed    3.10 sec
            Start  7846: mpi/collective_max.mpirun=10.debug
11019/11571 Test  #7840: mpi/collective_logical_or_vector_in_place.mpirun=10.debug ..............................   Passed    3.25 sec
            Start  7847: mpi/collective_max.mpirun=10.release
11020/11571 Test  #7797: mpi/collective_02_vector.mpirun=4.release ..............................................   Passed    3.06 sec
            Start  7802: mpi/collective_02_vector_in_place.mpirun=4.debug
11021/11571 Test  #7847: mpi/collective_max.mpirun=10.release ...................................................   Passed    3.11 sec
            Start  7852: mpi/collective_max_array.mpirun=10.debug
11022/11571 Test  #7846: mpi/collective_max.mpirun=10.debug .....................................................   Passed    3.30 sec
            Start  7853: mpi/collective_max_array.mpirun=10.release
11023/11571 Test  #7802: mpi/collective_02_vector_in_place.mpirun=4.debug .......................................   Passed    3.08 sec
            Start  7803: mpi/collective_02_vector_in_place.mpirun=4.release
11024/11571 Test  #7852: mpi/collective_max_array.mpirun=10.debug ...............................................   Passed    3.27 sec
            Start  7858: mpi/collective_max_array_in_place.mpirun=10.debug
11025/11571 Test  #7853: mpi/collective_max_array.mpirun=10.release .............................................   Passed    3.17 sec
            Start  7859: mpi/collective_max_array_in_place.mpirun=10.release
11026/11571 Test  #7803: mpi/collective_02_vector_in_place.mpirun=4.release .....................................   Passed    2.91 sec
            Start  7808: mpi/collective_full_matrix.mpirun=3.debug
            Start  7809: mpi/collective_full_matrix.mpirun=3.release
11027/11571 Test  #7859: mpi/collective_max_array_in_place.mpirun=10.release ....................................   Passed    3.16 sec
            Start  7864: mpi/collective_max_vector.mpirun=10.debug
11028/11571 Test  #7858: mpi/collective_max_array_in_place.mpirun=10.debug ......................................   Passed    3.26 sec
            Start  7865: mpi/collective_max_vector.mpirun=10.release
11029/11571 Test  #7809: mpi/collective_full_matrix.mpirun=3.release ............................................   Passed    2.93 sec
11030/11571 Test  #7808: mpi/collective_full_matrix.mpirun=3.debug ..............................................   Passed    3.28 sec
            Start  7818: mpi/collective_logical_or.mpirun=4.debug
11031/11571 Test  #7864: mpi/collective_max_vector.mpirun=10.debug ..............................................   Passed    3.19 sec
            Start  7870: mpi/collective_max_vector_in_place.mpirun=10.debug
11032/11571 Test  #7865: mpi/collective_max_vector.mpirun=10.release ............................................   Passed    3.17 sec
            Start  7871: mpi/collective_max_vector_in_place.mpirun=10.release
11033/11571 Test  #7818: mpi/collective_logical_or.mpirun=4.debug ...............................................   Passed    3.10 sec
            Start  7819: mpi/collective_logical_or.mpirun=4.release
11034/11571 Test  #7870: mpi/collective_max_vector_in_place.mpirun=10.debug .....................................   Passed    3.22 sec
            Start  7878: mpi/collective_min.mpirun=10.debug
11035/11571 Test  #7871: mpi/collective_max_vector_in_place.mpirun=10.release ...................................   Passed    3.17 sec
            Start  7879: mpi/collective_min.mpirun=10.release
11036/11571 Test  #7819: mpi/collective_logical_or.mpirun=4.release .............................................   Passed    3.10 sec
            Start  7824: mpi/collective_logical_or_array.mpirun=4.debug
11037/11571 Test  #7879: mpi/collective_min.mpirun=10.release ...................................................   Passed    3.15 sec
            Start  7884: mpi/collective_min_array.mpirun=10.debug
11038/11571 Test  #7878: mpi/collective_min.mpirun=10.debug .....................................................   Passed    3.36 sec
            Start  7885: mpi/collective_min_array.mpirun=10.release
11039/11571 Test  #7824: mpi/collective_logical_or_array.mpirun=4.debug .........................................   Passed    3.36 sec
            Start  7825: mpi/collective_logical_or_array.mpirun=4.release
11040/11571 Test  #7884: mpi/collective_min_array.mpirun=10.debug ...............................................   Passed    3.40 sec
            Start  7890: mpi/collective_min_array_in_place.mpirun=10.debug
11041/11571 Test  #7885: mpi/collective_min_array.mpirun=10.release .............................................   Passed    3.22 sec
            Start  7891: mpi/collective_min_array_in_place.mpirun=10.release
11042/11571 Test  #7825: mpi/collective_logical_or_array.mpirun=4.release .......................................   Passed    3.05 sec
            Start  7830: mpi/collective_logical_or_array_in_place.mpirun=4.debug
11043/11571 Test  #7890: mpi/collective_min_array_in_place.mpirun=10.debug ......................................   Passed    3.24 sec
            Start  7896: mpi/collective_min_vector.mpirun=10.debug
11044/11571 Test  #7891: mpi/collective_min_array_in_place.mpirun=10.release ....................................   Passed    3.25 sec
            Start  7897: mpi/collective_min_vector.mpirun=10.release
11045/11571 Test  #7830: mpi/collective_logical_or_array_in_place.mpirun=4.debug ................................   Passed    2.98 sec
            Start  7831: mpi/collective_logical_or_array_in_place.mpirun=4.release
11046/11571 Test  #7896: mpi/collective_min_vector.mpirun=10.debug ..............................................   Passed    3.12 sec
            Start  7902: mpi/collective_min_vector_in_place.mpirun=10.debug
11047/11571 Test  #7897: mpi/collective_min_vector.mpirun=10.release ............................................   Passed    3.13 sec
            Start  7903: mpi/collective_min_vector_in_place.mpirun=10.release
11048/11571 Test  #7831: mpi/collective_logical_or_array_in_place.mpirun=4.release ..............................   Passed    3.11 sec
            Start  7836: mpi/collective_logical_or_vector.mpirun=4.debug
11049/11571 Test  #7903: mpi/collective_min_vector_in_place.mpirun=10.release ...................................   Passed    3.07 sec
            Start  7912: mpi/collective_tensor.mpirun=10.debug
11050/11571 Test  #7902: mpi/collective_min_vector_in_place.mpirun=10.debug .....................................   Passed    3.34 sec
            Start  7913: mpi/collective_tensor.mpirun=10.release
11051/11571 Test  #7836: mpi/collective_logical_or_vector.mpirun=4.debug ........................................   Passed    3.18 sec
            Start  7837: mpi/collective_logical_or_vector.mpirun=4.release
11052/11571 Test  #7912: mpi/collective_tensor.mpirun=10.debug ..................................................   Passed    3.23 sec
            Start  7938: mpi/compute_mean_value.mpirun=10.debug
11053/11571 Test  #7913: mpi/collective_tensor.mpirun=10.release ................................................   Passed    3.11 sec
            Start  7939: mpi/compute_mean_value.mpirun=10.release
11054/11571 Test  #7837: mpi/collective_logical_or_vector.mpirun=4.release ......................................   Passed    3.08 sec
            Start  7842: mpi/collective_logical_or_vector_in_place.mpirun=4.debug
11055/11571 Test  #7842: mpi/collective_logical_or_vector_in_place.mpirun=4.debug ...............................   Passed    2.92 sec
            Start  7843: mpi/collective_logical_or_vector_in_place.mpirun=4.release
11056/11571 Test  #7843: mpi/collective_logical_or_vector_in_place.mpirun=4.release .............................   Passed    2.90 sec
            Start  7848: mpi/collective_max.mpirun=4.debug
11057/11571 Test  #7848: mpi/collective_max.mpirun=4.debug ......................................................   Passed    3.03 sec
            Start  7849: mpi/collective_max.mpirun=4.release
11058/11571 Test  #7849: mpi/collective_max.mpirun=4.release ....................................................   Passed    2.93 sec
            Start  7854: mpi/collective_max_array.mpirun=4.debug
11059/11571 Test  #7854: mpi/collective_max_array.mpirun=4.debug ................................................   Passed    3.05 sec
            Start  7855: mpi/collective_max_array.mpirun=4.release
11060/11571 Test  #7855: mpi/collective_max_array.mpirun=4.release ..............................................   Passed    2.93 sec
            Start  7860: mpi/collective_max_array_in_place.mpirun=4.debug
11061/11571 Test  #7860: mpi/collective_max_array_in_place.mpirun=4.debug .......................................   Passed    3.08 sec
            Start  7861: mpi/collective_max_array_in_place.mpirun=4.release
11062/11571 Test  #7939: mpi/compute_mean_value.mpirun=10.release ...............................................   Passed   23.71 sec
            Start  7948: mpi/constraint_matrix_trilinos_bug.mpirun=10.debug
11063/11571 Test  #7861: mpi/collective_max_array_in_place.mpirun=4.release .....................................   Passed    2.97 sec
            Start  7866: mpi/collective_max_vector.mpirun=4.debug
11064/11571 Test  #7938: mpi/compute_mean_value.mpirun=10.debug .................................................   Passed   26.33 sec
            Start  7954: mpi/count_dofs_per_block_01.mpirun=10.debug
11065/11571 Test  #7866: mpi/collective_max_vector.mpirun=4.debug ...............................................   Passed    3.02 sec
            Start  7867: mpi/collective_max_vector.mpirun=4.release
11066/11571 Test  #7867: mpi/collective_max_vector.mpirun=4.release .............................................   Passed    2.80 sec
            Start  7872: mpi/collective_max_vector_in_place.mpirun=4.debug
11067/11571 Test  #7872: mpi/collective_max_vector_in_place.mpirun=4.debug ......................................   Passed    2.93 sec
            Start  7873: mpi/collective_max_vector_in_place.mpirun=4.release
11068/11571 Test  #7873: mpi/collective_max_vector_in_place.mpirun=4.release ....................................   Passed    2.96 sec
            Start  7880: mpi/collective_min.mpirun=4.debug
11069/11571 Test  #7880: mpi/collective_min.mpirun=4.debug ......................................................   Passed    3.05 sec
            Start  7881: mpi/collective_min.mpirun=4.release
11070/11571 Test  #7881: mpi/collective_min.mpirun=4.release ....................................................   Passed    2.97 sec
            Start  7886: mpi/collective_min_array.mpirun=4.debug
11071/11571 Test  #7886: mpi/collective_min_array.mpirun=4.debug ................................................   Passed    3.01 sec
            Start  7887: mpi/collective_min_array.mpirun=4.release
11072/11571 Test  #7887: mpi/collective_min_array.mpirun=4.release ..............................................   Passed    3.06 sec
            Start  7892: mpi/collective_min_array_in_place.mpirun=4.debug
11073/11571 Test  #7954: mpi/count_dofs_per_block_01.mpirun=10.debug ............................................   Passed   25.25 sec
            Start  7955: mpi/count_dofs_per_block_01.mpirun=10.release
11074/11571 Test  #7948: mpi/constraint_matrix_trilinos_bug.mpirun=10.debug .....................................   Passed   27.83 sec
            Start  7958: mpi/count_dofs_per_block_02.mpirun=10.debug
11075/11571 Test  #7892: mpi/collective_min_array_in_place.mpirun=4.debug .......................................   Passed    3.92 sec
            Start  7893: mpi/collective_min_array_in_place.mpirun=4.release
11076/11571 Test  #7893: mpi/collective_min_array_in_place.mpirun=4.release .....................................   Passed    2.87 sec
            Start  7898: mpi/collective_min_vector.mpirun=4.debug
11077/11571 Test  #7898: mpi/collective_min_vector.mpirun=4.debug ...............................................   Passed    3.03 sec
            Start  7899: mpi/collective_min_vector.mpirun=4.release
11078/11571 Test  #7899: mpi/collective_min_vector.mpirun=4.release .............................................   Passed    2.96 sec
            Start  7904: mpi/collective_min_vector_in_place.mpirun=4.debug
11079/11571 Test  #7904: mpi/collective_min_vector_in_place.mpirun=4.debug ......................................   Passed    3.05 sec
            Start  7905: mpi/collective_min_vector_in_place.mpirun=4.release
11080/11571 Test  #7905: mpi/collective_min_vector_in_place.mpirun=4.release ....................................   Passed    2.99 sec
            Start  7914: mpi/collective_tensor.mpirun=4.debug
11081/11571 Test  #7914: mpi/collective_tensor.mpirun=4.debug ...................................................   Passed    3.03 sec
            Start  7915: mpi/collective_tensor.mpirun=4.release
11082/11571 Test  #7955: mpi/count_dofs_per_block_01.mpirun=10.release ..........................................   Passed   19.42 sec
            Start  7959: mpi/count_dofs_per_block_02.mpirun=10.release
11083/11571 Test  #7915: mpi/collective_tensor.mpirun=4.release .................................................   Passed    2.99 sec
            Start  7940: mpi/compute_mean_value.mpirun=4.debug
11084/11571 Test  #7958: mpi/count_dofs_per_block_02.mpirun=10.debug ............................................   Passed   23.59 sec
            Start  7962: mpi/count_dofs_per_component_01.mpirun=10.debug
11085/11571 Test  #7940: mpi/compute_mean_value.mpirun=4.debug ..................................................   Passed    3.86 sec
            Start  7941: mpi/compute_mean_value.mpirun=4.release
11086/11571 Test  #7941: mpi/compute_mean_value.mpirun=4.release ................................................   Passed    3.09 sec
            Start  7949: mpi/constraint_matrix_trilinos_bug.mpirun=4.debug
11087/11571 Test  #7949: mpi/constraint_matrix_trilinos_bug.mpirun=4.debug ......................................   Passed    3.17 sec
            Start  7956: mpi/count_dofs_per_block_01.mpirun=4.debug
11088/11571 Test  #7956: mpi/count_dofs_per_block_01.mpirun=4.debug .............................................   Passed    5.41 sec
            Start  7957: mpi/count_dofs_per_block_01.mpirun=4.release
11089/11571 Test  #7957: mpi/count_dofs_per_block_01.mpirun=4.release ...........................................   Passed    3.01 sec
            Start  7960: mpi/count_dofs_per_block_02.mpirun=4.debug
11090/11571 Test  #7959: mpi/count_dofs_per_block_02.mpirun=10.release ..........................................   Passed   20.97 sec
            Start  7963: mpi/count_dofs_per_component_01.mpirun=10.release
11091/11571 Test  #7960: mpi/count_dofs_per_block_02.mpirun=4.debug .............................................   Passed    3.98 sec
            Start  7961: mpi/count_dofs_per_block_02.mpirun=4.release
11092/11571 Test  #7962: mpi/count_dofs_per_component_01.mpirun=10.debug ........................................   Passed   22.02 sec
            Start  7966: mpi/crash_01.mpirun=10.debug
11093/11571 Test  #7961: mpi/count_dofs_per_block_02.mpirun=4.release ...........................................   Passed    3.02 sec
            Start  7964: mpi/count_dofs_per_component_01.mpirun=4.debug
11094/11571 Test  #7964: mpi/count_dofs_per_component_01.mpirun=4.debug .........................................   Passed    3.18 sec
11095/11571 Test  #7963: mpi/count_dofs_per_component_01.mpirun=10.release ......................................   Passed   19.74 sec
            Start  7967: mpi/crash_01.mpirun=10.release
            Start  7965: mpi/count_dofs_per_component_01.mpirun=4.release
11096/11571 Test  #7965: mpi/count_dofs_per_component_01.mpirun=4.release .......................................   Passed    3.03 sec
11097/11571 Test  #7966: mpi/crash_01.mpirun=10.debug ...........................................................   Passed   20.19 sec
            Start  7972: mpi/crash_03.mpirun=10.debug
            Start  7968: mpi/crash_01.mpirun=4.debug
11098/11571 Test  #7968: mpi/crash_01.mpirun=4.debug ............................................................   Passed    3.06 sec
11099/11571 Test  #7967: mpi/crash_01.mpirun=10.release .........................................................   Passed   17.62 sec
            Start  7973: mpi/crash_03.mpirun=10.release
            Start  7969: mpi/crash_01.mpirun=4.release
11100/11571 Test  #7969: mpi/crash_01.mpirun=4.release ..........................................................   Passed    2.99 sec
11101/11571 Test  #7972: mpi/crash_03.mpirun=10.debug ...........................................................   Passed   18.17 sec
            Start  8013: mpi/distribute_sp_01.mpirun=10.debug
            Start  7974: mpi/crash_03.mpirun=4.debug
11102/11571 Test  #7974: mpi/crash_03.mpirun=4.debug ............................................................   Passed    3.13 sec
11103/11571 Test  #7973: mpi/crash_03.mpirun=10.release .........................................................   Passed   15.32 sec
            Start  8014: mpi/distribute_sp_01.mpirun=10.release
            Start  7975: mpi/crash_03.mpirun=4.release
11104/11571 Test  #7975: mpi/crash_03.mpirun=4.release ..........................................................   Passed    3.02 sec
11105/11571 Test  #8013: mpi/distribute_sp_01.mpirun=10.debug ...................................................   Passed   14.30 sec
            Start  8017: mpi/distribute_sp_02.mpirun=10.debug
            Start  8015: mpi/distribute_sp_01.mpirun=4.debug
11106/11571 Test  #8015: mpi/distribute_sp_01.mpirun=4.debug ....................................................   Passed    3.04 sec
11107/11571 Test  #8014: mpi/distribute_sp_01.mpirun=10.release .................................................   Passed   12.72 sec
            Start  8018: mpi/distribute_sp_02.mpirun=10.release
            Start  8016: mpi/distribute_sp_01.mpirun=4.release
11108/11571 Test  #8016: mpi/distribute_sp_01.mpirun=4.release ..................................................   Passed    3.02 sec
11109/11571 Test  #8017: mpi/distribute_sp_02.mpirun=10.debug ...................................................   Passed   14.78 sec
            Start  8021: mpi/dof_handler_number_cache.mpirun=10.debug
            Start  8019: mpi/distribute_sp_02.mpirun=4.debug
11110/11571 Test  #8019: mpi/distribute_sp_02.mpirun=4.debug ....................................................   Passed    3.10 sec
11111/11571 Test  #8018: mpi/distribute_sp_02.mpirun=10.release .................................................   Passed   13.71 sec
            Start  8022: mpi/dof_handler_number_cache.mpirun=10.release
            Start  8020: mpi/distribute_sp_02.mpirun=4.release
11112/11571 Test  #8020: mpi/distribute_sp_02.mpirun=4.release ..................................................   Passed    2.99 sec
11113/11571 Test  #8021: mpi/dof_handler_number_cache.mpirun=10.debug ...........................................   Passed   28.72 sec
            Start  8033: mpi/extract_boundary_dofs.mpirun=10.debug
            Start  8023: mpi/dof_handler_number_cache.mpirun=4.debug
11114/11571 Test  #8022: mpi/dof_handler_number_cache.mpirun=10.release .........................................   Passed   26.12 sec
            Start  8034: mpi/extract_boundary_dofs.mpirun=10.release
11115/11571 Test  #8023: mpi/dof_handler_number_cache.mpirun=4.debug ............................................   Passed    4.28 sec
            Start  8024: mpi/dof_handler_number_cache.mpirun=4.release
11116/11571 Test  #8024: mpi/dof_handler_number_cache.mpirun=4.release ..........................................   Passed    3.03 sec
11117/11571 Test  #8033: mpi/extract_boundary_dofs.mpirun=10.debug ..............................................   Passed   21.78 sec
            Start  8037: mpi/extract_constant_modes_01.mpirun=10.debug
            Start  8035: mpi/extract_boundary_dofs.mpirun=4.debug
11118/11571 Test  #8034: mpi/extract_boundary_dofs.mpirun=10.release ............................................   Passed   19.09 sec
            Start  8038: mpi/extract_constant_modes_01.mpirun=10.release
11119/11571 Test  #8035: mpi/extract_boundary_dofs.mpirun=4.debug ...............................................   Passed    3.64 sec
            Start  8036: mpi/extract_boundary_dofs.mpirun=4.release
11120/11571 Test  #8036: mpi/extract_boundary_dofs.mpirun=4.release .............................................   Passed    2.91 sec
11121/11571 Test  #8038: mpi/extract_constant_modes_01.mpirun=10.release ........................................   Passed   17.59 sec
            Start  8043: mpi/extract_locally_active_dofs.mpirun=10.debug
            Start  8040: mpi/extract_constant_modes_01.mpirun=4.release
11122/11571 Test  #8037: mpi/extract_constant_modes_01.mpirun=10.debug ..........................................   Passed   20.38 sec
            Start  8044: mpi/extract_locally_active_dofs.mpirun=10.release
11123/11571 Test  #8040: mpi/extract_constant_modes_01.mpirun=4.release .........................................   Passed    3.02 sec
            Start  8039: mpi/extract_constant_modes_01.mpirun=4.debug
11124/11571 Test  #8039: mpi/extract_constant_modes_01.mpirun=4.debug ...........................................   Passed    3.03 sec
11125/11571 Test  #8044: mpi/extract_locally_active_dofs.mpirun=10.release ......................................   Passed   19.79 sec
            Start  8047: mpi/extract_locally_active_level_dofs.mpirun=10.debug
            Start  8046: mpi/extract_locally_active_dofs.mpirun=4.release
11126/11571 Test  #8043: mpi/extract_locally_active_dofs.mpirun=10.debug ........................................   Passed   22.56 sec
            Start  8048: mpi/extract_locally_active_level_dofs.mpirun=10.release
11127/11571 Test  #8046: mpi/extract_locally_active_dofs.mpirun=4.release .......................................   Passed    2.98 sec
            Start  8045: mpi/extract_locally_active_dofs.mpirun=4.debug
11128/11571 Test  #8045: mpi/extract_locally_active_dofs.mpirun=4.debug .........................................   Passed    3.64 sec
11129/11571 Test  #8048: mpi/extract_locally_active_level_dofs.mpirun=10.release ................................   Passed   19.14 sec
            Start  8051: mpi/fe_field_function_01.mpirun=10.debug
            Start  8050: mpi/extract_locally_active_level_dofs.mpirun=4.release
11130/11571 Test  #8047: mpi/extract_locally_active_level_dofs.mpirun=10.debug ..................................   Passed   22.38 sec
            Start  8052: mpi/fe_field_function_01.mpirun=10.release
11131/11571 Test  #8050: mpi/extract_locally_active_level_dofs.mpirun=4.release .................................   Passed    3.08 sec
            Start  8049: mpi/extract_locally_active_level_dofs.mpirun=4.debug
11132/11571 Test  #8049: mpi/extract_locally_active_level_dofs.mpirun=4.debug ...................................   Passed    4.02 sec
11133/11571 Test  #8052: mpi/fe_field_function_01.mpirun=10.release .............................................   Passed   24.20 sec
            Start  8065: mpi/fe_tools_extrapolate_03.mpirun=10.debug
            Start  8054: mpi/fe_field_function_01.mpirun=4.release
11134/11571 Test  #8054: mpi/fe_field_function_01.mpirun=4.release ..............................................   Passed    4.83 sec
11135/11571 Test  #8051: mpi/fe_field_function_01.mpirun=10.debug ...............................................   Passed   47.92 sec
            Start  8066: mpi/fe_tools_extrapolate_03.mpirun=10.release
            Start  8053: mpi/fe_field_function_01.mpirun=4.debug
11136/11571 Test  #8065: mpi/fe_tools_extrapolate_03.mpirun=10.debug ............................................   Passed   23.12 sec
            Start  8127: mpi/hp_integrate_difference.mpirun=10.debug
11137/11571 Test  #8066: mpi/fe_tools_extrapolate_03.mpirun=10.release ..........................................   Passed    3.50 sec
            Start  8128: mpi/hp_integrate_difference.mpirun=10.release
11138/11571 Test  #8053: mpi/fe_field_function_01.mpirun=4.debug ................................................   Passed   18.61 sec
            Start  8067: mpi/fe_tools_extrapolate_03.mpirun=3.debug
            Start  8068: mpi/fe_tools_extrapolate_03.mpirun=3.release
11139/11571 Test  #8067: mpi/fe_tools_extrapolate_03.mpirun=3.debug .............................................***Failed    3.32 sec
11140/11571 Test  #8068: mpi/fe_tools_extrapolate_03.mpirun=3.release ...........................................***Failed    4.06 sec
11141/11571 Test  #8128: mpi/hp_integrate_difference.mpirun=10.release ..........................................   Passed   24.67 sec
            Start  8189: mpi/integrate_difference.mpirun=10.debug
            Start  8130: mpi/hp_integrate_difference.mpirun=4.release
11142/11571 Test  #8127: mpi/hp_integrate_difference.mpirun=10.debug ............................................   Passed   29.51 sec
            Start  8190: mpi/integrate_difference.mpirun=10.release
11143/11571 Test  #8130: mpi/hp_integrate_difference.mpirun=4.release ...........................................   Passed    3.12 sec
            Start  8129: mpi/hp_integrate_difference.mpirun=4.debug
11144/11571 Test  #8129: mpi/hp_integrate_difference.mpirun=4.debug .............................................   Passed    4.43 sec
11145/11571 Test  #8190: mpi/integrate_difference.mpirun=10.release .............................................   Passed   23.72 sec
            Start  8193: mpi/interpolate_01.mpirun=10.debug
            Start  8192: mpi/integrate_difference.mpirun=4.release
11146/11571 Test  #8189: mpi/integrate_difference.mpirun=10.debug ...............................................   Passed   27.72 sec
            Start  8194: mpi/interpolate_01.mpirun=10.release
11147/11571 Test  #8192: mpi/integrate_difference.mpirun=4.release ..............................................   Passed    3.01 sec
            Start  8191: mpi/integrate_difference.mpirun=4.debug
11148/11571 Test  #8191: mpi/integrate_difference.mpirun=4.debug ................................................   Passed    3.65 sec
11149/11571 Test  #8194: mpi/interpolate_01.mpirun=10.release ...................................................   Passed   23.64 sec
            Start  8197: mpi/interpolate_03.mpirun=10.debug
            Start  8196: mpi/interpolate_01.mpirun=4.release
11150/11571 Test  #8193: mpi/interpolate_01.mpirun=10.debug .....................................................   Passed   27.02 sec
            Start  8198: mpi/interpolate_03.mpirun=10.release
11151/11571 Test  #8196: mpi/interpolate_01.mpirun=4.release ....................................................   Passed    3.17 sec
            Start  8195: mpi/interpolate_01.mpirun=4.debug
11152/11571 Test  #8195: mpi/interpolate_01.mpirun=4.debug ......................................................   Passed    3.11 sec
11153/11571 Test  #8198: mpi/interpolate_03.mpirun=10.release ...................................................   Passed   21.66 sec
            Start  8207: mpi/is_locally_owned.mpirun=10.debug
            Start  8200: mpi/interpolate_03.mpirun=4.release
11154/11571 Test  #8197: mpi/interpolate_03.mpirun=10.debug .....................................................   Passed   24.76 sec
            Start  8208: mpi/is_locally_owned.mpirun=10.release
11155/11571 Test  #8200: mpi/interpolate_03.mpirun=4.release ....................................................   Passed    3.07 sec
            Start  8199: mpi/interpolate_03.mpirun=4.debug
11156/11571 Test  #8199: mpi/interpolate_03.mpirun=4.debug ......................................................   Passed    3.13 sec
11157/11571 Test  #8208: mpi/is_locally_owned.mpirun=10.release .................................................   Passed   18.44 sec
            Start  8233: mpi/make_zero_boundary_values.mpirun=10.debug
            Start  8210: mpi/is_locally_owned.mpirun=4.release
11158/11571 Test  #8207: mpi/is_locally_owned.mpirun=10.debug ...................................................   Passed   22.09 sec
            Start  8234: mpi/make_zero_boundary_values.mpirun=10.release
11159/11571 Test  #8210: mpi/is_locally_owned.mpirun=4.release ..................................................   Passed    3.02 sec
            Start  8209: mpi/is_locally_owned.mpirun=4.debug
11160/11571 Test  #8209: mpi/is_locally_owned.mpirun=4.debug ....................................................   Passed    3.18 sec
11161/11571 Test  #8233: mpi/make_zero_boundary_values.mpirun=10.debug ..........................................   Passed   22.64 sec
            Start  8237: mpi/map_dofs_to_support_points.mpirun=10.debug
            Start  8235: mpi/make_zero_boundary_values.mpirun=4.debug
11162/11571 Test  #8234: mpi/make_zero_boundary_values.mpirun=10.release ........................................   Passed   20.00 sec
            Start  8238: mpi/map_dofs_to_support_points.mpirun=10.release
11163/11571 Test  #8235: mpi/make_zero_boundary_values.mpirun=4.debug ...........................................   Passed    3.64 sec
            Start  8236: mpi/make_zero_boundary_values.mpirun=4.release
11164/11571 Test  #8236: mpi/make_zero_boundary_values.mpirun=4.release .........................................   Passed    2.97 sec
11165/11571 Test  #8238: mpi/map_dofs_to_support_points.mpirun=10.release .......................................   Passed   20.34 sec
            Start  8259: mpi/mg_01.mpirun=10.debug
            Start  8240: mpi/map_dofs_to_support_points.mpirun=4.release
11166/11571 Test  #8237: mpi/map_dofs_to_support_points.mpirun=10.debug .........................................   Passed   21.69 sec
            Start  8260: mpi/mg_01.mpirun=10.release
11167/11571 Test  #8240: mpi/map_dofs_to_support_points.mpirun=4.release ........................................   Passed    2.99 sec
            Start  8239: mpi/map_dofs_to_support_points.mpirun=4.debug
11168/11571 Test  #8239: mpi/map_dofs_to_support_points.mpirun=4.debug ..........................................   Passed    3.18 sec
11169/11571 Test  #8260: mpi/mg_01.mpirun=10.release ............................................................   Passed   15.42 sec
            Start  8263: mpi/mg_02.mpirun=10.debug
            Start  8262: mpi/mg_01.mpirun=4.release
11170/11571 Test  #8259: mpi/mg_01.mpirun=10.debug ..............................................................   Passed   18.43 sec
            Start  8264: mpi/mg_02.mpirun=10.release
11171/11571 Test  #8262: mpi/mg_01.mpirun=4.release .............................................................   Passed    3.03 sec
            Start  8261: mpi/mg_01.mpirun=4.debug
11172/11571 Test  #8261: mpi/mg_01.mpirun=4.debug ...............................................................   Passed    3.04 sec
11173/11571 Test  #8264: mpi/mg_02.mpirun=10.release ............................................................   Passed   23.18 sec
            Start  8269: mpi/mg_03.mpirun=10.debug
            Start  8266: mpi/mg_02.mpirun=4.release
11174/11571 Test  #8263: mpi/mg_02.mpirun=10.debug ..............................................................   Passed   25.19 sec
            Start  8270: mpi/mg_03.mpirun=10.release
11175/11571 Test  #8266: mpi/mg_02.mpirun=4.release .............................................................   Passed    3.30 sec
            Start  8265: mpi/mg_02.mpirun=4.debug
11176/11571 Test  #8269: mpi/mg_03.mpirun=10.debug ..............................................................   Passed    3.40 sec
            Start  8339: mpi/p4est_2d_coarse_01.mpirun=10.debug
11177/11571 Test  #8270: mpi/mg_03.mpirun=10.release ............................................................   Passed    3.29 sec
            Start  8340: mpi/p4est_2d_coarse_01.mpirun=10.release
11178/11571 Test  #8265: mpi/mg_02.mpirun=4.debug ...............................................................   Passed    3.11 sec
            Start  8271: mpi/mg_03.mpirun=4.debug
11179/11571 Test  #8271: mpi/mg_03.mpirun=4.debug ...............................................................   Passed    3.06 sec
            Start  8272: mpi/mg_03.mpirun=4.release
11180/11571 Test  #8272: mpi/mg_03.mpirun=4.release .............................................................   Passed    2.81 sec
11181/11571 Test  #8340: mpi/p4est_2d_coarse_01.mpirun=10.release ...............................................   Passed   19.40 sec
            Start  8343: mpi/p4est_2d_constraintmatrix_01.mpirun=10.debug
            Start  8342: mpi/p4est_2d_coarse_01.mpirun=4.release
11182/11571 Test  #8342: mpi/p4est_2d_coarse_01.mpirun=4.release ................................................   Passed    3.68 sec
11183/11571 Test  #8339: mpi/p4est_2d_coarse_01.mpirun=10.debug .................................................   Passed   33.88 sec
            Start  8344: mpi/p4est_2d_constraintmatrix_01.mpirun=10.release
            Start  8341: mpi/p4est_2d_coarse_01.mpirun=4.debug
11184/11571 Test  #8343: mpi/p4est_2d_constraintmatrix_01.mpirun=10.debug .......................................   Passed   22.12 sec
            Start  8347: mpi/p4est_2d_constraintmatrix_02.mpirun=10.debug
11185/11571 Test  #8341: mpi/p4est_2d_coarse_01.mpirun=4.debug ..................................................   Passed   13.73 sec
            Start  8345: mpi/p4est_2d_constraintmatrix_01.mpirun=4.debug
11186/11571 Test  #8345: mpi/p4est_2d_constraintmatrix_01.mpirun=4.debug ........................................   Passed    3.17 sec
11187/11571 Test  #8344: mpi/p4est_2d_constraintmatrix_01.mpirun=10.release .....................................   Passed   18.39 sec
            Start  8348: mpi/p4est_2d_constraintmatrix_02.mpirun=10.release
            Start  8346: mpi/p4est_2d_constraintmatrix_01.mpirun=4.release
11188/11571 Test  #8346: mpi/p4est_2d_constraintmatrix_01.mpirun=4.release ......................................   Passed    3.03 sec
11189/11571 Test  #8347: mpi/p4est_2d_constraintmatrix_02.mpirun=10.debug .......................................   Passed   20.89 sec
            Start  8351: mpi/p4est_2d_constraintmatrix_03.mpirun=10.debug
            Start  8349: mpi/p4est_2d_constraintmatrix_02.mpirun=4.debug
11190/11571 Test  #8349: mpi/p4est_2d_constraintmatrix_02.mpirun=4.debug ........................................   Passed    3.24 sec
11191/11571 Test  #8348: mpi/p4est_2d_constraintmatrix_02.mpirun=10.release .....................................   Passed   18.16 sec
            Start  8352: mpi/p4est_2d_constraintmatrix_03.mpirun=10.release
            Start  8350: mpi/p4est_2d_constraintmatrix_02.mpirun=4.release
11192/11571 Test  #8350: mpi/p4est_2d_constraintmatrix_02.mpirun=4.release ......................................   Passed    3.02 sec
11193/11571 Test  #8351: mpi/p4est_2d_constraintmatrix_03.mpirun=10.debug .......................................   Passed   26.22 sec
            Start  8355: mpi/p4est_2d_constraintmatrix_04.mpirun=10.debug
            Start  8353: mpi/p4est_2d_constraintmatrix_03.mpirun=4.debug
11194/11571 Test  #8353: mpi/p4est_2d_constraintmatrix_03.mpirun=4.debug ........................................   Passed    3.81 sec
11195/11571 Test  #8352: mpi/p4est_2d_constraintmatrix_03.mpirun=10.release .....................................   Passed   23.07 sec
            Start  8356: mpi/p4est_2d_constraintmatrix_04.mpirun=10.release
            Start  8354: mpi/p4est_2d_constraintmatrix_03.mpirun=4.release
11196/11571 Test  #8354: mpi/p4est_2d_constraintmatrix_03.mpirun=4.release ......................................   Passed    3.19 sec
11197/11571 Test  #8355: mpi/p4est_2d_constraintmatrix_04.mpirun=10.debug .......................................   Passed   27.03 sec
            Start  8361: mpi/p4est_2d_dofhandler_01.mpirun=10.debug
            Start  8357: mpi/p4est_2d_constraintmatrix_04.mpirun=4.debug
11198/11571 Test  #8356: mpi/p4est_2d_constraintmatrix_04.mpirun=10.release .....................................   Passed   23.43 sec
            Start  8362: mpi/p4est_2d_dofhandler_01.mpirun=10.release
11199/11571 Test  #8357: mpi/p4est_2d_constraintmatrix_04.mpirun=4.debug ........................................   Passed    4.71 sec
            Start  8358: mpi/p4est_2d_constraintmatrix_04.mpirun=4.release
11200/11571 Test  #8358: mpi/p4est_2d_constraintmatrix_04.mpirun=4.release ......................................   Passed    3.00 sec
11201/11571 Test  #8362: mpi/p4est_2d_dofhandler_01.mpirun=10.release ...........................................   Passed   18.77 sec
            Start  8365: mpi/p4est_2d_dofhandler_02.mpirun=10.debug
            Start  8364: mpi/p4est_2d_dofhandler_01.mpirun=4.release
11202/11571 Test  #8364: mpi/p4est_2d_dofhandler_01.mpirun=4.release ............................................   Passed    3.00 sec
11203/11571 Test  #8361: mpi/p4est_2d_dofhandler_01.mpirun=10.debug .............................................   Passed   23.46 sec
            Start  8366: mpi/p4est_2d_dofhandler_02.mpirun=10.release
            Start  8363: mpi/p4est_2d_dofhandler_01.mpirun=4.debug
11204/11571 Test  #8363: mpi/p4est_2d_dofhandler_01.mpirun=4.debug ..............................................   Passed    3.04 sec
11205/11571 Test  #8366: mpi/p4est_2d_dofhandler_02.mpirun=10.release ...........................................   Passed   18.53 sec
            Start  8369: mpi/p4est_2d_dofhandler_03.mpirun=10.debug
            Start  8368: mpi/p4est_2d_dofhandler_02.mpirun=4.release
11206/11571 Test  #8368: mpi/p4est_2d_dofhandler_02.mpirun=4.release ............................................   Passed    3.17 sec
11207/11571 Test  #8365: mpi/p4est_2d_dofhandler_02.mpirun=10.debug .............................................   Passed   27.49 sec
            Start  8370: mpi/p4est_2d_dofhandler_03.mpirun=10.release
            Start  8367: mpi/p4est_2d_dofhandler_02.mpirun=4.debug
11208/11571 Test  #8367: mpi/p4est_2d_dofhandler_02.mpirun=4.debug ..............................................   Passed    5.17 sec
11209/11571 Test  #8370: mpi/p4est_2d_dofhandler_03.mpirun=10.release ...........................................   Passed   24.60 sec
            Start  8373: mpi/p4est_2d_dofhandler_04.mpirun=10.debug
            Start  8372: mpi/p4est_2d_dofhandler_03.mpirun=4.release
11210/11571 Test  #8369: mpi/p4est_2d_dofhandler_03.mpirun=10.debug .............................................   Passed   30.35 sec
            Start  8374: mpi/p4est_2d_dofhandler_04.mpirun=10.release
11211/11571 Test  #8372: mpi/p4est_2d_dofhandler_03.mpirun=4.release ............................................   Passed    2.96 sec
            Start  8371: mpi/p4est_2d_dofhandler_03.mpirun=4.debug
11212/11571 Test  #8371: mpi/p4est_2d_dofhandler_03.mpirun=4.debug ..............................................   Passed    5.30 sec
11213/11571 Test  #8374: mpi/p4est_2d_dofhandler_04.mpirun=10.release ...........................................   Passed   19.12 sec
            Start  8377: mpi/p4est_2d_dofhandler_05.mpirun=10.debug
            Start  8376: mpi/p4est_2d_dofhandler_04.mpirun=4.release
11214/11571 Test  #8376: mpi/p4est_2d_dofhandler_04.mpirun=4.release ............................................   Passed    3.12 sec
11215/11571 Test  #8373: mpi/p4est_2d_dofhandler_04.mpirun=10.debug .............................................   Passed   27.94 sec
            Start  8378: mpi/p4est_2d_dofhandler_05.mpirun=10.release
            Start  8375: mpi/p4est_2d_dofhandler_04.mpirun=4.debug
11216/11571 Test  #8375: mpi/p4est_2d_dofhandler_04.mpirun=4.debug ..............................................   Passed    5.01 sec
11217/11571 Test  #8377: mpi/p4est_2d_dofhandler_05.mpirun=10.debug .............................................   Passed   20.52 sec
            Start  8381: mpi/p4est_2d_ghost_01.mpirun=10.debug
            Start  8379: mpi/p4est_2d_dofhandler_05.mpirun=4.debug
11218/11571 Test  #8379: mpi/p4est_2d_dofhandler_05.mpirun=4.debug ..............................................   Passed    3.14 sec
11219/11571 Test  #8378: mpi/p4est_2d_dofhandler_05.mpirun=10.release ...........................................   Passed   17.38 sec
            Start  8382: mpi/p4est_2d_ghost_01.mpirun=10.release
            Start  8380: mpi/p4est_2d_dofhandler_05.mpirun=4.release
11220/11571 Test  #8380: mpi/p4est_2d_dofhandler_05.mpirun=4.release ............................................   Passed    2.94 sec
11221/11571 Test  #8381: mpi/p4est_2d_ghost_01.mpirun=10.debug ..................................................   Passed   22.71 sec
            Start  8385: mpi/p4est_2d_ghost_02.mpirun=10.debug
            Start  8383: mpi/p4est_2d_ghost_01.mpirun=4.debug
11222/11571 Test  #8382: mpi/p4est_2d_ghost_01.mpirun=10.release ................................................   Passed   18.96 sec
            Start  8386: mpi/p4est_2d_ghost_02.mpirun=10.release
11223/11571 Test  #8383: mpi/p4est_2d_ghost_01.mpirun=4.debug ...................................................   Passed    3.15 sec
            Start  8384: mpi/p4est_2d_ghost_01.mpirun=4.release
11224/11571 Test  #8384: mpi/p4est_2d_ghost_01.mpirun=4.release .................................................   Passed    3.04 sec
11225/11571 Test  #8386: mpi/p4est_2d_ghost_02.mpirun=10.release ................................................   Passed   18.49 sec
            Start  8389: mpi/p4est_2d_refine_01.mpirun=10.debug
            Start  8388: mpi/p4est_2d_ghost_02.mpirun=4.release
11226/11571 Test  #8385: mpi/p4est_2d_ghost_02.mpirun=10.debug ..................................................   Passed   22.28 sec
            Start  8390: mpi/p4est_2d_refine_01.mpirun=10.release
11227/11571 Test  #8388: mpi/p4est_2d_ghost_02.mpirun=4.release .................................................   Passed    3.09 sec
            Start  8387: mpi/p4est_2d_ghost_02.mpirun=4.debug
11228/11571 Test  #8387: mpi/p4est_2d_ghost_02.mpirun=4.debug ...................................................   Passed    3.24 sec
11229/11571 Test  #8390: mpi/p4est_2d_refine_01.mpirun=10.release ...............................................   Passed   19.59 sec
            Start  8393: mpi/p4est_2d_refine_02.mpirun=10.debug
            Start  8392: mpi/p4est_2d_refine_01.mpirun=4.release
11230/11571 Test  #8389: mpi/p4est_2d_refine_01.mpirun=10.debug .................................................   Passed   21.75 sec
            Start  8394: mpi/p4est_2d_refine_02.mpirun=10.release
11231/11571 Test  #8392: mpi/p4est_2d_refine_01.mpirun=4.release ................................................   Passed    3.00 sec
            Start  8391: mpi/p4est_2d_refine_01.mpirun=4.debug
11232/11571 Test  #8391: mpi/p4est_2d_refine_01.mpirun=4.debug ..................................................   Passed    3.04 sec
11233/11571 Test  #8394: mpi/p4est_2d_refine_02.mpirun=10.release ...............................................   Passed   18.50 sec
            Start  8397: mpi/p4est_2d_refine_03.mpirun=10.debug
            Start  8396: mpi/p4est_2d_refine_02.mpirun=4.release
11234/11571 Test  #8396: mpi/p4est_2d_refine_02.mpirun=4.release ................................................   Passed    3.08 sec
11235/11571 Test  #8393: mpi/p4est_2d_refine_02.mpirun=10.debug .................................................   Passed   22.40 sec
            Start  8398: mpi/p4est_2d_refine_03.mpirun=10.release
            Start  8395: mpi/p4est_2d_refine_02.mpirun=4.debug
11236/11571 Test  #8395: mpi/p4est_2d_refine_02.mpirun=4.debug ..................................................   Passed    3.16 sec
11237/11571 Test  #8397: mpi/p4est_2d_refine_03.mpirun=10.debug .................................................   Passed   22.25 sec
            Start  8401: mpi/p4est_2d_renumber_01.mpirun=10.debug
            Start  8399: mpi/p4est_2d_refine_03.mpirun=4.debug
11238/11571 Test  #8398: mpi/p4est_2d_refine_03.mpirun=10.release ...............................................   Passed   18.48 sec
            Start  8402: mpi/p4est_2d_renumber_01.mpirun=10.release
11239/11571 Test  #8399: mpi/p4est_2d_refine_03.mpirun=4.debug ..................................................   Passed    4.54 sec
            Start  8400: mpi/p4est_2d_refine_03.mpirun=4.release
11240/11571 Test  #8400: mpi/p4est_2d_refine_03.mpirun=4.release ................................................   Passed    3.07 sec
11241/11571 Test  #8402: mpi/p4est_2d_renumber_01.mpirun=10.release .............................................   Passed   20.31 sec
            Start  8405: mpi/p4est_2d_renumber_02.mpirun=10.debug
            Start  8404: mpi/p4est_2d_renumber_01.mpirun=4.release
11242/11571 Test  #8401: mpi/p4est_2d_renumber_01.mpirun=10.debug ...............................................   Passed   23.15 sec
            Start  8406: mpi/p4est_2d_renumber_02.mpirun=10.release
11243/11571 Test  #8404: mpi/p4est_2d_renumber_01.mpirun=4.release ..............................................   Passed    3.01 sec
            Start  8403: mpi/p4est_2d_renumber_01.mpirun=4.debug
11244/11571 Test  #8403: mpi/p4est_2d_renumber_01.mpirun=4.debug ................................................   Passed    3.22 sec
11245/11571 Test  #8405: mpi/p4est_2d_renumber_02.mpirun=10.debug ...............................................   Passed   24.01 sec
            Start  8409: mpi/p4est_2d_simple.mpirun=10.debug
            Start  8407: mpi/p4est_2d_renumber_02.mpirun=4.debug
11246/11571 Test  #8406: mpi/p4est_2d_renumber_02.mpirun=10.release .............................................   Passed   23.00 sec
            Start  8410: mpi/p4est_2d_simple.mpirun=10.release
11247/11571 Test  #8407: mpi/p4est_2d_renumber_02.mpirun=4.debug ................................................   Passed    3.12 sec
            Start  8408: mpi/p4est_2d_renumber_02.mpirun=4.release
11248/11571 Test  #8408: mpi/p4est_2d_renumber_02.mpirun=4.release ..............................................   Passed    3.05 sec
11249/11571 Test  #8410: mpi/p4est_2d_simple.mpirun=10.release ..................................................   Passed   14.29 sec
            Start  8413: mpi/p4est_3d_constraintmatrix_01.mpirun=10.debug
            Start  8412: mpi/p4est_2d_simple.mpirun=4.release
11250/11571 Test  #8409: mpi/p4est_2d_simple.mpirun=10.debug ....................................................   Passed   16.48 sec
            Start  8414: mpi/p4est_3d_constraintmatrix_01.mpirun=10.release
11251/11571 Test  #8412: mpi/p4est_2d_simple.mpirun=4.release ...................................................   Passed    3.00 sec
            Start  8411: mpi/p4est_2d_simple.mpirun=4.debug
11252/11571 Test  #8411: mpi/p4est_2d_simple.mpirun=4.debug .....................................................   Passed    3.06 sec
11253/11571 Test  #8414: mpi/p4est_3d_constraintmatrix_01.mpirun=10.release .....................................   Passed   18.34 sec
            Start  8417: mpi/p4est_3d_constraintmatrix_02.mpirun=10.debug
            Start  8416: mpi/p4est_3d_constraintmatrix_01.mpirun=4.release
11254/11571 Test  #8416: mpi/p4est_3d_constraintmatrix_01.mpirun=4.release ......................................   Passed    3.19 sec
11255/11571 Test  #8413: mpi/p4est_3d_constraintmatrix_01.mpirun=10.debug .......................................   Passed   22.20 sec
            Start  8418: mpi/p4est_3d_constraintmatrix_02.mpirun=10.release
            Start  8415: mpi/p4est_3d_constraintmatrix_01.mpirun=4.debug
11256/11571 Test  #8415: mpi/p4est_3d_constraintmatrix_01.mpirun=4.debug ........................................   Passed    4.65 sec
11257/11571 Test  #8418: mpi/p4est_3d_constraintmatrix_02.mpirun=10.release .....................................   Passed   18.21 sec
            Start  8421: mpi/p4est_3d_constraintmatrix_03.mpirun=10.debug
            Start  8420: mpi/p4est_3d_constraintmatrix_02.mpirun=4.release
11258/11571 Test  #8417: mpi/p4est_3d_constraintmatrix_02.mpirun=10.debug .......................................   Passed   21.94 sec
            Start  8422: mpi/p4est_3d_constraintmatrix_03.mpirun=10.release
11259/11571 Test  #8420: mpi/p4est_3d_constraintmatrix_02.mpirun=4.release ......................................   Passed    2.96 sec
            Start  8419: mpi/p4est_3d_constraintmatrix_02.mpirun=4.debug
11260/11571 Test  #8419: mpi/p4est_3d_constraintmatrix_02.mpirun=4.debug ........................................   Passed    3.29 sec
11261/11571 Test  #8422: mpi/p4est_3d_constraintmatrix_03.mpirun=10.release .....................................   Passed   24.15 sec
            Start  8427: mpi/p4est_3d_ghost_01.mpirun=10.debug
            Start  8424: mpi/p4est_3d_constraintmatrix_03.mpirun=4.release
11262/11571 Test  #8424: mpi/p4est_3d_constraintmatrix_03.mpirun=4.release ......................................   Passed    4.67 sec
11263/11571 Test  #8421: mpi/p4est_3d_constraintmatrix_03.mpirun=10.debug .......................................   Passed   46.30 sec
            Start  8428: mpi/p4est_3d_ghost_01.mpirun=10.release
            Start  8423: mpi/p4est_3d_constraintmatrix_03.mpirun=4.debug
11264/11571 Test  #8427: mpi/p4est_3d_ghost_01.mpirun=10.debug ..................................................   Passed   22.72 sec
            Start  8431: mpi/p4est_3d_refine_01.mpirun=10.debug
11265/11571 Test  #8428: mpi/p4est_3d_ghost_01.mpirun=10.release ................................................   Passed   19.29 sec
            Start  8432: mpi/p4est_3d_refine_01.mpirun=10.release
11266/11571 Test  #8431: mpi/p4est_3d_refine_01.mpirun=10.debug .................................................   Passed   34.76 sec
            Start  8435: mpi/p4est_3d_refine_02.mpirun=10.debug
11267/11571 Test  #8423: mpi/p4est_3d_constraintmatrix_03.mpirun=4.debug ........................................   Passed   37.95 sec
            Start  8429: mpi/p4est_3d_ghost_01.mpirun=4.debug
11268/11571 Test  #8432: mpi/p4est_3d_refine_01.mpirun=10.release ...............................................   Passed   20.16 sec
            Start  8436: mpi/p4est_3d_refine_02.mpirun=10.release
11269/11571 Test  #8429: mpi/p4est_3d_ghost_01.mpirun=4.debug ...................................................   Passed    3.28 sec
            Start  8430: mpi/p4est_3d_ghost_01.mpirun=4.release
11270/11571 Test  #8430: mpi/p4est_3d_ghost_01.mpirun=4.release .................................................   Passed    3.07 sec
            Start  8433: mpi/p4est_3d_refine_01.mpirun=4.debug
11271/11571 Test  #8433: mpi/p4est_3d_refine_01.mpirun=4.debug ..................................................   Passed   10.84 sec
            Start  8434: mpi/p4est_3d_refine_01.mpirun=4.release
11272/11571 Test  #8435: mpi/p4est_3d_refine_02.mpirun=10.debug .................................................   Passed   22.28 sec
            Start  8439: mpi/p4est_3d_refine_03.mpirun=10.debug
11273/11571 Test  #8434: mpi/p4est_3d_refine_01.mpirun=4.release ................................................   Passed    3.28 sec
            Start  8437: mpi/p4est_3d_refine_02.mpirun=4.debug
11274/11571 Test  #8436: mpi/p4est_3d_refine_02.mpirun=10.release ...............................................   Passed   19.32 sec
            Start  8440: mpi/p4est_3d_refine_03.mpirun=10.release
11275/11571 Test  #8437: mpi/p4est_3d_refine_02.mpirun=4.debug ..................................................   Passed    3.09 sec
            Start  8438: mpi/p4est_3d_refine_02.mpirun=4.release
11276/11571 Test  #8438: mpi/p4est_3d_refine_02.mpirun=4.release ................................................   Passed    3.06 sec
11277/11571 Test  #8440: mpi/p4est_3d_refine_03.mpirun=10.release ...............................................   Passed   19.06 sec
            Start  8452: mpi/p4est_data_out_01.mpirun=10.debug
            Start  8442: mpi/p4est_3d_refine_03.mpirun=4.release
11278/11571 Test  #8439: mpi/p4est_3d_refine_03.mpirun=10.debug .................................................   Passed   22.40 sec
            Start  8453: mpi/p4est_data_out_01.mpirun=10.release
11279/11571 Test  #8442: mpi/p4est_3d_refine_03.mpirun=4.release ................................................   Passed    3.02 sec
            Start  8441: mpi/p4est_3d_refine_03.mpirun=4.debug
11280/11571 Test  #8441: mpi/p4est_3d_refine_03.mpirun=4.debug ..................................................   Passed    3.05 sec
11281/11571 Test  #8453: mpi/p4est_data_out_01.mpirun=10.release ................................................   Passed   19.36 sec
            Start  8456: mpi/p4est_get_subdomain_association.mpirun=10.debug
            Start  8455: mpi/p4est_data_out_01.mpirun=4.release
11282/11571 Test  #8452: mpi/p4est_data_out_01.mpirun=10.debug ..................................................   Passed   24.19 sec
            Start  8457: mpi/p4est_get_subdomain_association.mpirun=10.release
11283/11571 Test  #8455: mpi/p4est_data_out_01.mpirun=4.release .................................................   Passed    3.01 sec
            Start  8454: mpi/p4est_data_out_01.mpirun=4.debug
11284/11571 Test  #8454: mpi/p4est_data_out_01.mpirun=4.debug ...................................................   Passed    2.94 sec
11285/11571 Test  #8457: mpi/p4est_get_subdomain_association.mpirun=10.release ..................................   Passed   19.21 sec
            Start  8464: mpi/p4est_save_01.mpirun=10.debug
            Start  8459: mpi/p4est_get_subdomain_association.mpirun=4.release
11286/11571 Test  #8456: mpi/p4est_get_subdomain_association.mpirun=10.debug ....................................   Passed   23.35 sec
            Start  8465: mpi/p4est_save_01.mpirun=10.release
11287/11571 Test  #8459: mpi/p4est_get_subdomain_association.mpirun=4.release ...................................   Passed    2.93 sec
            Start  8458: mpi/p4est_get_subdomain_association.mpirun=4.debug
11288/11571 Test  #8458: mpi/p4est_get_subdomain_association.mpirun=4.debug .....................................   Passed    3.03 sec
11289/11571 Test  #8465: mpi/p4est_save_01.mpirun=10.release ....................................................   Passed   18.26 sec
            Start  8488: mpi/parallel_block_vector_01.mpirun=10.debug
            Start  8467: mpi/p4est_save_01.mpirun=4.release
11290/11571 Test  #8464: mpi/p4est_save_01.mpirun=10.debug ......................................................   Passed   22.61 sec
            Start  8489: mpi/parallel_block_vector_01.mpirun=10.release
11291/11571 Test  #8467: mpi/p4est_save_01.mpirun=4.release .....................................................   Passed    3.15 sec
            Start  8466: mpi/p4est_save_01.mpirun=4.debug
11292/11571 Test  #8488: mpi/parallel_block_vector_01.mpirun=10.debug ...........................................   Passed    3.28 sec
            Start  8494: mpi/parallel_block_vector_02.mpirun=10.debug
11293/11571 Test  #8489: mpi/parallel_block_vector_01.mpirun=10.release .........................................   Passed    3.17 sec
            Start  8495: mpi/parallel_block_vector_02.mpirun=10.release
11294/11571 Test  #8494: mpi/parallel_block_vector_02.mpirun=10.debug ...........................................   Passed    3.09 sec
            Start  8500: mpi/parallel_block_vector_04.mpirun=10.debug
11295/11571 Test  #8466: mpi/p4est_save_01.mpirun=4.debug .......................................................   Passed    3.22 sec
            Start  8490: mpi/parallel_block_vector_01.mpirun=4.debug
11296/11571 Test  #8495: mpi/parallel_block_vector_02.mpirun=10.release .........................................   Passed    3.05 sec
            Start  8501: mpi/parallel_block_vector_04.mpirun=10.release
11297/11571 Test  #8490: mpi/parallel_block_vector_01.mpirun=4.debug ............................................   Passed    3.10 sec
            Start  8491: mpi/parallel_block_vector_01.mpirun=4.release
11298/11571 Test  #8500: mpi/parallel_block_vector_04.mpirun=10.debug ...........................................   Passed    3.21 sec
            Start  8532: mpi/parallel_partitioner_01.mpirun=10.debug
11299/11571 Test  #8501: mpi/parallel_block_vector_04.mpirun=10.release .........................................   Passed    2.93 sec
            Start  8533: mpi/parallel_partitioner_01.mpirun=10.release
11300/11571 Test  #8491: mpi/parallel_block_vector_01.mpirun=4.release ..........................................   Passed    2.85 sec
            Start  8496: mpi/parallel_block_vector_02.mpirun=4.debug
11301/11571 Test  #8496: mpi/parallel_block_vector_02.mpirun=4.debug ............................................   Passed    3.05 sec
            Start  8497: mpi/parallel_block_vector_02.mpirun=4.release
11302/11571 Test  #8497: mpi/parallel_block_vector_02.mpirun=4.release ..........................................   Passed    2.88 sec
            Start  8502: mpi/parallel_block_vector_04.mpirun=4.debug
11303/11571 Test  #8502: mpi/parallel_block_vector_04.mpirun=4.debug ............................................   Passed    3.02 sec
            Start  8503: mpi/parallel_block_vector_04.mpirun=4.release
11304/11571 Test  #8532: mpi/parallel_partitioner_01.mpirun=10.debug ............................................   Passed   13.82 sec
            Start  8536: mpi/parallel_partitioner_02.mpirun=10.debug
11305/11571 Test  #8533: mpi/parallel_partitioner_01.mpirun=10.release ..........................................   Passed   12.45 sec
            Start  8537: mpi/parallel_partitioner_02.mpirun=10.release
11306/11571 Test  #8503: mpi/parallel_block_vector_04.mpirun=4.release ..........................................   Passed    3.07 sec
            Start  8534: mpi/parallel_partitioner_01.mpirun=4.debug
11307/11571 Test  #8534: mpi/parallel_partitioner_01.mpirun=4.debug .............................................   Passed    3.05 sec
            Start  8535: mpi/parallel_partitioner_01.mpirun=4.release
11308/11571 Test  #8535: mpi/parallel_partitioner_01.mpirun=4.release ...........................................   Passed    2.97 sec
11309/11571 Test  #8537: mpi/parallel_partitioner_02.mpirun=10.release ..........................................   Passed   12.59 sec
            Start  8540: mpi/parallel_partitioner_03.mpirun=10.debug
            Start  8539: mpi/parallel_partitioner_02.mpirun=4.release
11310/11571 Test  #8536: mpi/parallel_partitioner_02.mpirun=10.debug ............................................   Passed   14.10 sec
            Start  8541: mpi/parallel_partitioner_03.mpirun=10.release
11311/11571 Test  #8539: mpi/parallel_partitioner_02.mpirun=4.release ...........................................   Passed    2.92 sec
            Start  8538: mpi/parallel_partitioner_02.mpirun=4.debug
11312/11571 Test  #8538: mpi/parallel_partitioner_02.mpirun=4.debug .............................................   Passed    3.06 sec
11313/11571 Test  #8541: mpi/parallel_partitioner_03.mpirun=10.release ..........................................   Passed   12.86 sec
            Start  8546: mpi/parallel_partitioner_04.mpirun=10.debug
            Start  8543: mpi/parallel_partitioner_03.mpirun=4.release
11314/11571 Test  #8540: mpi/parallel_partitioner_03.mpirun=10.debug ............................................   Passed   14.01 sec
            Start  8547: mpi/parallel_partitioner_04.mpirun=10.release
11315/11571 Test  #8543: mpi/parallel_partitioner_03.mpirun=4.release ...........................................   Passed    2.89 sec
            Start  8542: mpi/parallel_partitioner_03.mpirun=4.debug
11316/11571 Test  #8542: mpi/parallel_partitioner_03.mpirun=4.debug .............................................   Passed    3.12 sec
11317/11571 Test  #8547: mpi/parallel_partitioner_04.mpirun=10.release ..........................................   Passed   12.90 sec
            Start  8560: mpi/parallel_vector_01.mpirun=10.debug
            Start  8549: mpi/parallel_partitioner_04.mpirun=4.release
11318/11571 Test  #8546: mpi/parallel_partitioner_04.mpirun=10.debug ............................................   Passed   14.42 sec
            Start  8561: mpi/parallel_vector_01.mpirun=10.release
11319/11571 Test  #8549: mpi/parallel_partitioner_04.mpirun=4.release ...........................................   Passed    3.07 sec
            Start  8548: mpi/parallel_partitioner_04.mpirun=4.debug
11320/11571 Test  #8548: mpi/parallel_partitioner_04.mpirun=4.debug .............................................   Passed    3.08 sec
11321/11571 Test  #8561: mpi/parallel_vector_01.mpirun=10.release ...............................................   Passed   11.93 sec
            Start  8564: mpi/parallel_vector_02.mpirun=10.debug
            Start  8563: mpi/parallel_vector_01.mpirun=4.release
11322/11571 Test  #8560: mpi/parallel_vector_01.mpirun=10.debug .................................................   Passed   13.95 sec
            Start  8565: mpi/parallel_vector_02.mpirun=10.release
11323/11571 Test  #8563: mpi/parallel_vector_01.mpirun=4.release ................................................   Passed    3.01 sec
            Start  8562: mpi/parallel_vector_01.mpirun=4.debug
11324/11571 Test  #8562: mpi/parallel_vector_01.mpirun=4.debug ..................................................   Passed    3.05 sec
11325/11571 Test  #8565: mpi/parallel_vector_02.mpirun=10.release ...............................................   Passed   12.29 sec
            Start  8568: mpi/parallel_vector_03.mpirun=10.debug
            Start  8567: mpi/parallel_vector_02.mpirun=4.release
11326/11571 Test  #8564: mpi/parallel_vector_02.mpirun=10.debug .................................................   Passed   13.88 sec
            Start  8569: mpi/parallel_vector_03.mpirun=10.release
11327/11571 Test  #8567: mpi/parallel_vector_02.mpirun=4.release ................................................   Passed    2.97 sec
            Start  8566: mpi/parallel_vector_02.mpirun=4.debug
11328/11571 Test  #8566: mpi/parallel_vector_02.mpirun=4.debug ..................................................   Passed    3.10 sec
11329/11571 Test  #8569: mpi/parallel_vector_03.mpirun=10.release ...............................................   Passed   12.38 sec
            Start  8574: mpi/parallel_vector_04.mpirun=10.debug
            Start  8571: mpi/parallel_vector_03.mpirun=4.release
11330/11571 Test  #8568: mpi/parallel_vector_03.mpirun=10.debug .................................................   Passed   14.15 sec
            Start  8575: mpi/parallel_vector_04.mpirun=10.release
11331/11571 Test  #8571: mpi/parallel_vector_03.mpirun=4.release ................................................   Passed    2.99 sec
            Start  8570: mpi/parallel_vector_03.mpirun=4.debug
11332/11571 Test  #8570: mpi/parallel_vector_03.mpirun=4.debug ..................................................   Passed    3.06 sec
11333/11571 Test  #8575: mpi/parallel_vector_04.mpirun=10.release ...............................................   Passed   12.90 sec
            Start  8578: mpi/parallel_vector_05.mpirun=10.debug
            Start  8577: mpi/parallel_vector_04.mpirun=4.release
11334/11571 Test  #8574: mpi/parallel_vector_04.mpirun=10.debug .................................................   Passed   14.29 sec
            Start  8579: mpi/parallel_vector_05.mpirun=10.release
11335/11571 Test  #8577: mpi/parallel_vector_04.mpirun=4.release ................................................   Passed    3.00 sec
            Start  8576: mpi/parallel_vector_04.mpirun=4.debug
11336/11571 Test  #8576: mpi/parallel_vector_04.mpirun=4.debug ..................................................   Passed    3.00 sec
11337/11571 Test  #8579: mpi/parallel_vector_05.mpirun=10.release ...............................................   Passed   12.64 sec
            Start  8584: mpi/parallel_vector_06.mpirun=10.debug
            Start  8581: mpi/parallel_vector_05.mpirun=4.release
11338/11571 Test  #8578: mpi/parallel_vector_05.mpirun=10.debug .................................................   Passed   14.20 sec
            Start  8585: mpi/parallel_vector_06.mpirun=10.release
11339/11571 Test  #8581: mpi/parallel_vector_05.mpirun=4.release ................................................   Passed    3.08 sec
            Start  8580: mpi/parallel_vector_05.mpirun=4.debug
11340/11571 Test  #8584: mpi/parallel_vector_06.mpirun=10.debug .................................................   Passed    3.20 sec
            Start  8588: mpi/parallel_vector_07.mpirun=10.debug
11341/11571 Test  #8585: mpi/parallel_vector_06.mpirun=10.release ...............................................   Passed    3.06 sec
            Start  8589: mpi/parallel_vector_07.mpirun=10.release
11342/11571 Test  #8580: mpi/parallel_vector_05.mpirun=4.debug ..................................................   Passed    3.05 sec
            Start  8586: mpi/parallel_vector_06.mpirun=4.debug
11343/11571 Test  #8586: mpi/parallel_vector_06.mpirun=4.debug ..................................................   Passed    2.99 sec
            Start  8587: mpi/parallel_vector_06.mpirun=4.release
11344/11571 Test  #8587: mpi/parallel_vector_06.mpirun=4.release ................................................   Passed    2.90 sec
11345/11571 Test  #8589: mpi/parallel_vector_07.mpirun=10.release ...............................................   Passed   13.08 sec
            Start  8592: mpi/parallel_vector_08.mpirun=10.debug
            Start  8591: mpi/parallel_vector_07.mpirun=4.release
11346/11571 Test  #8588: mpi/parallel_vector_07.mpirun=10.debug .................................................   Passed   14.17 sec
            Start  8593: mpi/parallel_vector_08.mpirun=10.release
11347/11571 Test  #8591: mpi/parallel_vector_07.mpirun=4.release ................................................   Passed    2.91 sec
            Start  8590: mpi/parallel_vector_07.mpirun=4.debug
11348/11571 Test  #8590: mpi/parallel_vector_07.mpirun=4.debug ..................................................   Passed    3.10 sec
11349/11571 Test  #8593: mpi/parallel_vector_08.mpirun=10.release ...............................................   Passed   12.76 sec
            Start  8596: mpi/parallel_vector_09.mpirun=10.debug
            Start  8595: mpi/parallel_vector_08.mpirun=4.release
11350/11571 Test  #8592: mpi/parallel_vector_08.mpirun=10.debug .................................................   Passed   14.24 sec
            Start  8597: mpi/parallel_vector_09.mpirun=10.release
11351/11571 Test  #8595: mpi/parallel_vector_08.mpirun=4.release ................................................   Passed    3.02 sec
            Start  8594: mpi/parallel_vector_08.mpirun=4.debug
11352/11571 Test  #8594: mpi/parallel_vector_08.mpirun=4.debug ..................................................   Passed    3.05 sec
11353/11571 Test  #8596: mpi/parallel_vector_09.mpirun=10.debug .................................................   Passed   14.33 sec
            Start  8600: mpi/parallel_vector_10.mpirun=10.debug
            Start  8598: mpi/parallel_vector_09.mpirun=4.debug
11354/11571 Test  #8597: mpi/parallel_vector_09.mpirun=10.release ...............................................   Passed   12.90 sec
            Start  8601: mpi/parallel_vector_10.mpirun=10.release
11355/11571 Test  #8598: mpi/parallel_vector_09.mpirun=4.debug ..................................................   Passed    3.01 sec
            Start  8599: mpi/parallel_vector_09.mpirun=4.release
11356/11571 Test  #8599: mpi/parallel_vector_09.mpirun=4.release ................................................   Passed    2.90 sec
11357/11571 Test  #8601: mpi/parallel_vector_10.mpirun=10.release ...............................................   Passed   12.02 sec
            Start  8604: mpi/parallel_vector_11.mpirun=10.debug
            Start  8603: mpi/parallel_vector_10.mpirun=4.release
11358/11571 Test  #8600: mpi/parallel_vector_10.mpirun=10.debug .................................................   Passed   13.45 sec
            Start  8605: mpi/parallel_vector_11.mpirun=10.release
11359/11571 Test  #8603: mpi/parallel_vector_10.mpirun=4.release ................................................   Passed    2.98 sec
            Start  8602: mpi/parallel_vector_10.mpirun=4.debug
11360/11571 Test  #8602: mpi/parallel_vector_10.mpirun=4.debug ..................................................   Passed    3.09 sec
11361/11571 Test  #8605: mpi/parallel_vector_11.mpirun=10.release ...............................................   Passed   12.58 sec
            Start  8610: mpi/parallel_vector_12.mpirun=10.debug
            Start  8607: mpi/parallel_vector_11.mpirun=4.release
11362/11571 Test  #8604: mpi/parallel_vector_11.mpirun=10.debug .................................................   Passed   14.07 sec
            Start  8611: mpi/parallel_vector_12.mpirun=10.release
11363/11571 Test  #8607: mpi/parallel_vector_11.mpirun=4.release ................................................   Passed    3.66 sec
            Start  8606: mpi/parallel_vector_11.mpirun=4.debug
11364/11571 Test  #8610: mpi/parallel_vector_12.mpirun=10.debug .................................................   Passed    3.79 sec
            Start  8616: mpi/parallel_vector_12a.mpirun=10.debug
11365/11571 Test  #8611: mpi/parallel_vector_12.mpirun=10.release ...............................................   Passed    3.72 sec
            Start  8617: mpi/parallel_vector_12a.mpirun=10.release
11366/11571 Test  #8606: mpi/parallel_vector_11.mpirun=4.debug ..................................................   Passed    3.24 sec
            Start  8612: mpi/parallel_vector_12.mpirun=4.debug
11367/11571 Test  #8616: mpi/parallel_vector_12a.mpirun=10.debug ................................................   Passed    3.20 sec
            Start  8620: mpi/parallel_vector_13.mpirun=10.debug
11368/11571 Test  #8617: mpi/parallel_vector_12a.mpirun=10.release ..............................................   Passed    3.20 sec
            Start  8621: mpi/parallel_vector_13.mpirun=10.release
11369/11571 Test  #8612: mpi/parallel_vector_12.mpirun=4.debug ..................................................   Passed    2.93 sec
            Start  8613: mpi/parallel_vector_12.mpirun=4.release
11370/11571 Test  #8613: mpi/parallel_vector_12.mpirun=4.release ................................................   Passed    2.97 sec
            Start  8618: mpi/parallel_vector_12a.mpirun=4.debug
11371/11571 Test  #8618: mpi/parallel_vector_12a.mpirun=4.debug .................................................   Passed    3.03 sec
            Start  8619: mpi/parallel_vector_12a.mpirun=4.release
11372/11571 Test  #8619: mpi/parallel_vector_12a.mpirun=4.release ...............................................   Passed    2.91 sec
11373/11571 Test  #8621: mpi/parallel_vector_13.mpirun=10.release ...............................................   Passed   12.75 sec
            Start  8636: mpi/parallel_vector_18.mpirun=10.debug
            Start  8623: mpi/parallel_vector_13.mpirun=4.release
11374/11571 Test  #8620: mpi/parallel_vector_13.mpirun=10.debug .................................................   Passed   13.63 sec
            Start  8637: mpi/parallel_vector_18.mpirun=10.release
11375/11571 Test  #8623: mpi/parallel_vector_13.mpirun=4.release ................................................   Passed    3.00 sec
            Start  8622: mpi/parallel_vector_13.mpirun=4.debug
11376/11571 Test  #8636: mpi/parallel_vector_18.mpirun=10.debug .................................................   Passed    3.10 sec
            Start  8642: mpi/parallel_vector_19.mpirun=10.debug
11377/11571 Test  #8637: mpi/parallel_vector_18.mpirun=10.release ...............................................   Passed    2.97 sec
            Start  8643: mpi/parallel_vector_19.mpirun=10.release
11378/11571 Test  #8622: mpi/parallel_vector_13.mpirun=4.debug ..................................................   Passed    3.06 sec
            Start  8638: mpi/parallel_vector_18.mpirun=4.debug
11379/11571 Test  #8642: mpi/parallel_vector_19.mpirun=10.debug .................................................   Passed    3.08 sec
            Start  8650: mpi/parallel_vector_22.mpirun=10.debug
11380/11571 Test  #8643: mpi/parallel_vector_19.mpirun=10.release ...............................................   Passed    3.08 sec
            Start  8651: mpi/parallel_vector_22.mpirun=10.release
11381/11571 Test  #8638: mpi/parallel_vector_18.mpirun=4.debug ..................................................   Passed    3.00 sec
            Start  8639: mpi/parallel_vector_18.mpirun=4.release
11382/11571 Test  #8639: mpi/parallel_vector_18.mpirun=4.release ................................................   Passed    2.95 sec
            Start  8644: mpi/parallel_vector_19.mpirun=4.debug
11383/11571 Test  #8644: mpi/parallel_vector_19.mpirun=4.debug ..................................................   Passed    3.04 sec
            Start  8645: mpi/parallel_vector_19.mpirun=4.release
11384/11571 Test  #8645: mpi/parallel_vector_19.mpirun=4.release ................................................   Passed    2.86 sec
11385/11571 Test  #8651: mpi/parallel_vector_22.mpirun=10.release ...............................................   Passed   12.63 sec
            Start  8712: mpi/refine_and_coarsen_fixed_fraction_01.mpirun=10.debug
            Start  8653: mpi/parallel_vector_22.mpirun=4.release
11386/11571 Test  #8650: mpi/parallel_vector_22.mpirun=10.debug .................................................   Passed   13.70 sec
            Start  8713: mpi/refine_and_coarsen_fixed_fraction_01.mpirun=10.release
11387/11571 Test  #8653: mpi/parallel_vector_22.mpirun=4.release ................................................   Passed    2.88 sec
            Start  8652: mpi/parallel_vector_22.mpirun=4.debug
11388/11571 Test  #8652: mpi/parallel_vector_22.mpirun=4.debug ..................................................   Passed    3.02 sec
11389/11571 Test  #8713: mpi/refine_and_coarsen_fixed_fraction_01.mpirun=10.release .............................   Passed   18.58 sec
            Start  8716: mpi/refine_and_coarsen_fixed_fraction_02.mpirun=10.debug
            Start  8715: mpi/refine_and_coarsen_fixed_fraction_01.mpirun=4.release
11390/11571 Test  #8715: mpi/refine_and_coarsen_fixed_fraction_01.mpirun=4.release ..............................   Passed    3.09 sec
11391/11571 Test  #8712: mpi/refine_and_coarsen_fixed_fraction_01.mpirun=10.debug ...............................   Passed   22.54 sec
            Start  8717: mpi/refine_and_coarsen_fixed_fraction_02.mpirun=10.release
            Start  8714: mpi/refine_and_coarsen_fixed_fraction_01.mpirun=4.debug
11392/11571 Test  #8714: mpi/refine_and_coarsen_fixed_fraction_01.mpirun=4.debug ................................   Passed    3.19 sec
11393/11571 Test  #8716: mpi/refine_and_coarsen_fixed_fraction_02.mpirun=10.debug ...............................   Passed   22.40 sec
            Start  8720: mpi/refine_and_coarsen_fixed_fraction_03.mpirun=10.debug
            Start  8718: mpi/refine_and_coarsen_fixed_fraction_02.mpirun=4.debug
11394/11571 Test  #8717: mpi/refine_and_coarsen_fixed_fraction_02.mpirun=10.release .............................   Passed   19.27 sec
            Start  8721: mpi/refine_and_coarsen_fixed_fraction_03.mpirun=10.release
11395/11571 Test  #8718: mpi/refine_and_coarsen_fixed_fraction_02.mpirun=4.debug ................................   Passed    3.24 sec
            Start  8719: mpi/refine_and_coarsen_fixed_fraction_02.mpirun=4.release
11396/11571 Test  #8719: mpi/refine_and_coarsen_fixed_fraction_02.mpirun=4.release ..............................   Passed    3.02 sec
11397/11571 Test  #8721: mpi/refine_and_coarsen_fixed_fraction_03.mpirun=10.release .............................   Passed   19.43 sec
            Start  8740: mpi/refine_and_coarsen_fixed_number_01.mpirun=10.debug
            Start  8723: mpi/refine_and_coarsen_fixed_fraction_03.mpirun=4.release
11398/11571 Test  #8720: mpi/refine_and_coarsen_fixed_fraction_03.mpirun=10.debug ...............................   Passed   22.69 sec
            Start  8741: mpi/refine_and_coarsen_fixed_number_01.mpirun=10.release
11399/11571 Test  #8723: mpi/refine_and_coarsen_fixed_fraction_03.mpirun=4.release ..............................   Passed    3.07 sec
            Start  8722: mpi/refine_and_coarsen_fixed_fraction_03.mpirun=4.debug
11400/11571 Test  #8722: mpi/refine_and_coarsen_fixed_fraction_03.mpirun=4.debug ................................   Passed    3.02 sec
11401/11571 Test  #8740: mpi/refine_and_coarsen_fixed_number_01.mpirun=10.debug .................................   Passed   22.01 sec
            Start  8744: mpi/refine_and_coarsen_fixed_number_02.mpirun=10.debug
            Start  8742: mpi/refine_and_coarsen_fixed_number_01.mpirun=4.debug
11402/11571 Test  #8741: mpi/refine_and_coarsen_fixed_number_01.mpirun=10.release ...............................   Passed   19.49 sec
            Start  8745: mpi/refine_and_coarsen_fixed_number_02.mpirun=10.release
11403/11571 Test  #8742: mpi/refine_and_coarsen_fixed_number_01.mpirun=4.debug ..................................   Passed    3.20 sec
            Start  8743: mpi/refine_and_coarsen_fixed_number_01.mpirun=4.release
11404/11571 Test  #8743: mpi/refine_and_coarsen_fixed_number_01.mpirun=4.release ................................   Passed    3.15 sec
11405/11571 Test  #8745: mpi/refine_and_coarsen_fixed_number_02.mpirun=10.release ...............................   Passed   19.70 sec
            Start  8748: mpi/refine_and_coarsen_fixed_number_03.mpirun=10.debug
            Start  8747: mpi/refine_and_coarsen_fixed_number_02.mpirun=4.release
11406/11571 Test  #8744: mpi/refine_and_coarsen_fixed_number_02.mpirun=10.debug .................................   Passed   22.50 sec
            Start  8749: mpi/refine_and_coarsen_fixed_number_03.mpirun=10.release
11407/11571 Test  #8747: mpi/refine_and_coarsen_fixed_number_02.mpirun=4.release ................................   Passed    3.09 sec
            Start  8746: mpi/refine_and_coarsen_fixed_number_02.mpirun=4.debug
11408/11571 Test  #8746: mpi/refine_and_coarsen_fixed_number_02.mpirun=4.debug ..................................   Passed    3.03 sec
11409/11571 Test  #8749: mpi/refine_and_coarsen_fixed_number_03.mpirun=10.release ...............................   Passed   19.66 sec
            Start  8758: mpi/refine_and_coarsen_fixed_number_06.mpirun=10.debug
            Start  8751: mpi/refine_and_coarsen_fixed_number_03.mpirun=4.release
11410/11571 Test  #8748: mpi/refine_and_coarsen_fixed_number_03.mpirun=10.debug .................................   Passed   22.74 sec
            Start  8759: mpi/refine_and_coarsen_fixed_number_06.mpirun=10.release
11411/11571 Test  #8751: mpi/refine_and_coarsen_fixed_number_03.mpirun=4.release ................................   Passed    3.14 sec
            Start  8750: mpi/refine_and_coarsen_fixed_number_03.mpirun=4.debug
11412/11571 Test  #8758: mpi/refine_and_coarsen_fixed_number_06.mpirun=10.debug .................................   Passed    3.33 sec
            Start  8764: mpi/refine_and_coarsen_fixed_number_07.mpirun=10.debug
11413/11571 Test  #8759: mpi/refine_and_coarsen_fixed_number_06.mpirun=10.release ...............................   Passed    3.14 sec
            Start  8765: mpi/refine_and_coarsen_fixed_number_07.mpirun=10.release
11414/11571 Test  #8750: mpi/refine_and_coarsen_fixed_number_03.mpirun=4.debug ..................................   Passed    3.33 sec
            Start  8760: mpi/refine_and_coarsen_fixed_number_06.mpirun=4.debug
11415/11571 Test  #8764: mpi/refine_and_coarsen_fixed_number_07.mpirun=10.debug .................................   Passed    5.39 sec
            Start  8794: mpi/renumber_z_order_01.mpirun=10.debug
11416/11571 Test  #8765: mpi/refine_and_coarsen_fixed_number_07.mpirun=10.release ...............................   Passed    5.10 sec
            Start  8795: mpi/renumber_z_order_01.mpirun=10.release
11417/11571 Test  #8760: mpi/refine_and_coarsen_fixed_number_06.mpirun=4.debug ..................................   Passed    3.88 sec
            Start  8761: mpi/refine_and_coarsen_fixed_number_06.mpirun=4.release
11418/11571 Test  #8795: mpi/renumber_z_order_01.mpirun=10.release ..............................................   Passed    3.29 sec
            Start  8800: mpi/renumber_z_order_02.mpirun=10.debug
11419/11571 Test  #8794: mpi/renumber_z_order_01.mpirun=10.debug ................................................   Passed    3.47 sec
            Start  8801: mpi/renumber_z_order_02.mpirun=10.release
11420/11571 Test  #8761: mpi/refine_and_coarsen_fixed_number_06.mpirun=4.release ................................   Passed    3.03 sec
            Start  8766: mpi/refine_and_coarsen_fixed_number_07.mpirun=4.debug
11421/11571 Test  #8801: mpi/renumber_z_order_02.mpirun=10.release ..............................................   Passed    4.70 sec
            Start  8876: mpi/tria_ghost_owners_02.mpirun=11.debug
11422/11571 Test  #8800: mpi/renumber_z_order_02.mpirun=10.debug ................................................   Passed    4.88 sec
            Start  8877: mpi/tria_ghost_owners_02.mpirun=11.release
11423/11571 Test  #8766: mpi/refine_and_coarsen_fixed_number_07.mpirun=4.debug ..................................   Passed    4.39 sec
            Start  8767: mpi/refine_and_coarsen_fixed_number_07.mpirun=4.release
11424/11571 Test  #8767: mpi/refine_and_coarsen_fixed_number_07.mpirun=4.release ................................   Passed    3.08 sec
            Start  8796: mpi/renumber_z_order_01.mpirun=4.debug
11425/11571 Test  #8796: mpi/renumber_z_order_01.mpirun=4.debug .................................................   Passed    3.10 sec
            Start  8797: mpi/renumber_z_order_01.mpirun=4.release
11426/11571 Test  #8797: mpi/renumber_z_order_01.mpirun=4.release ...............................................   Passed    2.93 sec
            Start  8802: mpi/renumber_z_order_02.mpirun=4.debug
11427/11571 Test  #8802: mpi/renumber_z_order_02.mpirun=4.debug .................................................   Passed    3.11 sec
            Start  8803: mpi/renumber_z_order_02.mpirun=4.release
11428/11571 Test  #8803: mpi/renumber_z_order_02.mpirun=4.release ...............................................   Passed    2.95 sec
11429/11571 Test  #8877: mpi/tria_ghost_owners_02.mpirun=11.release .............................................   Passed   19.75 sec
            Start  8882: mpi/tria_signals_01.mpirun=11.debug
            Start  8879: mpi/tria_ghost_owners_02.mpirun=5.release
11430/11571 Test  #8879: mpi/tria_ghost_owners_02.mpirun=5.release ..............................................   Passed    4.37 sec
11431/11571 Test  #8882: mpi/tria_signals_01.mpirun=11.debug ....................................................   Passed   16.85 sec
            Start  8883: mpi/tria_signals_01.mpirun=11.release
            Start  8884: mpi/tria_signals_01.mpirun=4.debug
11432/11571 Test  #8884: mpi/tria_signals_01.mpirun=4.debug .....................................................   Passed    5.69 sec
11433/11571 Test  #8876: mpi/tria_ghost_owners_02.mpirun=11.debug ...............................................   Passed   48.67 sec
            Start  8888: mpi/tria_signals_02.mpirun=11.debug
            Start  8878: mpi/tria_ghost_owners_02.mpirun=5.debug
11434/11571 Test  #8883: mpi/tria_signals_01.mpirun=11.release ..................................................   Passed   12.04 sec
            Start  8889: mpi/tria_signals_02.mpirun=11.release
11435/11571 Test  #8889: mpi/tria_signals_02.mpirun=11.release ..................................................   Passed   14.04 sec
            Start  8894: mpi/tria_signals_03.mpirun=11.debug
11436/11571 Test  #8888: mpi/tria_signals_02.mpirun=11.debug ....................................................   Passed   14.15 sec
            Start  8895: mpi/tria_signals_03.mpirun=11.release
11437/11571 Test  #8878: mpi/tria_ghost_owners_02.mpirun=5.debug ................................................   Passed   27.83 sec
            Start  8885: mpi/tria_signals_01.mpirun=4.release
11438/11571 Test  #8885: mpi/tria_signals_01.mpirun=4.release ...................................................   Passed    8.27 sec
            Start  8890: mpi/tria_signals_02.mpirun=4.debug
11439/11571 Test  #8890: mpi/tria_signals_02.mpirun=4.debug .....................................................   Passed    8.89 sec
            Start  8891: mpi/tria_signals_02.mpirun=4.release
11440/11571 Test  #8895: mpi/tria_signals_03.mpirun=11.release ..................................................   Passed   34.82 sec
            Start  8900: mpi/tria_signals_04.mpirun=11.debug
11441/11571 Test  #8891: mpi/tria_signals_02.mpirun=4.release ...................................................   Passed    5.03 sec
            Start  8897: mpi/tria_signals_03.mpirun=4.release
11442/11571 Test  #8897: mpi/tria_signals_03.mpirun=4.release ...................................................   Passed    8.70 sec
11443/11571 Test  #8894: mpi/tria_signals_03.mpirun=11.debug ....................................................   Passed   83.14 sec
            Start  8901: mpi/tria_signals_04.mpirun=11.release
            Start  8896: mpi/tria_signals_03.mpirun=4.debug
11444/11571 Test  #8900: mpi/tria_signals_04.mpirun=11.debug ....................................................   Passed   83.92 sec
            Start  8906: mpi/tria_signals_05.mpirun=11.debug
11445/11571 Test  #8901: mpi/tria_signals_04.mpirun=11.release ..................................................   Passed   36.00 sec
            Start  8907: mpi/tria_signals_05.mpirun=11.release
11446/11571 Test  #8906: mpi/tria_signals_05.mpirun=11.debug ....................................................   Passed    5.28 sec
            Start  8912: mpi/trilinos_01.mpirun=10.debug
11447/11571 Test  #8907: mpi/tria_signals_05.mpirun=11.release ..................................................   Passed    5.01 sec
            Start  8913: mpi/trilinos_01.mpirun=10.release
11448/11571 Test  #8913: mpi/trilinos_01.mpirun=10.release ......................................................   Passed   15.25 sec
            Start  8916: mpi/trilinos_02.mpirun=10.debug
11449/11571 Test  #8912: mpi/trilinos_01.mpirun=10.debug ........................................................   Passed   18.28 sec
            Start  8917: mpi/trilinos_02.mpirun=10.release
11450/11571 Test  #8916: mpi/trilinos_02.mpirun=10.debug ........................................................   Passed   13.65 sec
            Start  8956: mpi/trilinos_ghost_01.mpirun=10.debug
11451/11571 Test  #8917: mpi/trilinos_02.mpirun=10.release ......................................................   Passed   11.59 sec
            Start  8957: mpi/trilinos_ghost_01.mpirun=10.release
11452/11571 Test  #8896: mpi/tria_signals_03.mpirun=4.debug .....................................................   Passed   70.97 sec
            Start  8902: mpi/tria_signals_04.mpirun=4.debug
11453/11571 Test  #8957: mpi/trilinos_ghost_01.mpirun=10.release ................................................   Passed   12.10 sec
            Start  8960: mpi/trilinos_ghost_02.mpirun=10.debug
11454/11571 Test  #8956: mpi/trilinos_ghost_01.mpirun=10.debug ..................................................   Passed   14.29 sec
            Start  8961: mpi/trilinos_ghost_02.mpirun=10.release
11455/11571 Test  #8961: mpi/trilinos_ghost_02.mpirun=10.release ................................................   Passed   12.85 sec
            Start  8964: mpi/trilinos_ghost_03.mpirun=10.debug
11456/11571 Test  #8960: mpi/trilinos_ghost_02.mpirun=10.debug ..................................................   Passed   14.17 sec
            Start  8966: mpi/trilinos_ghost_03_linfty.mpirun=10.debug
11457/11571 Test  #8964: mpi/trilinos_ghost_03.mpirun=10.debug ..................................................   Passed   13.93 sec
            Start  8968: mpi/trilinos_ghost_05.mpirun=10.debug
11458/11571 Test  #8966: mpi/trilinos_ghost_03_linfty.mpirun=10.debug ...........................................   Passed   14.40 sec
            Start  8969: mpi/trilinos_ghost_05.mpirun=10.release
11459/11571 Test  #8969: mpi/trilinos_ghost_05.mpirun=10.release ................................................   Passed   12.02 sec
            Start  9213: multigrid/transfer_matrix_free_06.mpirun=10.debug
11460/11571 Test  #8968: mpi/trilinos_ghost_05.mpirun=10.debug ..................................................   Passed   13.60 sec
            Start  9214: multigrid/transfer_matrix_free_06.mpirun=10.release
11461/11571 Test  #8902: mpi/tria_signals_04.mpirun=4.debug .....................................................   Passed   59.01 sec
            Start  8903: mpi/tria_signals_04.mpirun=4.release
11462/11571 Test  #8903: mpi/tria_signals_04.mpirun=4.release ...................................................   Passed    4.51 sec
            Start  8908: mpi/tria_signals_05.mpirun=4.debug
11463/11571 Test  #8908: mpi/tria_signals_05.mpirun=4.debug .....................................................   Passed    3.40 sec
            Start  8909: mpi/tria_signals_05.mpirun=4.release
11464/11571 Test  #8909: mpi/tria_signals_05.mpirun=4.release ...................................................   Passed    2.95 sec
            Start  8914: mpi/trilinos_01.mpirun=4.debug
11465/11571 Test  #8914: mpi/trilinos_01.mpirun=4.debug .........................................................   Passed    6.04 sec
            Start  8915: mpi/trilinos_01.mpirun=4.release
11466/11571 Test  #9214: multigrid/transfer_matrix_free_06.mpirun=10.release ....................................   Passed   22.90 sec
            Start  7438: matrix_free/matrix_vector_faces_16.mpirun=11.debug
11467/11571 Test  #8915: mpi/trilinos_01.mpirun=4.release .......................................................   Passed    6.07 sec
            Start  8918: mpi/trilinos_02.mpirun=4.debug
11468/11571 Test  #9213: multigrid/transfer_matrix_free_06.mpirun=10.debug ......................................   Passed   29.80 sec
            Start  7439: matrix_free/matrix_vector_faces_16.mpirun=11.release
11469/11571 Test  #8918: mpi/trilinos_02.mpirun=4.debug .........................................................   Passed    3.01 sec
            Start  8919: mpi/trilinos_02.mpirun=4.release
11470/11571 Test  #8919: mpi/trilinos_02.mpirun=4.release .......................................................   Passed    2.97 sec
            Start  8958: mpi/trilinos_ghost_01.mpirun=4.debug
11471/11571 Test  #8958: mpi/trilinos_ghost_01.mpirun=4.debug ...................................................   Passed    3.00 sec
            Start  8959: mpi/trilinos_ghost_01.mpirun=4.release
11472/11571 Test  #8959: mpi/trilinos_ghost_01.mpirun=4.release .................................................   Passed    2.98 sec
            Start  8962: mpi/trilinos_ghost_02.mpirun=4.debug
11473/11571 Test  #8962: mpi/trilinos_ghost_02.mpirun=4.debug ...................................................   Passed    3.02 sec
            Start  8963: mpi/trilinos_ghost_02.mpirun=4.release
11474/11571 Test  #8963: mpi/trilinos_ghost_02.mpirun=4.release .................................................   Passed    2.97 sec
            Start  8965: mpi/trilinos_ghost_03.mpirun=4.debug
11475/11571 Test  #8965: mpi/trilinos_ghost_03.mpirun=4.debug ...................................................   Passed    3.00 sec
            Start  8967: mpi/trilinos_ghost_03_linfty.mpirun=4.debug
11476/11571 Test  #8967: mpi/trilinos_ghost_03_linfty.mpirun=4.debug ............................................   Passed    3.01 sec
            Start  8970: mpi/trilinos_ghost_05.mpirun=4.debug
11477/11571 Test  #8970: mpi/trilinos_ghost_05.mpirun=4.debug ...................................................   Passed    3.08 sec
            Start  8971: mpi/trilinos_ghost_05.mpirun=4.release
11478/11571 Test  #8971: mpi/trilinos_ghost_05.mpirun=4.release .................................................   Passed    3.06 sec
            Start  9215: multigrid/transfer_matrix_free_06.mpirun=5.debug
11479/11571 Test  #7438: matrix_free/matrix_vector_faces_16.mpirun=11.debug .....................................   Passed   38.69 sec
            Start  8075: mpi/fe_tools_extrapolate_06.mpirun=10.debug
11480/11571 Test  #7439: matrix_free/matrix_vector_faces_16.mpirun=11.release ...................................   Passed   35.91 sec
            Start  8076: mpi/fe_tools_extrapolate_06.mpirun=10.release
11481/11571 Test  #9215: multigrid/transfer_matrix_free_06.mpirun=5.debug .......................................   Passed    7.90 sec
            Start  9216: multigrid/transfer_matrix_free_06.mpirun=5.release
11482/11571 Test  #9216: multigrid/transfer_matrix_free_06.mpirun=5.release .....................................   Passed    1.64 sec
11483/11571 Test  #8075: mpi/fe_tools_extrapolate_06.mpirun=10.debug ............................................   Passed    6.69 sec
            Start  8081: mpi/has_active_dofs_01.mpirun=10.debug
11484/11571 Test  #8076: mpi/fe_tools_extrapolate_06.mpirun=10.release ..........................................   Passed    3.84 sec
            Start  8082: mpi/has_active_dofs_01.mpirun=10.release
11485/11571 Test  #8082: mpi/has_active_dofs_01.mpirun=10.release ...............................................   Passed   18.89 sec
            Start  8083: mpi/has_active_dofs_02.mpirun=10.debug
11486/11571 Test  #8081: mpi/has_active_dofs_01.mpirun=10.debug .................................................   Passed   21.66 sec
            Start  8084: mpi/has_active_dofs_02.mpirun=10.release
11487/11571 Test  #8084: mpi/has_active_dofs_02.mpirun=10.release ...............................................   Passed   18.23 sec
            Start  8096: mpi/hp_active_fe_indices_transfer_02.mpirun=8.release
            Start  8287: mpi/mg_ghost_dofs_periodic_01.mpirun=7.debug
11488/11571 Test  #8083: mpi/has_active_dofs_02.mpirun=10.debug .................................................   Passed   20.86 sec
            Start  8099: mpi/hp_active_fe_indices_transfer_03.mpirun=8.debug
11489/11571 Test  #8096: mpi/hp_active_fe_indices_transfer_02.mpirun=8.release ..................................   Passed    3.71 sec
            Start  8100: mpi/hp_active_fe_indices_transfer_03.mpirun=8.release
11490/11571 Test  #8099: mpi/hp_active_fe_indices_transfer_03.mpirun=8.debug ....................................   Passed    3.85 sec
            Start  8167: mpi/hp_unify_dof_indices_09.mpirun=10.debug
11491/11571 Test  #8287: mpi/mg_ghost_dofs_periodic_01.mpirun=7.debug ...........................................   Passed    4.05 sec
            Start  8288: mpi/mg_ghost_dofs_periodic_01.mpirun=7.release
11492/11571 Test  #8100: mpi/hp_active_fe_indices_transfer_03.mpirun=8.release ..................................   Passed    2.96 sec
            Start  8299: mpi/mg_ghost_dofs_periodic_06.mpirun=7.debug
11493/11571 Test  #8288: mpi/mg_ghost_dofs_periodic_01.mpirun=7.release .........................................   Passed    3.19 sec
            Start  8300: mpi/mg_ghost_dofs_periodic_06.mpirun=7.release
11494/11571 Test  #8167: mpi/hp_unify_dof_indices_09.mpirun=10.debug ............................................   Passed   21.49 sec
            Start  8168: mpi/hp_unify_dof_indices_09.mpirun=10.release
11495/11571 Test  #8300: mpi/mg_ghost_dofs_periodic_06.mpirun=7.release .........................................   Passed   19.36 sec
            Start  8313: mpi/muelu_periodicity.mpirun=7.debug
11496/11571 Test  #8299: mpi/mg_ghost_dofs_periodic_06.mpirun=7.debug ...........................................   Passed   22.98 sec
            Start  8314: mpi/muelu_periodicity.mpirun=7.release
11497/11571 Test  #8313: mpi/muelu_periodicity.mpirun=7.debug ...................................................   Passed    4.29 sec
            Start  8323: mpi/no_flux_constraints.mpirun=9.debug
11498/11571 Test  #8314: mpi/muelu_periodicity.mpirun=7.release .................................................   Passed    3.63 sec
            Start  8676: mpi/periodicity_02.mpirun=7.debug
11499/11571 Test  #8676: mpi/periodicity_02.mpirun=7.debug ......................................................   Passed    4.01 sec
            Start  8677: mpi/periodicity_02.mpirun=7.release
11500/11571 Test  #8677: mpi/periodicity_02.mpirun=7.release ....................................................   Passed    3.47 sec
            Start  8684: mpi/periodicity_04.mpirun=7.debug
11501/11571 Test  #8168: mpi/hp_unify_dof_indices_09.mpirun=10.release ..........................................   Passed   17.61 sec
            Start  8281: mpi/mg_05.mpirun=10.debug
11502/11571 Test  #8323: mpi/no_flux_constraints.mpirun=9.debug .................................................   Passed   38.48 sec
            Start  8324: mpi/no_flux_constraints.mpirun=9.release
11503/11571 Test  #8281: mpi/mg_05.mpirun=10.debug ..............................................................   Passed   27.51 sec
            Start  8282: mpi/mg_05.mpirun=10.release
11504/11571 Test  #8684: mpi/periodicity_04.mpirun=7.debug ......................................................   Passed   49.40 sec
            Start  8685: mpi/periodicity_04.mpirun=7.release
11505/11571 Test  #8282: mpi/mg_05.mpirun=10.release ............................................................   Passed   20.45 sec
            Start  8327: mpi/no_flux_constraints_02.mpirun=9.debug
11506/11571 Test  #8324: mpi/no_flux_constraints.mpirun=9.release ...............................................   Passed   23.41 sec
            Start  8328: mpi/no_flux_constraints_02.mpirun=9.release
11507/11571 Test  #8685: mpi/periodicity_04.mpirun=7.release ....................................................   Passed    4.19 sec
            Start  8331: mpi/no_flux_constraints_03.mpirun=9.debug
11508/11571 Test  #8328: mpi/no_flux_constraints_02.mpirun=9.release ............................................   Passed    8.58 sec
            Start  8332: mpi/no_flux_constraints_03.mpirun=9.release
11509/11571 Test  #8327: mpi/no_flux_constraints_02.mpirun=9.debug ..............................................   Passed   14.18 sec
            Start  8333: mpi/normal_flux_constraints.mpirun=9.debug
11510/11571 Test  #8331: mpi/no_flux_constraints_03.mpirun=9.debug ..............................................   Passed   10.99 sec
            Start  8334: mpi/normal_flux_constraints.mpirun=9.release
11511/11571 Test  #8332: mpi/no_flux_constraints_03.mpirun=9.release ............................................   Passed    5.06 sec
            Start  8478: mpi/p_adaptivity_fixed_number.mpirun=8.debug
11512/11571 Test  #8478: mpi/p_adaptivity_fixed_number.mpirun=8.debug ...........................................   Passed    3.34 sec
            Start  8479: mpi/p_adaptivity_fixed_number.mpirun=8.release
11513/11571 Test  #8479: mpi/p_adaptivity_fixed_number.mpirun=8.release .........................................   Passed    2.99 sec
            Start  8484: mpi/p_refinement_and_coarsening.mpirun=8.debug
11514/11571 Test  #8484: mpi/p_refinement_and_coarsening.mpirun=8.debug .........................................   Passed    3.21 sec
            Start  8485: mpi/p_refinement_and_coarsening.mpirun=8.release
11515/11571 Test  #8485: mpi/p_refinement_and_coarsening.mpirun=8.release .......................................   Passed    2.94 sec
            Start  8686: mpi/periodicity_05.mpirun=9.debug
11516/11571 Test  #8334: mpi/normal_flux_constraints.mpirun=9.release ...........................................   Passed   22.43 sec
            Start  8687: mpi/periodicity_05.mpirun=9.release
11517/11571 Test  #8333: mpi/normal_flux_constraints.mpirun=9.debug .............................................   Passed   32.40 sec
            Start  8706: mpi/point_value_01.mpirun=6.debug
11518/11571 Test  #8706: mpi/point_value_01.mpirun=6.debug ......................................................   Passed    3.38 sec
            Start  8707: mpi/point_value_01.mpirun=6.release
11519/11571 Test  #8707: mpi/point_value_01.mpirun=6.release ....................................................   Passed    3.36 sec
            Start  8844: mpi/step-37.mpirun=7.debug
11520/11571 Test  #8686: mpi/periodicity_05.mpirun=9.debug ......................................................   Passed   25.87 sec
            Start  8530: mpi/parallel_block_vector_13.mpirun=10.debug
11521/11571 Test  #8687: mpi/periodicity_05.mpirun=9.release ....................................................   Passed   22.67 sec
            Start  8845: mpi/step-37.mpirun=7.release
11522/11571 Test  #8845: mpi/step-37.mpirun=7.release ...........................................................   Passed    3.93 sec
            Start  8852: mpi/step-39.mpirun=6.debug
11523/11571 Test  #8530: mpi/parallel_block_vector_13.mpirun=10.debug ...........................................   Passed   18.43 sec
            Start  8531: mpi/parallel_block_vector_13.mpirun=10.release
11524/11571 Test  #8852: mpi/step-39.mpirun=6.debug .............................................................   Passed    9.87 sec
            Start  8853: mpi/step-39.mpirun=6.release
11525/11571 Test  #8853: mpi/step-39.mpirun=6.release ...........................................................   Passed    4.68 sec
            Start  8874: mpi/tria_ghost_owners_01.mpirun=7.debug
11526/11571 Test  #8844: mpi/step-37.mpirun=7.debug .............................................................   Passed   28.05 sec
            Start  8875: mpi/tria_ghost_owners_01.mpirun=7.release
11527/11571 Test  #8531: mpi/parallel_block_vector_13.mpirun=10.release .........................................   Passed   13.12 sec
            Start  8690: mpi/periodicity_07.mpirun=13.debug
11528/11571 Test  #8875: mpi/tria_ghost_owners_01.mpirun=7.release ..............................................   Passed   20.45 sec
            Start  9141: multigrid/step-16-50-mpi.mpirun=7.debug
11529/11571 Test  #9141: multigrid/step-16-50-mpi.mpirun=7.debug ................................................   Passed    4.03 sec
            Start  9142: multigrid/step-16-50-mpi.mpirun=7.release
11530/11571 Test  #9142: multigrid/step-16-50-mpi.mpirun=7.release ..............................................   Passed    1.53 sec
            Start  9191: multigrid/transfer_matrix_free_01.mpirun=7.debug
11531/11571 Test  #8690: mpi/periodicity_07.mpirun=13.debug .....................................................   Passed   50.95 sec
            Start  8691: mpi/periodicity_07.mpirun=13.release
11532/11571 Test  #8874: mpi/tria_ghost_owners_01.mpirun=7.debug ................................................   Passed   58.41 sec
            Start  9192: multigrid/transfer_matrix_free_01.mpirun=7.release
11533/11571 Test  #9192: multigrid/transfer_matrix_free_01.mpirun=7.release .....................................   Passed    2.01 sec
            Start  9207: multigrid/transfer_matrix_free_04.mpirun=7.debug
11534/11571 Test  #9191: multigrid/transfer_matrix_free_01.mpirun=7.debug .......................................   Passed   40.97 sec
            Start  9208: multigrid/transfer_matrix_free_04.mpirun=7.release
11535/11571 Test  #9208: multigrid/transfer_matrix_free_04.mpirun=7.release .....................................   Passed    1.97 sec
11536/11571 Test  #9207: multigrid/transfer_matrix_free_04.mpirun=7.debug .......................................   Passed   26.65 sec
            Start  9028: multigrid/constrained_dofs_02.mpirun=8.debug
11537/11571 Test  #8691: mpi/periodicity_07.mpirun=13.release ...................................................   Passed   28.81 sec
            Start  9029: multigrid/constrained_dofs_02.mpirun=8.release
            Start  9161: multigrid/step-50_01.mpirun=8.debug
11538/11571 Test  #9029: multigrid/constrained_dofs_02.mpirun=8.release .........................................   Passed    1.24 sec
            Start  9162: multigrid/step-50_01.mpirun=8.release
11539/11571 Test  #9028: multigrid/constrained_dofs_02.mpirun=8.debug ...........................................   Passed    1.44 sec
            Start 10262: remote_point_evaluation/remote_point_evaluation_03.mpirun=8.debug
11540/11571 Test  #9161: multigrid/step-50_01.mpirun=8.debug ....................................................   Passed    2.10 sec
            Start 10263: remote_point_evaluation/remote_point_evaluation_03.mpirun=8.release
11541/11571 Test  #9162: multigrid/step-50_01.mpirun=8.release ..................................................   Passed    1.14 sec
            Start 10264: remote_point_evaluation/vector_tools_evaluate_at_points_01.mpirun=8.debug
11542/11571 Test #10264: remote_point_evaluation/vector_tools_evaluate_at_points_01.mpirun=8.debug ..............   Passed   31.68 sec
            Start 10265: remote_point_evaluation/vector_tools_evaluate_at_points_01.mpirun=8.release
11543/11571 Test #10263: remote_point_evaluation/remote_point_evaluation_03.mpirun=8.release ....................   Passed   35.92 sec
            Start 10266: remote_point_evaluation/vector_tools_evaluate_at_points_02.mpirun=8.debug
11544/11571 Test #10262: remote_point_evaluation/remote_point_evaluation_03.mpirun=8.debug ......................   Passed   39.62 sec
            Start 10267: remote_point_evaluation/vector_tools_evaluate_at_points_02.mpirun=8.release
11545/11571 Test #10265: remote_point_evaluation/vector_tools_evaluate_at_points_01.mpirun=8.release ............   Passed   28.96 sec
            Start 11110: trilinos/n_nonzeros_02_parallel.mpirun=9.debug
11546/11571 Test #10266: remote_point_evaluation/vector_tools_evaluate_at_points_02.mpirun=8.debug ..............***Failed   40.93 sec
            Start 11111: trilinos/n_nonzeros_02_parallel.mpirun=9.release
11547/11571 Test #10267: remote_point_evaluation/vector_tools_evaluate_at_points_02.mpirun=8.release ............***Failed   38.23 sec
11548/11571 Test #11110: trilinos/n_nonzeros_02_parallel.mpirun=9.debug .........................................   Passed   20.30 sec
11549/11571 Test #11111: trilinos/n_nonzeros_02_parallel.mpirun=9.release .......................................   Passed   16.47 sec
            Start  8295: mpi/mg_ghost_dofs_periodic_05.mpirun=28.debug
11550/11571 Test  #8295: mpi/mg_ghost_dofs_periodic_05.mpirun=28.debug ..........................................   Passed   44.86 sec
            Start  8296: mpi/mg_ghost_dofs_periodic_05.mpirun=28.release
11551/11571 Test  #8296: mpi/mg_ghost_dofs_periodic_05.mpirun=28.release ........................................   Passed   24.09 sec
            Start  8447: mpi/p4est_3d_refine_04.mpirun=24.debug
11552/11571 Test  #8447: mpi/p4est_3d_refine_04.mpirun=24.debug .................................................   Passed    9.14 sec
            Start  8448: mpi/p4est_3d_refine_04.mpirun=24.release
11553/11571 Test  #8448: mpi/p4est_3d_refine_04.mpirun=24.release ...............................................   Passed    3.45 sec
            Start  8774: mpi/refinement_listener_01.mpirun=20.debug
            Start  8449: mpi/p4est_3d_refine_04.mpirun=4.debug
11554/11571 Test  #8774: mpi/refinement_listener_01.mpirun=20.debug .............................................   Passed    4.09 sec
            Start  8775: mpi/refinement_listener_01.mpirun=20.release
11555/11571 Test  #8775: mpi/refinement_listener_01.mpirun=20.release ...........................................   Passed    3.42 sec
            Start  8780: mpi/refinement_listener_02.mpirun=20.debug
11556/11571 Test  #8449: mpi/p4est_3d_refine_04.mpirun=4.debug ..................................................   Passed    9.38 sec
            Start  8450: mpi/p4est_3d_refine_04.mpirun=4.release
11557/11571 Test  #8780: mpi/refinement_listener_02.mpirun=20.debug .............................................   Passed    4.04 sec
            Start  8781: mpi/refinement_listener_02.mpirun=20.release
11558/11571 Test  #8450: mpi/p4est_3d_refine_04.mpirun=4.release ................................................   Passed    3.46 sec
            Start  8776: mpi/refinement_listener_01.mpirun=4.debug
11559/11571 Test  #8781: mpi/refinement_listener_02.mpirun=20.release ...........................................   Passed    3.30 sec
            Start  9045: multigrid/distribute_bug_01.mpirun=20.debug
11560/11571 Test  #8776: mpi/refinement_listener_01.mpirun=4.debug ..............................................   Passed    3.77 sec
            Start  8777: mpi/refinement_listener_01.mpirun=4.release
11561/11571 Test  #9045: multigrid/distribute_bug_01.mpirun=20.debug ............................................   Passed    4.65 sec
            Start  9046: multigrid/distribute_bug_01.mpirun=20.release
11562/11571 Test  #8777: mpi/refinement_listener_01.mpirun=4.release ............................................   Passed    3.64 sec
            Start  8782: mpi/refinement_listener_02.mpirun=4.debug
11563/11571 Test  #9046: multigrid/distribute_bug_01.mpirun=20.release ..........................................   Passed    1.23 sec
            Start  8297: mpi/mg_ghost_dofs_periodic_05.mpirun=6.debug
            Start  8298: mpi/mg_ghost_dofs_periodic_05.mpirun=6.release
            Start  8783: mpi/refinement_listener_02.mpirun=4.release
11564/11571 Test  #8782: mpi/refinement_listener_02.mpirun=4.debug ..............................................   Passed    3.73 sec
            Start  9047: multigrid/distribute_bug_01.mpirun=6.debug
11565/11571 Test  #8783: mpi/refinement_listener_02.mpirun=4.release ............................................   Passed    3.35 sec
            Start  9048: multigrid/distribute_bug_01.mpirun=6.release
11566/11571 Test  #8298: mpi/mg_ghost_dofs_periodic_05.mpirun=6.release .........................................   Passed    3.67 sec
11567/11571 Test  #9048: multigrid/distribute_bug_01.mpirun=6.release ...........................................   Passed    2.87 sec
11568/11571 Test  #9047: multigrid/distribute_bug_01.mpirun=6.debug .............................................   Passed    4.14 sec
11569/11571 Test  #8297: mpi/mg_ghost_dofs_periodic_05.mpirun=6.debug ...........................................   Passed   20.46 sec
            Start  8303: mpi/mg_ghost_dofs_periodic_07.mpirun=43.debug
11570/11571 Test  #8303: mpi/mg_ghost_dofs_periodic_07.mpirun=43.debug ..........................................   Passed    7.25 sec
            Start  8304: mpi/mg_ghost_dofs_periodic_07.mpirun=43.release
11571/11571 Test  #8304: mpi/mg_ghost_dofs_periodic_07.mpirun=43.release ........................................   Passed    4.06 sec

99% tests passed, 17 tests failed out of 11571

Total Test time (real) = 23150.42 sec

The following tests FAILED:
	2919 - cuda/precondition_03.mpirun=2.debug (Failed)
	3173 - distributed_grids/3d_coarse_grid_02.debug (Failed)
	4862 - fullydistributed_grids/repartitioning_05.mpirun=4.debug (Failed)
	4863 - fullydistributed_grids/repartitioning_05.mpirun=4.release (Failed)
	5661 - hp/distribute_dofs_linear_time.debug (Timeout)
	8061 - mpi/fe_tools_extrapolate_01.mpirun=3.debug (Failed)
	8062 - mpi/fe_tools_extrapolate_01.mpirun=3.release (Failed)
	8067 - mpi/fe_tools_extrapolate_03.mpirun=3.debug (Failed)
	8068 - mpi/fe_tools_extrapolate_03.mpirun=3.release (Failed)
	8071 - mpi/fe_tools_extrapolate_04.mpirun=3.debug (Failed)
	8072 - mpi/fe_tools_extrapolate_04.mpirun=3.release (Failed)
	9708 - numerics/project_parallel_qp_q_01.mpirun=3.release (Failed)
	9710 - numerics/project_parallel_qp_q_02.mpirun=3.release (Failed)
	10266 - remote_point_evaluation/vector_tools_evaluate_at_points_02.mpirun=8.debug (Failed)
	10267 - remote_point_evaluation/vector_tools_evaluate_at_points_02.mpirun=8.release (Failed)
	11104 - trilinos/mg_transfer_prebuilt_01.mpirun=1.debug (Failed)
	11105 - trilinos/mg_transfer_prebuilt_01.mpirun=1.release (Failed)
-- Running CTEST_SUBMIT()
	Add file: /home/build/revision.log
	Add file: /home/build/summary.log
	Add file: /home/build/detailed.log
	Add file: /home/build/include/deal.II/base/config.h
Submit files
   Send to group: Continuous
   SubmitURL: https://cdash.43-1.org/submit.php?project=deal.II
   Uploaded: /home/build/Testing/20210910-0500/Update.xml
   Uploaded: /home/build/Testing/20210910-0500/Configure.xml
   Uploaded: /home/build/Testing/20210910-0500/Build.xml
   Error when uploading file: /home/build/Testing/20210910-0500/Test.xml
   Error message was: Operation too slow. Less than 1 bytes/sec transferred the last 120 seconds
   Problems when submitting via HTTP
+ docker stop cuda11_deal_ci
cuda11_deal_ci
+ docker rm -f cuda11_deal_ci
cuda11_deal_ci
INFO: Processing CTest-Version 3.x (default)
INFO: [CTest-Version 3.x (default)] - 1 test report file(s) were found with the pattern 'build/Testing/**/Test.xml' relative to '/var/jenkins/workspace/deal.II-CUDA11.0' for the testing framework 'CTest-Version 3.x (default)'.
INFO: Check 'Failed Tests' threshold.
INFO: The total number of tests for the threshold 'Failed Tests' exceeds the specified "failure threshold" value.
INFO: Setting the build status to FAILURE
Build step 'Publish xUnit test result report' changed build result to FAILURE
Finished: FAILURE