Console Output

Skipping 2,141 KB.. Full Log
            Start 10370: sharedtria/limit_p_level_difference_02.mpirun=4.debug
10819/11561 Test #10370: sharedtria/limit_p_level_difference_02.mpirun=4.debug ..................................   Passed    0.93 sec
            Start 10371: sharedtria/limit_p_level_difference_02.mpirun=4.release
10820/11561 Test #10371: sharedtria/limit_p_level_difference_02.mpirun=4.release ................................   Passed    0.61 sec
            Start 10374: sharedtria/limit_p_level_difference_03.mpirun=4.debug
10821/11561 Test  #9697: numerics/project_parallel_q_05.mpirun=4.debug ..........................................   Passed   28.56 sec
            Start 10375: sharedtria/limit_p_level_difference_03.mpirun=4.release
10822/11561 Test #10374: sharedtria/limit_p_level_difference_03.mpirun=4.debug ..................................   Passed    1.84 sec
            Start 10420: simplex/extract_boundary_dofs.mpirun=5.debug
10823/11561 Test #10375: sharedtria/limit_p_level_difference_03.mpirun=4.release ................................   Passed    0.68 sec
            Start 10421: simplex/extract_boundary_dofs.mpirun=5.release
10824/11561 Test #10421: simplex/extract_boundary_dofs.mpirun=5.release .........................................   Passed    0.75 sec
            Start 10542: simplex/step-68.mpirun=4.debug
10825/11561 Test #10420: simplex/extract_boundary_dofs.mpirun=5.debug ...........................................   Passed    1.18 sec
            Start 10543: simplex/step-68.mpirun=4.release
10826/11561 Test #10543: simplex/step-68.mpirun=4.release .......................................................   Passed    2.10 sec
            Start 11026: trilinos/assemble_matrix_parallel_02.mpirun=4.debug
10827/11561 Test #11026: trilinos/assemble_matrix_parallel_02.mpirun=4.debug ....................................   Passed    8.30 sec
            Start 11027: trilinos/assemble_matrix_parallel_02.mpirun=4.release
10828/11561 Test #10259: remote_point_evaluation/vector_tools_evaluate_at_points_03.mpirun=4.release ............   Passed   32.56 sec
            Start 11028: trilinos/assemble_matrix_parallel_03.mpirun=4.debug
10829/11561 Test #11027: trilinos/assemble_matrix_parallel_02.mpirun=4.release ..................................   Passed    2.05 sec
            Start 11029: trilinos/assemble_matrix_parallel_03.mpirun=4.release
10830/11561 Test #10258: remote_point_evaluation/vector_tools_evaluate_at_points_03.mpirun=4.debug ..............   Passed   34.45 sec
            Start 11030: trilinos/assemble_matrix_parallel_04.mpirun=4.debug
10831/11561 Test #10264: remote_point_evaluation/vector_tools_evaluate_at_points_05.mpirun=4.debug ..............   Passed   35.35 sec
            Start 11031: trilinos/assemble_matrix_parallel_04.mpirun=4.release
10832/11561 Test #10542: simplex/step-68.mpirun=4.debug .........................................................   Passed   23.23 sec
            Start 11034: trilinos/assemble_matrix_parallel_05.mpirun=4.debug
10833/11561 Test #10265: remote_point_evaluation/vector_tools_evaluate_at_points_05.mpirun=4.release ............   Passed   34.73 sec
            Start 11035: trilinos/assemble_matrix_parallel_05.mpirun=4.release
10834/11561 Test #11035: trilinos/assemble_matrix_parallel_05.mpirun=4.release ..................................   Passed    1.67 sec
            Start 11036: trilinos/assemble_matrix_parallel_06.mpirun=4.debug
10835/11561 Test #11034: trilinos/assemble_matrix_parallel_05.mpirun=4.debug ....................................   Passed    8.31 sec
            Start 11037: trilinos/assemble_matrix_parallel_06.mpirun=4.release
10836/11561 Test #11029: trilinos/assemble_matrix_parallel_03.mpirun=4.release ..................................   Passed   29.04 sec
            Start 11038: trilinos/assemble_matrix_parallel_07.mpirun=4.debug
10837/11561 Test #11028: trilinos/assemble_matrix_parallel_03.mpirun=4.debug ....................................   Passed   34.29 sec
            Start 11039: trilinos/assemble_matrix_parallel_07.mpirun=4.release
10838/11561 Test #11031: trilinos/assemble_matrix_parallel_04.mpirun=4.release ..................................   Passed   33.56 sec
            Start 11062: trilinos/copy_to_dealvec_block.mpirun=4.debug
10839/11561 Test #11030: trilinos/assemble_matrix_parallel_04.mpirun=4.debug ....................................   Passed   36.86 sec
            Start 11063: trilinos/copy_to_dealvec_block.mpirun=4.release
10840/11561 Test #11063: trilinos/copy_to_dealvec_block.mpirun=4.release ........................................   Passed   12.02 sec
            Start 11274: trilinos/trilinos_sparsity_pattern_02.mpirun=4.debug
10841/11561 Test #11036: trilinos/assemble_matrix_parallel_06.mpirun=4.debug ....................................   Passed   36.87 sec
            Start 11275: trilinos/trilinos_sparsity_pattern_02.mpirun=4.release
10842/11561 Test #11062: trilinos/copy_to_dealvec_block.mpirun=4.debug ..........................................   Passed   14.00 sec
            Start 11276: trilinos/trilinos_sparsity_pattern_03.mpirun=4.debug
10843/11561 Test #11037: trilinos/assemble_matrix_parallel_06.mpirun=4.release ..................................   Passed   31.86 sec
            Start 11277: trilinos/trilinos_sparsity_pattern_03.mpirun=4.release
10844/11561 Test #11277: trilinos/trilinos_sparsity_pattern_03.mpirun=4.release .................................   Passed    9.72 sec
10845/11561 Test #11039: trilinos/assemble_matrix_parallel_07.mpirun=4.release ..................................   Passed   28.21 sec
            Start  1618: base/mpi_all_gather_01.mpirun=6.debug
10846/11561 Test #11276: trilinos/trilinos_sparsity_pattern_03.mpirun=4.debug ...................................   Passed   11.59 sec
            Start  1619: base/mpi_all_gather_01.mpirun=6.release
10847/11561 Test  #1618: base/mpi_all_gather_01.mpirun=6.debug ..................................................   Passed    2.54 sec
            Start  1638: base/mpi_gather_01.mpirun=6.debug
10848/11561 Test  #1619: base/mpi_all_gather_01.mpirun=6.release ................................................   Passed    2.44 sec
            Start  1639: base/mpi_gather_01.mpirun=6.release
10849/11561 Test  #1638: base/mpi_gather_01.mpirun=6.debug ......................................................   Passed    2.57 sec
            Start  1658: base/mpi_some_to_some_01.mpirun=6.debug
10850/11561 Test #11038: trilinos/assemble_matrix_parallel_07.mpirun=4.debug ....................................   Passed   38.20 sec
10851/11561 Test  #1639: base/mpi_gather_01.mpirun=6.release ....................................................   Passed    2.61 sec
            Start  8269: mpi/mg_04.mpirun=10.debug
10852/11561 Test #11275: trilinos/trilinos_sparsity_pattern_02.mpirun=4.release .................................   Passed   17.44 sec
10853/11561 Test  #1658: base/mpi_some_to_some_01.mpirun=6.debug ................................................   Passed    2.58 sec
            Start  8270: mpi/mg_04.mpirun=10.release
10854/11561 Test #11274: trilinos/trilinos_sparsity_pattern_02.mpirun=4.debug ...................................   Passed   20.35 sec
10855/11561 Test  #8269: mpi/mg_04.mpirun=10.debug ..............................................................   Passed    4.55 sec
            Start  9035: multigrid/distribute_bug_01.mpirun=13.debug
            Start  8271: mpi/mg_04.mpirun=2.debug
10856/11561 Test  #8270: mpi/mg_04.mpirun=10.release ............................................................   Passed    3.15 sec
            Start  8439: mpi/p4est_3d_refine_04.mpirun=10.debug
10857/11561 Test  #8271: mpi/mg_04.mpirun=2.debug ...............................................................   Passed    3.11 sec
            Start  8272: mpi/mg_04.mpirun=2.release
10858/11561 Test  #8272: mpi/mg_04.mpirun=2.release .............................................................   Passed    3.30 sec
10859/11561 Test  #8439: mpi/p4est_3d_refine_04.mpirun=10.debug .................................................   Passed   10.04 sec
            Start  9036: multigrid/distribute_bug_01.mpirun=13.release
10860/11561 Test  #9035: multigrid/distribute_bug_01.mpirun=13.debug ............................................   Passed   23.04 sec
            Start  8440: mpi/p4est_3d_refine_04.mpirun=10.release
            Start  9037: multigrid/distribute_bug_01.mpirun=2.debug
10861/11561 Test  #9037: multigrid/distribute_bug_01.mpirun=2.debug .............................................   Passed    2.39 sec
10862/11561 Test  #8440: mpi/p4est_3d_refine_04.mpirun=10.release ...............................................   Passed    3.11 sec
            Start  8690: mpi/point_to_point_pattern_01.mpirun=10.debug
10863/11561 Test  #9036: multigrid/distribute_bug_01.mpirun=13.release ..........................................   Passed   20.28 sec
            Start  8691: mpi/point_to_point_pattern_01.mpirun=10.release
            Start  9038: multigrid/distribute_bug_01.mpirun=2.release
10864/11561 Test  #9038: multigrid/distribute_bug_01.mpirun=2.release ...........................................   Passed    0.72 sec
            Start  8273: mpi/mg_04.mpirun=4.debug
10865/11561 Test  #8273: mpi/mg_04.mpirun=4.debug ...............................................................   Passed    2.96 sec
            Start  8274: mpi/mg_04.mpirun=4.release
10866/11561 Test  #8274: mpi/mg_04.mpirun=4.release .............................................................   Passed    3.10 sec
10867/11561 Test  #8690: mpi/point_to_point_pattern_01.mpirun=10.debug ..........................................   Passed   13.27 sec
            Start  8766: mpi/refinement_listener_01.mpirun=10.debug
            Start  8692: mpi/point_to_point_pattern_01.mpirun=3.debug
10868/11561 Test  #8691: mpi/point_to_point_pattern_01.mpirun=10.release ........................................   Passed   11.25 sec
            Start  8767: mpi/refinement_listener_01.mpirun=10.release
            Start  8693: mpi/point_to_point_pattern_01.mpirun=3.release
10869/11561 Test  #8692: mpi/point_to_point_pattern_01.mpirun=3.debug ...........................................   Passed    3.06 sec
10870/11561 Test  #8693: mpi/point_to_point_pattern_01.mpirun=3.release .........................................   Passed    2.88 sec
            Start  8694: mpi/point_to_point_pattern_01.mpirun=4.debug
10871/11561 Test  #8694: mpi/point_to_point_pattern_01.mpirun=4.debug ...........................................   Passed    3.02 sec
            Start  8695: mpi/point_to_point_pattern_01.mpirun=4.release
10872/11561 Test  #8695: mpi/point_to_point_pattern_01.mpirun=4.release .........................................   Passed    2.92 sec
10873/11561 Test  #8767: mpi/refinement_listener_01.mpirun=10.release ...........................................   Passed   19.46 sec
            Start  8772: mpi/refinement_listener_02.mpirun=10.debug
10874/11561 Test  #8766: mpi/refinement_listener_01.mpirun=10.debug .............................................   Passed   24.86 sec
            Start  8773: mpi/refinement_listener_02.mpirun=10.release
10875/11561 Test  #8772: mpi/refinement_listener_02.mpirun=10.debug .............................................   Passed   23.16 sec
            Start  8812: mpi/simple_mpi_01.mpirun=10.debug
10876/11561 Test  #8773: mpi/refinement_listener_02.mpirun=10.release ...........................................   Passed   20.13 sec
            Start  8813: mpi/simple_mpi_01.mpirun=10.release
10877/11561 Test  #8813: mpi/simple_mpi_01.mpirun=10.release ....................................................   Passed   11.31 sec
            Start  8850: mpi/tria_01.mpirun=10.debug
            Start  8815: mpi/simple_mpi_01.mpirun=3.release
10878/11561 Test  #8812: mpi/simple_mpi_01.mpirun=10.debug ......................................................   Passed   12.62 sec
            Start  8851: mpi/tria_01.mpirun=10.release
            Start  8814: mpi/simple_mpi_01.mpirun=3.debug
10879/11561 Test  #8815: mpi/simple_mpi_01.mpirun=3.release .....................................................   Passed    2.99 sec
10880/11561 Test  #8814: mpi/simple_mpi_01.mpirun=3.debug .......................................................   Passed    3.09 sec
            Start  8816: mpi/simple_mpi_01.mpirun=4.debug
10881/11561 Test  #8816: mpi/simple_mpi_01.mpirun=4.debug .......................................................   Passed    2.91 sec
            Start  8817: mpi/simple_mpi_01.mpirun=4.release
10882/11561 Test  #8817: mpi/simple_mpi_01.mpirun=4.release .....................................................   Passed    2.99 sec
10883/11561 Test  #8851: mpi/tria_01.mpirun=10.release ..........................................................   Passed   18.51 sec
            Start  8920: mpi/trilinos_distribute_01.mpirun=10.debug
            Start  8853: mpi/tria_01.mpirun=2.release
10884/11561 Test  #8850: mpi/tria_01.mpirun=10.debug ............................................................   Passed   21.99 sec
            Start  8921: mpi/trilinos_distribute_01.mpirun=10.release
            Start  8852: mpi/tria_01.mpirun=2.debug
10885/11561 Test  #8853: mpi/tria_01.mpirun=2.release ...........................................................   Passed    3.15 sec
10886/11561 Test  #8920: mpi/trilinos_distribute_01.mpirun=10.debug .............................................   Passed    3.18 sec
            Start  8928: mpi/trilinos_distribute_01_block.mpirun=10.debug
            Start  8922: mpi/trilinos_distribute_01.mpirun=2.debug
10887/11561 Test  #8852: mpi/tria_01.mpirun=2.debug .............................................................   Passed    3.16 sec
10888/11561 Test  #8921: mpi/trilinos_distribute_01.mpirun=10.release ...........................................   Passed    3.73 sec
            Start  8929: mpi/trilinos_distribute_01_block.mpirun=10.release
            Start  8923: mpi/trilinos_distribute_01.mpirun=2.release
10889/11561 Test  #8922: mpi/trilinos_distribute_01.mpirun=2.debug ..............................................   Passed    3.08 sec
10890/11561 Test  #8928: mpi/trilinos_distribute_01_block.mpirun=10.debug .......................................   Passed    3.18 sec
            Start  8936: mpi/trilinos_distribute_01_inhomogenous.mpirun=10.debug
            Start  8930: mpi/trilinos_distribute_01_block.mpirun=2.debug
10891/11561 Test  #8929: mpi/trilinos_distribute_01_block.mpirun=10.release .....................................   Passed    3.09 sec
            Start  8937: mpi/trilinos_distribute_01_inhomogenous.mpirun=10.release
10892/11561 Test  #8923: mpi/trilinos_distribute_01.mpirun=2.release ............................................   Passed    3.20 sec
            Start  8931: mpi/trilinos_distribute_01_block.mpirun=2.release
10893/11561 Test  #8930: mpi/trilinos_distribute_01_block.mpirun=2.debug ........................................   Passed    3.09 sec
10894/11561 Test  #8936: mpi/trilinos_distribute_01_inhomogenous.mpirun=10.debug ................................   Passed    3.16 sec
            Start  3215: distributed_grids/grid_tools_exchange_bounding_boxes_1.mpirun=12.debug
10895/11561 Test  #8931: mpi/trilinos_distribute_01_block.mpirun=2.release ......................................   Passed    3.13 sec
            Start  8938: mpi/trilinos_distribute_01_inhomogenous.mpirun=2.debug
10896/11561 Test  #8937: mpi/trilinos_distribute_01_inhomogenous.mpirun=10.release ..............................   Passed    3.31 sec
            Start  7352: matrix_free/matrix_vector_10.mpirun=10.debug
10897/11561 Test  #8938: mpi/trilinos_distribute_01_inhomogenous.mpirun=2.debug .................................   Passed    3.27 sec
            Start  8939: mpi/trilinos_distribute_01_inhomogenous.mpirun=2.release
10898/11561 Test  #7352: matrix_free/matrix_vector_10.mpirun=10.debug ...........................................   Passed    4.13 sec
            Start  7353: matrix_free/matrix_vector_10.mpirun=10.release
10899/11561 Test  #8939: mpi/trilinos_distribute_01_inhomogenous.mpirun=2.release ...............................   Passed    2.96 sec
10900/11561 Test  #7353: matrix_free/matrix_vector_10.mpirun=10.release .........................................   Passed    2.10 sec
            Start  3216: distributed_grids/grid_tools_exchange_bounding_boxes_1.mpirun=12.release
10901/11561 Test  #3215: distributed_grids/grid_tools_exchange_bounding_boxes_1.mpirun=12.debug .................   Passed   20.16 sec
            Start  7356: matrix_free/matrix_vector_11.mpirun=10.debug
10902/11561 Test  #3216: distributed_grids/grid_tools_exchange_bounding_boxes_1.mpirun=12.release ...............   Passed   16.95 sec
            Start  7357: matrix_free/matrix_vector_11.mpirun=10.release
            Start  3217: distributed_grids/grid_tools_exchange_bounding_boxes_1.mpirun=4.debug
10903/11561 Test  #3217: distributed_grids/grid_tools_exchange_bounding_boxes_1.mpirun=4.debug ..................   Passed    0.76 sec
            Start  3218: distributed_grids/grid_tools_exchange_bounding_boxes_1.mpirun=4.release
10904/11561 Test  #3218: distributed_grids/grid_tools_exchange_bounding_boxes_1.mpirun=4.release ................   Passed    0.63 sec
            Start  7354: matrix_free/matrix_vector_10.mpirun=4.debug
10905/11561 Test  #7354: matrix_free/matrix_vector_10.mpirun=4.debug ............................................   Passed    4.30 sec
            Start  7355: matrix_free/matrix_vector_10.mpirun=4.release
10906/11561 Test  #7355: matrix_free/matrix_vector_10.mpirun=4.release ..........................................   Passed    1.40 sec
            Start  8854: mpi/tria_01.mpirun=4.debug
10907/11561 Test  #8854: mpi/tria_01.mpirun=4.debug .............................................................   Passed    3.13 sec
            Start  8855: mpi/tria_01.mpirun=4.release
10908/11561 Test  #8855: mpi/tria_01.mpirun=4.release ...........................................................   Passed    2.98 sec
            Start  8924: mpi/trilinos_distribute_01.mpirun=4.debug
10909/11561 Test  #8924: mpi/trilinos_distribute_01.mpirun=4.debug ..............................................   Passed    3.10 sec
            Start  8925: mpi/trilinos_distribute_01.mpirun=4.release
10910/11561 Test  #8925: mpi/trilinos_distribute_01.mpirun=4.release ............................................   Passed    2.89 sec
            Start  8932: mpi/trilinos_distribute_01_block.mpirun=4.debug
10911/11561 Test  #8932: mpi/trilinos_distribute_01_block.mpirun=4.debug ........................................   Passed    2.93 sec
            Start  8933: mpi/trilinos_distribute_01_block.mpirun=4.release
10912/11561 Test  #8933: mpi/trilinos_distribute_01_block.mpirun=4.release ......................................   Passed    2.89 sec
            Start  8940: mpi/trilinos_distribute_01_inhomogenous.mpirun=4.debug
10913/11561 Test  #8940: mpi/trilinos_distribute_01_inhomogenous.mpirun=4.debug .................................   Passed    3.02 sec
            Start  8941: mpi/trilinos_distribute_01_inhomogenous.mpirun=4.release
10914/11561 Test  #8941: mpi/trilinos_distribute_01_inhomogenous.mpirun=4.release ...............................   Passed    3.19 sec
10915/11561 Test  #7356: matrix_free/matrix_vector_11.mpirun=10.debug ...........................................   Passed   45.98 sec
            Start  7362: matrix_free/matrix_vector_12.mpirun=10.debug
            Start  7358: matrix_free/matrix_vector_11.mpirun=4.debug
10916/11561 Test  #7362: matrix_free/matrix_vector_12.mpirun=10.debug ...........................................   Passed   36.84 sec
            Start  7363: matrix_free/matrix_vector_12.mpirun=10.release
10917/11561 Test  #7357: matrix_free/matrix_vector_11.mpirun=10.release .........................................   Passed   77.75 sec
            Start  7621: matrix_free/step-48.mpirun=10.debug
10918/11561 Test  #7358: matrix_free/matrix_vector_11.mpirun=4.debug ............................................   Passed   37.85 sec
            Start  7359: matrix_free/matrix_vector_11.mpirun=4.release
10919/11561 Test  #7363: matrix_free/matrix_vector_12.mpirun=10.release .........................................   Passed    1.79 sec
            Start  7622: matrix_free/step-48.mpirun=10.release
10920/11561 Test  #7359: matrix_free/matrix_vector_11.mpirun=4.release ..........................................   Passed    7.88 sec
            Start  7364: matrix_free/matrix_vector_12.mpirun=3.debug
            Start  7365: matrix_free/matrix_vector_12.mpirun=3.release
10921/11561 Test  #7621: matrix_free/step-48.mpirun=10.debug ....................................................   Passed   15.85 sec
            Start  7756: mpi/collective_01.mpirun=10.debug
10922/11561 Test  #7622: matrix_free/step-48.mpirun=10.release ..................................................   Passed   14.93 sec
            Start  7757: mpi/collective_01.mpirun=10.release
10923/11561 Test  #7365: matrix_free/matrix_vector_12.mpirun=3.release ..........................................   Passed    7.86 sec
10924/11561 Test  #7364: matrix_free/matrix_vector_12.mpirun=3.debug ............................................   Passed   10.49 sec
            Start  7623: matrix_free/step-48.mpirun=4.debug
10925/11561 Test  #7756: mpi/collective_01.mpirun=10.debug ......................................................   Passed    3.16 sec
            Start  7762: mpi/collective_02.mpirun=10.debug
10926/11561 Test  #7757: mpi/collective_01.mpirun=10.release ....................................................   Passed    3.10 sec
            Start  7763: mpi/collective_02.mpirun=10.release
10927/11561 Test  #7623: matrix_free/step-48.mpirun=4.debug .....................................................   Passed    3.76 sec
            Start  7624: matrix_free/step-48.mpirun=4.release
10928/11561 Test  #7763: mpi/collective_02.mpirun=10.release ....................................................   Passed    3.33 sec
            Start  7768: mpi/collective_02_array.mpirun=10.debug
10929/11561 Test  #7762: mpi/collective_02.mpirun=10.debug ......................................................   Passed    3.40 sec
            Start  7769: mpi/collective_02_array.mpirun=10.release
10930/11561 Test  #7624: matrix_free/step-48.mpirun=4.release ...................................................   Passed    1.50 sec
            Start  7758: mpi/collective_01.mpirun=4.debug
10931/11561 Test  #7768: mpi/collective_02_array.mpirun=10.debug ................................................   Passed    3.22 sec
            Start  7774: mpi/collective_02_array_in_place.mpirun=10.debug
10932/11561 Test  #7769: mpi/collective_02_array.mpirun=10.release ..............................................   Passed    3.29 sec
            Start  7775: mpi/collective_02_array_in_place.mpirun=10.release
10933/11561 Test  #7758: mpi/collective_01.mpirun=4.debug .......................................................   Passed    3.15 sec
            Start  7759: mpi/collective_01.mpirun=4.release
10934/11561 Test  #7775: mpi/collective_02_array_in_place.mpirun=10.release .....................................   Passed    3.21 sec
            Start  7788: mpi/collective_02_vector.mpirun=10.debug
10935/11561 Test  #7774: mpi/collective_02_array_in_place.mpirun=10.debug .......................................   Passed    3.30 sec
            Start  7789: mpi/collective_02_vector.mpirun=10.release
10936/11561 Test  #7759: mpi/collective_01.mpirun=4.release .....................................................   Passed    3.11 sec
            Start  7764: mpi/collective_02.mpirun=4.debug
10937/11561 Test  #7789: mpi/collective_02_vector.mpirun=10.release .............................................   Passed    3.16 sec
            Start  7794: mpi/collective_02_vector_in_place.mpirun=10.debug
10938/11561 Test  #7788: mpi/collective_02_vector.mpirun=10.debug ...............................................   Passed    3.18 sec
            Start  7795: mpi/collective_02_vector_in_place.mpirun=10.release
10939/11561 Test  #7764: mpi/collective_02.mpirun=4.debug .......................................................   Passed    3.15 sec
            Start  7765: mpi/collective_02.mpirun=4.release
10940/11561 Test  #7795: mpi/collective_02_vector_in_place.mpirun=10.release ....................................   Passed    3.17 sec
            Start  7800: mpi/collective_full_matrix.mpirun=10.debug
10941/11561 Test  #7794: mpi/collective_02_vector_in_place.mpirun=10.debug ......................................   Passed    3.31 sec
            Start  7801: mpi/collective_full_matrix.mpirun=10.release
10942/11561 Test  #7765: mpi/collective_02.mpirun=4.release .....................................................   Passed    3.07 sec
            Start  7770: mpi/collective_02_array.mpirun=4.debug
10943/11561 Test  #7800: mpi/collective_full_matrix.mpirun=10.debug .............................................   Passed    3.25 sec
            Start  7810: mpi/collective_logical_or.mpirun=10.debug
10944/11561 Test  #7801: mpi/collective_full_matrix.mpirun=10.release ...........................................   Passed    3.19 sec
            Start  7811: mpi/collective_logical_or.mpirun=10.release
10945/11561 Test  #7770: mpi/collective_02_array.mpirun=4.debug .................................................   Passed    3.22 sec
            Start  7771: mpi/collective_02_array.mpirun=4.release
10946/11561 Test  #7810: mpi/collective_logical_or.mpirun=10.debug ..............................................   Passed    3.34 sec
            Start  7816: mpi/collective_logical_or_array.mpirun=10.debug
10947/11561 Test  #7811: mpi/collective_logical_or.mpirun=10.release ............................................   Passed    3.29 sec
            Start  7817: mpi/collective_logical_or_array.mpirun=10.release
10948/11561 Test  #7771: mpi/collective_02_array.mpirun=4.release ...............................................   Passed    3.25 sec
            Start  7776: mpi/collective_02_array_in_place.mpirun=4.debug
10949/11561 Test  #7817: mpi/collective_logical_or_array.mpirun=10.release ......................................   Passed    3.14 sec
            Start  7822: mpi/collective_logical_or_array_in_place.mpirun=10.debug
10950/11561 Test  #7816: mpi/collective_logical_or_array.mpirun=10.debug ........................................   Passed    3.26 sec
            Start  7823: mpi/collective_logical_or_array_in_place.mpirun=10.release
10951/11561 Test  #7776: mpi/collective_02_array_in_place.mpirun=4.debug ........................................   Passed    3.22 sec
            Start  7777: mpi/collective_02_array_in_place.mpirun=4.release
10952/11561 Test  #7823: mpi/collective_logical_or_array_in_place.mpirun=10.release .............................   Passed    3.26 sec
            Start  7828: mpi/collective_logical_or_vector.mpirun=10.debug
10953/11561 Test  #7822: mpi/collective_logical_or_array_in_place.mpirun=10.debug ...............................   Passed    3.38 sec
            Start  7829: mpi/collective_logical_or_vector.mpirun=10.release
10954/11561 Test  #7777: mpi/collective_02_array_in_place.mpirun=4.release ......................................   Passed    3.15 sec
            Start  7790: mpi/collective_02_vector.mpirun=4.debug
10955/11561 Test  #7829: mpi/collective_logical_or_vector.mpirun=10.release .....................................   Passed    3.16 sec
            Start  7834: mpi/collective_logical_or_vector_in_place.mpirun=10.debug
10956/11561 Test  #7828: mpi/collective_logical_or_vector.mpirun=10.debug .......................................   Passed    3.31 sec
            Start  7835: mpi/collective_logical_or_vector_in_place.mpirun=10.release
10957/11561 Test  #7790: mpi/collective_02_vector.mpirun=4.debug ................................................   Passed    3.30 sec
            Start  7791: mpi/collective_02_vector.mpirun=4.release
10958/11561 Test  #7834: mpi/collective_logical_or_vector_in_place.mpirun=10.debug ..............................   Passed    3.10 sec
            Start  7840: mpi/collective_max.mpirun=10.debug
10959/11561 Test  #7835: mpi/collective_logical_or_vector_in_place.mpirun=10.release ............................   Passed    3.17 sec
            Start  7841: mpi/collective_max.mpirun=10.release
10960/11561 Test  #7791: mpi/collective_02_vector.mpirun=4.release ..............................................   Passed    2.97 sec
            Start  7796: mpi/collective_02_vector_in_place.mpirun=4.debug
10961/11561 Test  #7840: mpi/collective_max.mpirun=10.debug .....................................................   Passed    3.28 sec
            Start  7846: mpi/collective_max_array.mpirun=10.debug
10962/11561 Test  #7841: mpi/collective_max.mpirun=10.release ...................................................   Passed    3.15 sec
            Start  7847: mpi/collective_max_array.mpirun=10.release
10963/11561 Test  #7796: mpi/collective_02_vector_in_place.mpirun=4.debug .......................................   Passed    3.17 sec
            Start  7797: mpi/collective_02_vector_in_place.mpirun=4.release
10964/11561 Test  #7846: mpi/collective_max_array.mpirun=10.debug ...............................................   Passed    3.13 sec
            Start  7852: mpi/collective_max_array_in_place.mpirun=10.debug
10965/11561 Test  #7847: mpi/collective_max_array.mpirun=10.release .............................................   Passed    3.11 sec
            Start  7853: mpi/collective_max_array_in_place.mpirun=10.release
10966/11561 Test  #7797: mpi/collective_02_vector_in_place.mpirun=4.release .....................................   Passed    3.01 sec
            Start  7802: mpi/collective_full_matrix.mpirun=3.debug
            Start  7803: mpi/collective_full_matrix.mpirun=3.release
10967/11561 Test  #7852: mpi/collective_max_array_in_place.mpirun=10.debug ......................................   Passed    3.23 sec
            Start  7858: mpi/collective_max_vector.mpirun=10.debug
10968/11561 Test  #7853: mpi/collective_max_array_in_place.mpirun=10.release ....................................   Passed    3.23 sec
            Start  7859: mpi/collective_max_vector.mpirun=10.release
10969/11561 Test  #7803: mpi/collective_full_matrix.mpirun=3.release ............................................   Passed    3.03 sec
10970/11561 Test  #7802: mpi/collective_full_matrix.mpirun=3.debug ..............................................   Passed    3.17 sec
            Start  7812: mpi/collective_logical_or.mpirun=4.debug
10971/11561 Test  #7859: mpi/collective_max_vector.mpirun=10.release ............................................   Passed    3.21 sec
            Start  7864: mpi/collective_max_vector_in_place.mpirun=10.debug
10972/11561 Test  #7858: mpi/collective_max_vector.mpirun=10.debug ..............................................   Passed    3.29 sec
            Start  7865: mpi/collective_max_vector_in_place.mpirun=10.release
10973/11561 Test  #7812: mpi/collective_logical_or.mpirun=4.debug ...............................................   Passed    3.02 sec
            Start  7813: mpi/collective_logical_or.mpirun=4.release
10974/11561 Test  #7865: mpi/collective_max_vector_in_place.mpirun=10.release ...................................   Passed    3.27 sec
            Start  7872: mpi/collective_min.mpirun=10.debug
10975/11561 Test  #7864: mpi/collective_max_vector_in_place.mpirun=10.debug .....................................   Passed    3.35 sec
            Start  7873: mpi/collective_min.mpirun=10.release
10976/11561 Test  #7813: mpi/collective_logical_or.mpirun=4.release .............................................   Passed    3.10 sec
            Start  7818: mpi/collective_logical_or_array.mpirun=4.debug
10977/11561 Test  #7872: mpi/collective_min.mpirun=10.debug .....................................................   Passed    3.38 sec
            Start  7878: mpi/collective_min_array.mpirun=10.debug
10978/11561 Test  #7873: mpi/collective_min.mpirun=10.release ...................................................   Passed    3.33 sec
            Start  7879: mpi/collective_min_array.mpirun=10.release
10979/11561 Test  #7818: mpi/collective_logical_or_array.mpirun=4.debug .........................................   Passed    3.30 sec
            Start  7819: mpi/collective_logical_or_array.mpirun=4.release
10980/11561 Test  #7879: mpi/collective_min_array.mpirun=10.release .............................................   Passed    3.05 sec
            Start  7884: mpi/collective_min_array_in_place.mpirun=10.debug
10981/11561 Test  #7819: mpi/collective_logical_or_array.mpirun=4.release .......................................   Passed    3.20 sec
            Start  7824: mpi/collective_logical_or_array_in_place.mpirun=4.debug
10982/11561 Test  #7878: mpi/collective_min_array.mpirun=10.debug ...............................................   Passed    3.23 sec
            Start  7885: mpi/collective_min_array_in_place.mpirun=10.release
10983/11561 Test  #7884: mpi/collective_min_array_in_place.mpirun=10.debug ......................................   Passed    3.32 sec
            Start  7890: mpi/collective_min_vector.mpirun=10.debug
10984/11561 Test  #7885: mpi/collective_min_array_in_place.mpirun=10.release ....................................   Passed    3.16 sec
            Start  7891: mpi/collective_min_vector.mpirun=10.release
10985/11561 Test  #7824: mpi/collective_logical_or_array_in_place.mpirun=4.debug ................................   Passed    3.24 sec
            Start  7825: mpi/collective_logical_or_array_in_place.mpirun=4.release
10986/11561 Test  #7890: mpi/collective_min_vector.mpirun=10.debug ..............................................   Passed    3.26 sec
            Start  7896: mpi/collective_min_vector_in_place.mpirun=10.debug
10987/11561 Test  #7825: mpi/collective_logical_or_array_in_place.mpirun=4.release ..............................   Passed    3.21 sec
            Start  7830: mpi/collective_logical_or_vector.mpirun=4.debug
10988/11561 Test  #7891: mpi/collective_min_vector.mpirun=10.release ............................................   Passed    3.28 sec
            Start  7897: mpi/collective_min_vector_in_place.mpirun=10.release
10989/11561 Test  #7897: mpi/collective_min_vector_in_place.mpirun=10.release ...................................   Passed    3.17 sec
            Start  7906: mpi/collective_tensor.mpirun=10.debug
10990/11561 Test  #7830: mpi/collective_logical_or_vector.mpirun=4.debug ........................................   Passed    3.18 sec
            Start  7831: mpi/collective_logical_or_vector.mpirun=4.release
10991/11561 Test  #7896: mpi/collective_min_vector_in_place.mpirun=10.debug .....................................   Passed    3.31 sec
            Start  7907: mpi/collective_tensor.mpirun=10.release
10992/11561 Test  #7831: mpi/collective_logical_or_vector.mpirun=4.release ......................................   Passed    3.13 sec
            Start  7836: mpi/collective_logical_or_vector_in_place.mpirun=4.debug
10993/11561 Test  #7906: mpi/collective_tensor.mpirun=10.debug ..................................................   Passed    3.31 sec
            Start  7932: mpi/compute_mean_value.mpirun=10.debug
10994/11561 Test  #7907: mpi/collective_tensor.mpirun=10.release ................................................   Passed    3.22 sec
            Start  7933: mpi/compute_mean_value.mpirun=10.release
10995/11561 Test  #7836: mpi/collective_logical_or_vector_in_place.mpirun=4.debug ...............................   Passed    3.09 sec
            Start  7837: mpi/collective_logical_or_vector_in_place.mpirun=4.release
10996/11561 Test  #7837: mpi/collective_logical_or_vector_in_place.mpirun=4.release .............................   Passed    2.91 sec
            Start  7842: mpi/collective_max.mpirun=4.debug
10997/11561 Test  #7842: mpi/collective_max.mpirun=4.debug ......................................................   Passed    3.07 sec
            Start  7843: mpi/collective_max.mpirun=4.release
10998/11561 Test  #7843: mpi/collective_max.mpirun=4.release ....................................................   Passed    3.06 sec
            Start  7848: mpi/collective_max_array.mpirun=4.debug
10999/11561 Test  #7848: mpi/collective_max_array.mpirun=4.debug ................................................   Passed    3.21 sec
            Start  7849: mpi/collective_max_array.mpirun=4.release
11000/11561 Test  #7849: mpi/collective_max_array.mpirun=4.release ..............................................   Passed    2.97 sec
            Start  7854: mpi/collective_max_array_in_place.mpirun=4.debug
11001/11561 Test  #7854: mpi/collective_max_array_in_place.mpirun=4.debug .......................................   Passed    3.00 sec
            Start  7855: mpi/collective_max_array_in_place.mpirun=4.release
11002/11561 Test  #7933: mpi/compute_mean_value.mpirun=10.release ...............................................   Passed   23.17 sec
            Start  7942: mpi/constraint_matrix_trilinos_bug.mpirun=10.debug
11003/11561 Test  #7855: mpi/collective_max_array_in_place.mpirun=4.release .....................................   Passed    3.05 sec
            Start  7860: mpi/collective_max_vector.mpirun=4.debug
11004/11561 Test  #7860: mpi/collective_max_vector.mpirun=4.debug ...............................................   Passed    3.18 sec
            Start  7861: mpi/collective_max_vector.mpirun=4.release
11005/11561 Test  #7932: mpi/compute_mean_value.mpirun=10.debug .................................................   Passed   28.07 sec
            Start  7948: mpi/count_dofs_per_block_01.mpirun=10.debug
11006/11561 Test  #7861: mpi/collective_max_vector.mpirun=4.release .............................................   Passed    2.99 sec
            Start  7866: mpi/collective_max_vector_in_place.mpirun=4.debug
11007/11561 Test  #7866: mpi/collective_max_vector_in_place.mpirun=4.debug ......................................   Passed    2.95 sec
            Start  7867: mpi/collective_max_vector_in_place.mpirun=4.release
11008/11561 Test  #7867: mpi/collective_max_vector_in_place.mpirun=4.release ....................................   Passed    2.93 sec
            Start  7874: mpi/collective_min.mpirun=4.debug
11009/11561 Test  #7874: mpi/collective_min.mpirun=4.debug ......................................................   Passed    3.13 sec
            Start  7875: mpi/collective_min.mpirun=4.release
11010/11561 Test  #7875: mpi/collective_min.mpirun=4.release ....................................................   Passed    3.02 sec
            Start  7880: mpi/collective_min_array.mpirun=4.debug
11011/11561 Test  #7880: mpi/collective_min_array.mpirun=4.debug ................................................   Passed    2.96 sec
            Start  7881: mpi/collective_min_array.mpirun=4.release
11012/11561 Test  #7881: mpi/collective_min_array.mpirun=4.release ..............................................   Passed    3.13 sec
            Start  7886: mpi/collective_min_array_in_place.mpirun=4.debug
11013/11561 Test  #7942: mpi/constraint_matrix_trilinos_bug.mpirun=10.debug .....................................   Passed   25.81 sec
            Start  7949: mpi/count_dofs_per_block_01.mpirun=10.release
11014/11561 Test  #7886: mpi/collective_min_array_in_place.mpirun=4.debug .......................................   Passed    3.40 sec
            Start  7887: mpi/collective_min_array_in_place.mpirun=4.release
11015/11561 Test  #7948: mpi/count_dofs_per_block_01.mpirun=10.debug ............................................   Passed   24.62 sec
            Start  7952: mpi/count_dofs_per_block_02.mpirun=10.debug
11016/11561 Test  #7887: mpi/collective_min_array_in_place.mpirun=4.release .....................................   Passed    3.00 sec
            Start  7892: mpi/collective_min_vector.mpirun=4.debug
11017/11561 Test  #7892: mpi/collective_min_vector.mpirun=4.debug ...............................................   Passed    3.04 sec
            Start  7893: mpi/collective_min_vector.mpirun=4.release
11018/11561 Test  #7893: mpi/collective_min_vector.mpirun=4.release .............................................   Passed    2.86 sec
            Start  7898: mpi/collective_min_vector_in_place.mpirun=4.debug
11019/11561 Test  #7898: mpi/collective_min_vector_in_place.mpirun=4.debug ......................................   Passed    2.94 sec
            Start  7899: mpi/collective_min_vector_in_place.mpirun=4.release
11020/11561 Test  #7899: mpi/collective_min_vector_in_place.mpirun=4.release ....................................   Passed    2.95 sec
            Start  7908: mpi/collective_tensor.mpirun=4.debug
11021/11561 Test  #7949: mpi/count_dofs_per_block_01.mpirun=10.release ..........................................   Passed   19.84 sec
            Start  7953: mpi/count_dofs_per_block_02.mpirun=10.release
11022/11561 Test  #7908: mpi/collective_tensor.mpirun=4.debug ...................................................   Passed    3.11 sec
            Start  7909: mpi/collective_tensor.mpirun=4.release
11023/11561 Test  #7909: mpi/collective_tensor.mpirun=4.release .................................................   Passed    3.00 sec
            Start  7934: mpi/compute_mean_value.mpirun=4.debug
11024/11561 Test  #7952: mpi/count_dofs_per_block_02.mpirun=10.debug ............................................   Passed   23.76 sec
            Start  7956: mpi/count_dofs_per_component_01.mpirun=10.debug
11025/11561 Test  #7934: mpi/compute_mean_value.mpirun=4.debug ..................................................   Passed    4.10 sec
            Start  7935: mpi/compute_mean_value.mpirun=4.release
11026/11561 Test  #7935: mpi/compute_mean_value.mpirun=4.release ................................................   Passed    2.97 sec
            Start  7943: mpi/constraint_matrix_trilinos_bug.mpirun=4.debug
11027/11561 Test  #7943: mpi/constraint_matrix_trilinos_bug.mpirun=4.debug ......................................   Passed    3.30 sec
            Start  7950: mpi/count_dofs_per_block_01.mpirun=4.debug
11028/11561 Test  #7950: mpi/count_dofs_per_block_01.mpirun=4.debug .............................................   Passed    5.54 sec
            Start  7951: mpi/count_dofs_per_block_01.mpirun=4.release
11029/11561 Test  #7953: mpi/count_dofs_per_block_02.mpirun=10.release ..........................................   Passed   22.60 sec
            Start  7957: mpi/count_dofs_per_component_01.mpirun=10.release
11030/11561 Test  #7951: mpi/count_dofs_per_block_01.mpirun=4.release ...........................................   Passed    3.20 sec
            Start  7954: mpi/count_dofs_per_block_02.mpirun=4.debug
11031/11561 Test  #7954: mpi/count_dofs_per_block_02.mpirun=4.debug .............................................   Passed    4.27 sec
            Start  7955: mpi/count_dofs_per_block_02.mpirun=4.release
11032/11561 Test  #7955: mpi/count_dofs_per_block_02.mpirun=4.release ...........................................   Passed    3.15 sec
11033/11561 Test  #7956: mpi/count_dofs_per_component_01.mpirun=10.debug ........................................   Passed   26.27 sec
            Start  7960: mpi/crash_01.mpirun=10.debug
            Start  7958: mpi/count_dofs_per_component_01.mpirun=4.debug
11034/11561 Test  #7958: mpi/count_dofs_per_component_01.mpirun=4.debug .........................................   Passed    3.12 sec
11035/11561 Test  #7957: mpi/count_dofs_per_component_01.mpirun=10.release ......................................   Passed   21.14 sec
            Start  7961: mpi/crash_01.mpirun=10.release
            Start  7959: mpi/count_dofs_per_component_01.mpirun=4.release
11036/11561 Test  #7959: mpi/count_dofs_per_component_01.mpirun=4.release .......................................   Passed    2.88 sec
11037/11561 Test  #7960: mpi/crash_01.mpirun=10.debug ...........................................................   Passed   19.88 sec
            Start  7966: mpi/crash_03.mpirun=10.debug
            Start  7962: mpi/crash_01.mpirun=4.debug
11038/11561 Test  #7962: mpi/crash_01.mpirun=4.debug ............................................................   Passed    3.10 sec
11039/11561 Test  #7961: mpi/crash_01.mpirun=10.release .........................................................   Passed   18.51 sec
            Start  7967: mpi/crash_03.mpirun=10.release
            Start  7963: mpi/crash_01.mpirun=4.release
11040/11561 Test  #7963: mpi/crash_01.mpirun=4.release ..........................................................   Passed    2.99 sec
11041/11561 Test  #7966: mpi/crash_03.mpirun=10.debug ...........................................................   Passed   18.77 sec
            Start  8007: mpi/distribute_sp_01.mpirun=10.debug
            Start  7968: mpi/crash_03.mpirun=4.debug
11042/11561 Test  #7968: mpi/crash_03.mpirun=4.debug ............................................................   Passed    3.09 sec
11043/11561 Test  #7967: mpi/crash_03.mpirun=10.release .........................................................   Passed   15.27 sec
            Start  8008: mpi/distribute_sp_01.mpirun=10.release
            Start  7969: mpi/crash_03.mpirun=4.release
11044/11561 Test  #7969: mpi/crash_03.mpirun=4.release ..........................................................   Passed    3.02 sec
11045/11561 Test  #8007: mpi/distribute_sp_01.mpirun=10.debug ...................................................   Passed   14.11 sec
            Start  8011: mpi/distribute_sp_02.mpirun=10.debug
            Start  8009: mpi/distribute_sp_01.mpirun=4.debug
11046/11561 Test  #8009: mpi/distribute_sp_01.mpirun=4.debug ....................................................   Passed    3.08 sec
11047/11561 Test  #8008: mpi/distribute_sp_01.mpirun=10.release .................................................   Passed   12.69 sec
            Start  8012: mpi/distribute_sp_02.mpirun=10.release
            Start  8010: mpi/distribute_sp_01.mpirun=4.release
11048/11561 Test  #8010: mpi/distribute_sp_01.mpirun=4.release ..................................................   Passed    2.93 sec
11049/11561 Test  #8011: mpi/distribute_sp_02.mpirun=10.debug ...................................................   Passed   14.36 sec
            Start  8015: mpi/dof_handler_number_cache.mpirun=10.debug
            Start  8013: mpi/distribute_sp_02.mpirun=4.debug
11050/11561 Test  #8012: mpi/distribute_sp_02.mpirun=10.release .................................................   Passed   13.49 sec
            Start  8016: mpi/dof_handler_number_cache.mpirun=10.release
11051/11561 Test  #8013: mpi/distribute_sp_02.mpirun=4.debug ....................................................   Passed    3.15 sec
            Start  8014: mpi/distribute_sp_02.mpirun=4.release
11052/11561 Test  #8014: mpi/distribute_sp_02.mpirun=4.release ..................................................   Passed    2.94 sec
11053/11561 Test  #8015: mpi/dof_handler_number_cache.mpirun=10.debug ...........................................   Passed   29.11 sec
            Start  8027: mpi/extract_boundary_dofs.mpirun=10.debug
            Start  8017: mpi/dof_handler_number_cache.mpirun=4.debug
11054/11561 Test  #8016: mpi/dof_handler_number_cache.mpirun=10.release .........................................   Passed   26.42 sec
            Start  8028: mpi/extract_boundary_dofs.mpirun=10.release
11055/11561 Test  #8017: mpi/dof_handler_number_cache.mpirun=4.debug ............................................   Passed    4.19 sec
            Start  8018: mpi/dof_handler_number_cache.mpirun=4.release
11056/11561 Test  #8018: mpi/dof_handler_number_cache.mpirun=4.release ..........................................   Passed    3.32 sec
11057/11561 Test  #8028: mpi/extract_boundary_dofs.mpirun=10.release ............................................   Passed   19.24 sec
            Start  8031: mpi/extract_constant_modes_01.mpirun=10.debug
            Start  8030: mpi/extract_boundary_dofs.mpirun=4.release
11058/11561 Test  #8030: mpi/extract_boundary_dofs.mpirun=4.release .............................................   Passed    4.08 sec
11059/11561 Test  #8027: mpi/extract_boundary_dofs.mpirun=10.debug ..............................................   Passed   23.36 sec
            Start  8032: mpi/extract_constant_modes_01.mpirun=10.release
            Start  8029: mpi/extract_boundary_dofs.mpirun=4.debug
11060/11561 Test  #8029: mpi/extract_boundary_dofs.mpirun=4.debug ...............................................   Passed    3.68 sec
11061/11561 Test  #8031: mpi/extract_constant_modes_01.mpirun=10.debug ..........................................   Passed   20.03 sec
            Start  8037: mpi/extract_locally_active_dofs.mpirun=10.debug
            Start  8033: mpi/extract_constant_modes_01.mpirun=4.debug
11062/11561 Test  #8032: mpi/extract_constant_modes_01.mpirun=10.release ........................................   Passed   18.16 sec
            Start  8038: mpi/extract_locally_active_dofs.mpirun=10.release
11063/11561 Test  #8033: mpi/extract_constant_modes_01.mpirun=4.debug ...........................................   Passed    3.11 sec
            Start  8034: mpi/extract_constant_modes_01.mpirun=4.release
11064/11561 Test  #8034: mpi/extract_constant_modes_01.mpirun=4.release .........................................   Passed    2.94 sec
11065/11561 Test  #8038: mpi/extract_locally_active_dofs.mpirun=10.release ......................................   Passed   20.70 sec
            Start  8041: mpi/extract_locally_active_level_dofs.mpirun=10.debug
            Start  8040: mpi/extract_locally_active_dofs.mpirun=4.release
11066/11561 Test  #8037: mpi/extract_locally_active_dofs.mpirun=10.debug ........................................   Passed   23.41 sec
            Start  8042: mpi/extract_locally_active_level_dofs.mpirun=10.release
11067/11561 Test  #8040: mpi/extract_locally_active_dofs.mpirun=4.release .......................................   Passed    3.07 sec
            Start  8039: mpi/extract_locally_active_dofs.mpirun=4.debug
11068/11561 Test  #8039: mpi/extract_locally_active_dofs.mpirun=4.debug .........................................   Passed    3.57 sec
11069/11561 Test  #8042: mpi/extract_locally_active_level_dofs.mpirun=10.release ................................   Passed   18.99 sec
            Start  8045: mpi/fe_field_function_01.mpirun=10.debug
            Start  8044: mpi/extract_locally_active_level_dofs.mpirun=4.release
11070/11561 Test  #8041: mpi/extract_locally_active_level_dofs.mpirun=10.debug ..................................   Passed   22.66 sec
            Start  8046: mpi/fe_field_function_01.mpirun=10.release
11071/11561 Test  #8044: mpi/extract_locally_active_level_dofs.mpirun=4.release .................................   Passed    3.24 sec
            Start  8043: mpi/extract_locally_active_level_dofs.mpirun=4.debug
11072/11561 Test  #8043: mpi/extract_locally_active_level_dofs.mpirun=4.debug ...................................   Passed    4.07 sec
11073/11561 Test  #8046: mpi/fe_field_function_01.mpirun=10.release .............................................   Passed   28.86 sec
            Start  8059: mpi/fe_tools_extrapolate_03.mpirun=10.debug
            Start  8048: mpi/fe_field_function_01.mpirun=4.release
11074/11561 Test  #8048: mpi/fe_field_function_01.mpirun=4.release ..............................................   Passed    5.39 sec
11075/11561 Test  #8045: mpi/fe_field_function_01.mpirun=10.debug ...............................................   Passed   56.59 sec
            Start  8060: mpi/fe_tools_extrapolate_03.mpirun=10.release
            Start  8047: mpi/fe_field_function_01.mpirun=4.debug
11076/11561 Test  #8059: mpi/fe_tools_extrapolate_03.mpirun=10.debug ............................................   Passed   27.16 sec
            Start  8121: mpi/hp_integrate_difference.mpirun=10.debug
11077/11561 Test  #8060: mpi/fe_tools_extrapolate_03.mpirun=10.release ..........................................   Passed    4.18 sec
            Start  8122: mpi/hp_integrate_difference.mpirun=10.release
11078/11561 Test  #8047: mpi/fe_field_function_01.mpirun=4.debug ................................................   Passed   19.64 sec
            Start  8061: mpi/fe_tools_extrapolate_03.mpirun=3.debug
            Start  8062: mpi/fe_tools_extrapolate_03.mpirun=3.release
11079/11561 Test  #8062: mpi/fe_tools_extrapolate_03.mpirun=3.release ...........................................***Failed    3.07 sec
11080/11561 Test  #8061: mpi/fe_tools_extrapolate_03.mpirun=3.debug .............................................***Failed    3.46 sec
11081/11561 Test  #8122: mpi/hp_integrate_difference.mpirun=10.release ..........................................   Passed   24.77 sec
            Start  8183: mpi/integrate_difference.mpirun=10.debug
            Start  8124: mpi/hp_integrate_difference.mpirun=4.release
11082/11561 Test  #8124: mpi/hp_integrate_difference.mpirun=4.release ...........................................   Passed    3.27 sec
11083/11561 Test  #8121: mpi/hp_integrate_difference.mpirun=10.debug ............................................   Passed   30.73 sec
            Start  8184: mpi/integrate_difference.mpirun=10.release
            Start  8123: mpi/hp_integrate_difference.mpirun=4.debug
11084/11561 Test  #8123: mpi/hp_integrate_difference.mpirun=4.debug .............................................   Passed    4.31 sec
11085/11561 Test  #8183: mpi/integrate_difference.mpirun=10.debug ...............................................   Passed   28.17 sec
            Start  8187: mpi/interpolate_01.mpirun=10.debug
            Start  8185: mpi/integrate_difference.mpirun=4.debug
11086/11561 Test  #8184: mpi/integrate_difference.mpirun=10.release .............................................   Passed   23.99 sec
            Start  8188: mpi/interpolate_01.mpirun=10.release
11087/11561 Test  #8185: mpi/integrate_difference.mpirun=4.debug ................................................   Passed    3.55 sec
            Start  8186: mpi/integrate_difference.mpirun=4.release
11088/11561 Test  #8186: mpi/integrate_difference.mpirun=4.release ..............................................   Passed    2.95 sec
11089/11561 Test  #8188: mpi/interpolate_01.mpirun=10.release ...................................................   Passed   24.55 sec
            Start  8191: mpi/interpolate_03.mpirun=10.debug
            Start  8190: mpi/interpolate_01.mpirun=4.release
11090/11561 Test  #8187: mpi/interpolate_01.mpirun=10.debug .....................................................   Passed   26.86 sec
            Start  8192: mpi/interpolate_03.mpirun=10.release
11091/11561 Test  #8190: mpi/interpolate_01.mpirun=4.release ....................................................   Passed    3.06 sec
            Start  8189: mpi/interpolate_01.mpirun=4.debug
11092/11561 Test  #8189: mpi/interpolate_01.mpirun=4.debug ......................................................   Passed    3.46 sec
11093/11561 Test  #8192: mpi/interpolate_03.mpirun=10.release ...................................................   Passed   20.13 sec
            Start  8201: mpi/is_locally_owned.mpirun=10.debug
            Start  8194: mpi/interpolate_03.mpirun=4.release
11094/11561 Test  #8191: mpi/interpolate_03.mpirun=10.debug .....................................................   Passed   24.90 sec
            Start  8202: mpi/is_locally_owned.mpirun=10.release
11095/11561 Test  #8194: mpi/interpolate_03.mpirun=4.release ....................................................   Passed    3.45 sec
            Start  8193: mpi/interpolate_03.mpirun=4.debug
11096/11561 Test  #8193: mpi/interpolate_03.mpirun=4.debug ......................................................   Passed    3.14 sec
11097/11561 Test  #8202: mpi/is_locally_owned.mpirun=10.release .................................................   Passed   19.39 sec
            Start  8227: mpi/make_zero_boundary_values.mpirun=10.debug
            Start  8204: mpi/is_locally_owned.mpirun=4.release
11098/11561 Test  #8201: mpi/is_locally_owned.mpirun=10.debug ...................................................   Passed   22.09 sec
            Start  8228: mpi/make_zero_boundary_values.mpirun=10.release
11099/11561 Test  #8204: mpi/is_locally_owned.mpirun=4.release ..................................................   Passed    2.94 sec
            Start  8203: mpi/is_locally_owned.mpirun=4.debug
11100/11561 Test  #8203: mpi/is_locally_owned.mpirun=4.debug ....................................................   Passed    3.13 sec
11101/11561 Test  #8228: mpi/make_zero_boundary_values.mpirun=10.release ........................................   Passed   19.23 sec
            Start  8231: mpi/map_dofs_to_support_points.mpirun=10.debug
            Start  8230: mpi/make_zero_boundary_values.mpirun=4.release
11102/11561 Test  #8227: mpi/make_zero_boundary_values.mpirun=10.debug ..........................................   Passed   22.06 sec
            Start  8232: mpi/map_dofs_to_support_points.mpirun=10.release
11103/11561 Test  #8230: mpi/make_zero_boundary_values.mpirun=4.release .........................................   Passed    3.29 sec
            Start  8229: mpi/make_zero_boundary_values.mpirun=4.debug
11104/11561 Test  #8229: mpi/make_zero_boundary_values.mpirun=4.debug ...........................................   Passed    3.73 sec
11105/11561 Test  #8231: mpi/map_dofs_to_support_points.mpirun=10.debug .........................................   Passed   22.20 sec
            Start  8253: mpi/mg_01.mpirun=10.debug
            Start  8233: mpi/map_dofs_to_support_points.mpirun=4.debug
11106/11561 Test  #8232: mpi/map_dofs_to_support_points.mpirun=10.release .......................................   Passed   19.85 sec
            Start  8254: mpi/mg_01.mpirun=10.release
11107/11561 Test  #8233: mpi/map_dofs_to_support_points.mpirun=4.debug ..........................................   Passed    3.13 sec
            Start  8234: mpi/map_dofs_to_support_points.mpirun=4.release
11108/11561 Test  #8234: mpi/map_dofs_to_support_points.mpirun=4.release ........................................   Passed    2.93 sec
11109/11561 Test  #8254: mpi/mg_01.mpirun=10.release ............................................................   Passed   15.24 sec
            Start  8257: mpi/mg_02.mpirun=10.debug
            Start  8256: mpi/mg_01.mpirun=4.release
11110/11561 Test  #8253: mpi/mg_01.mpirun=10.debug ..............................................................   Passed   17.89 sec
            Start  8258: mpi/mg_02.mpirun=10.release
11111/11561 Test  #8256: mpi/mg_01.mpirun=4.release .............................................................   Passed    3.03 sec
            Start  8255: mpi/mg_01.mpirun=4.debug
11112/11561 Test  #8255: mpi/mg_01.mpirun=4.debug ...............................................................   Passed    3.19 sec
11113/11561 Test  #8258: mpi/mg_02.mpirun=10.release ............................................................   Passed   25.01 sec
            Start  8263: mpi/mg_03.mpirun=10.debug
            Start  8260: mpi/mg_02.mpirun=4.release
11114/11561 Test  #8257: mpi/mg_02.mpirun=10.debug ..............................................................   Passed   27.25 sec
            Start  8264: mpi/mg_03.mpirun=10.release
11115/11561 Test  #8260: mpi/mg_02.mpirun=4.release .............................................................   Passed    3.25 sec
            Start  8259: mpi/mg_02.mpirun=4.debug
11116/11561 Test  #8264: mpi/mg_03.mpirun=10.release ............................................................   Passed    3.73 sec
            Start  8333: mpi/p4est_2d_coarse_01.mpirun=10.debug
11117/11561 Test  #8263: mpi/mg_03.mpirun=10.debug ..............................................................   Passed    3.94 sec
            Start  8334: mpi/p4est_2d_coarse_01.mpirun=10.release
11118/11561 Test  #8259: mpi/mg_02.mpirun=4.debug ...............................................................   Passed    3.29 sec
            Start  8265: mpi/mg_03.mpirun=4.debug
11119/11561 Test  #8265: mpi/mg_03.mpirun=4.debug ...............................................................   Passed    3.06 sec
            Start  8266: mpi/mg_03.mpirun=4.release
11120/11561 Test  #8266: mpi/mg_03.mpirun=4.release .............................................................   Passed    2.83 sec
11121/11561 Test  #8334: mpi/p4est_2d_coarse_01.mpirun=10.release ...............................................   Passed   19.01 sec
            Start  8337: mpi/p4est_2d_constraintmatrix_01.mpirun=10.debug
            Start  8336: mpi/p4est_2d_coarse_01.mpirun=4.release
11122/11561 Test  #8336: mpi/p4est_2d_coarse_01.mpirun=4.release ................................................   Passed    4.23 sec
11123/11561 Test  #8333: mpi/p4est_2d_coarse_01.mpirun=10.debug .................................................   Passed   36.34 sec
            Start  8338: mpi/p4est_2d_constraintmatrix_01.mpirun=10.release
            Start  8335: mpi/p4est_2d_coarse_01.mpirun=4.debug
11124/11561 Test  #8337: mpi/p4est_2d_constraintmatrix_01.mpirun=10.debug .......................................   Passed   23.33 sec
            Start  8341: mpi/p4est_2d_constraintmatrix_02.mpirun=10.debug
11125/11561 Test  #8335: mpi/p4est_2d_coarse_01.mpirun=4.debug ..................................................   Passed   14.25 sec
            Start  8339: mpi/p4est_2d_constraintmatrix_01.mpirun=4.debug
11126/11561 Test  #8339: mpi/p4est_2d_constraintmatrix_01.mpirun=4.debug ........................................   Passed    2.89 sec
11127/11561 Test  #8338: mpi/p4est_2d_constraintmatrix_01.mpirun=10.release .....................................   Passed   17.65 sec
            Start  8342: mpi/p4est_2d_constraintmatrix_02.mpirun=10.release
            Start  8340: mpi/p4est_2d_constraintmatrix_01.mpirun=4.release
11128/11561 Test  #8340: mpi/p4est_2d_constraintmatrix_01.mpirun=4.release ......................................   Passed    2.92 sec
11129/11561 Test  #8341: mpi/p4est_2d_constraintmatrix_02.mpirun=10.debug .......................................   Passed   20.65 sec
            Start  8345: mpi/p4est_2d_constraintmatrix_03.mpirun=10.debug
            Start  8343: mpi/p4est_2d_constraintmatrix_02.mpirun=4.debug
11130/11561 Test  #8343: mpi/p4est_2d_constraintmatrix_02.mpirun=4.debug ........................................   Passed    3.25 sec
11131/11561 Test  #8342: mpi/p4est_2d_constraintmatrix_02.mpirun=10.release .....................................   Passed   18.27 sec
            Start  8346: mpi/p4est_2d_constraintmatrix_03.mpirun=10.release
            Start  8344: mpi/p4est_2d_constraintmatrix_02.mpirun=4.release
11132/11561 Test  #8344: mpi/p4est_2d_constraintmatrix_02.mpirun=4.release ......................................   Passed    3.02 sec
11133/11561 Test  #8345: mpi/p4est_2d_constraintmatrix_03.mpirun=10.debug .......................................   Passed   30.22 sec
            Start  8349: mpi/p4est_2d_constraintmatrix_04.mpirun=10.debug
            Start  8347: mpi/p4est_2d_constraintmatrix_03.mpirun=4.debug
11134/11561 Test  #8346: mpi/p4est_2d_constraintmatrix_03.mpirun=10.release .....................................   Passed   24.78 sec
            Start  8350: mpi/p4est_2d_constraintmatrix_04.mpirun=10.release
11135/11561 Test  #8347: mpi/p4est_2d_constraintmatrix_03.mpirun=4.debug ........................................   Passed    3.83 sec
            Start  8348: mpi/p4est_2d_constraintmatrix_03.mpirun=4.release
11136/11561 Test  #8348: mpi/p4est_2d_constraintmatrix_03.mpirun=4.release ......................................   Passed    3.14 sec
11137/11561 Test  #8349: mpi/p4est_2d_constraintmatrix_04.mpirun=10.debug .......................................   Passed   26.17 sec
            Start  8355: mpi/p4est_2d_dofhandler_01.mpirun=10.debug
            Start  8351: mpi/p4est_2d_constraintmatrix_04.mpirun=4.debug
11138/11561 Test  #8350: mpi/p4est_2d_constraintmatrix_04.mpirun=10.release .....................................   Passed   22.79 sec
            Start  8356: mpi/p4est_2d_dofhandler_01.mpirun=10.release
11139/11561 Test  #8351: mpi/p4est_2d_constraintmatrix_04.mpirun=4.debug ........................................   Passed    5.15 sec
            Start  8352: mpi/p4est_2d_constraintmatrix_04.mpirun=4.release
11140/11561 Test  #8352: mpi/p4est_2d_constraintmatrix_04.mpirun=4.release ......................................   Passed    2.92 sec
11141/11561 Test  #8356: mpi/p4est_2d_dofhandler_01.mpirun=10.release ...........................................   Passed   18.36 sec
            Start  8359: mpi/p4est_2d_dofhandler_02.mpirun=10.debug
            Start  8358: mpi/p4est_2d_dofhandler_01.mpirun=4.release
11142/11561 Test  #8358: mpi/p4est_2d_dofhandler_01.mpirun=4.release ............................................   Passed    3.01 sec
11143/11561 Test  #8355: mpi/p4est_2d_dofhandler_01.mpirun=10.debug .............................................   Passed   22.82 sec
            Start  8360: mpi/p4est_2d_dofhandler_02.mpirun=10.release
            Start  8357: mpi/p4est_2d_dofhandler_01.mpirun=4.debug
11144/11561 Test  #8357: mpi/p4est_2d_dofhandler_01.mpirun=4.debug ..............................................   Passed    3.16 sec
11145/11561 Test  #8360: mpi/p4est_2d_dofhandler_02.mpirun=10.release ...........................................   Passed   18.17 sec
            Start  8363: mpi/p4est_2d_dofhandler_03.mpirun=10.debug
            Start  8362: mpi/p4est_2d_dofhandler_02.mpirun=4.release
11146/11561 Test  #8362: mpi/p4est_2d_dofhandler_02.mpirun=4.release ............................................   Passed    3.20 sec
11147/11561 Test  #8359: mpi/p4est_2d_dofhandler_02.mpirun=10.debug .............................................   Passed   26.48 sec
            Start  8364: mpi/p4est_2d_dofhandler_03.mpirun=10.release
            Start  8361: mpi/p4est_2d_dofhandler_02.mpirun=4.debug
11148/11561 Test  #8361: mpi/p4est_2d_dofhandler_02.mpirun=4.debug ..............................................   Passed    5.29 sec
11149/11561 Test  #8364: mpi/p4est_2d_dofhandler_03.mpirun=10.release ...........................................   Passed   19.11 sec
            Start  8367: mpi/p4est_2d_dofhandler_04.mpirun=10.debug
            Start  8366: mpi/p4est_2d_dofhandler_03.mpirun=4.release
11150/11561 Test  #8366: mpi/p4est_2d_dofhandler_03.mpirun=4.release ............................................   Passed    3.31 sec
11151/11561 Test  #8363: mpi/p4est_2d_dofhandler_03.mpirun=10.debug .............................................   Passed   27.13 sec
            Start  8368: mpi/p4est_2d_dofhandler_04.mpirun=10.release
            Start  8365: mpi/p4est_2d_dofhandler_03.mpirun=4.debug
11152/11561 Test  #8365: mpi/p4est_2d_dofhandler_03.mpirun=4.debug ..............................................   Passed    6.34 sec
11153/11561 Test  #8368: mpi/p4est_2d_dofhandler_04.mpirun=10.release ...........................................   Passed   19.80 sec
            Start  8371: mpi/p4est_2d_dofhandler_05.mpirun=10.debug
            Start  8370: mpi/p4est_2d_dofhandler_04.mpirun=4.release
11154/11561 Test  #8370: mpi/p4est_2d_dofhandler_04.mpirun=4.release ............................................   Passed    3.43 sec
11155/11561 Test  #8367: mpi/p4est_2d_dofhandler_04.mpirun=10.debug .............................................   Passed   28.37 sec
            Start  8372: mpi/p4est_2d_dofhandler_05.mpirun=10.release
            Start  8369: mpi/p4est_2d_dofhandler_04.mpirun=4.debug
11156/11561 Test  #8369: mpi/p4est_2d_dofhandler_04.mpirun=4.debug ..............................................   Passed    5.24 sec
11157/11561 Test  #8371: mpi/p4est_2d_dofhandler_05.mpirun=10.debug .............................................   Passed   20.17 sec
            Start  8375: mpi/p4est_2d_ghost_01.mpirun=10.debug
            Start  8373: mpi/p4est_2d_dofhandler_05.mpirun=4.debug
11158/11561 Test  #8372: mpi/p4est_2d_dofhandler_05.mpirun=10.release ...........................................   Passed   17.51 sec
            Start  8376: mpi/p4est_2d_ghost_01.mpirun=10.release
11159/11561 Test  #8373: mpi/p4est_2d_dofhandler_05.mpirun=4.debug ..............................................   Passed    3.13 sec
            Start  8374: mpi/p4est_2d_dofhandler_05.mpirun=4.release
11160/11561 Test  #8374: mpi/p4est_2d_dofhandler_05.mpirun=4.release ............................................   Passed    2.86 sec
11161/11561 Test  #8376: mpi/p4est_2d_ghost_01.mpirun=10.release ................................................   Passed   18.60 sec
            Start  8379: mpi/p4est_2d_ghost_02.mpirun=10.debug
            Start  8378: mpi/p4est_2d_ghost_01.mpirun=4.release
11162/11561 Test  #8375: mpi/p4est_2d_ghost_01.mpirun=10.debug ..................................................   Passed   22.16 sec
            Start  8380: mpi/p4est_2d_ghost_02.mpirun=10.release
11163/11561 Test  #8378: mpi/p4est_2d_ghost_01.mpirun=4.release .................................................   Passed    3.17 sec
            Start  8377: mpi/p4est_2d_ghost_01.mpirun=4.debug
11164/11561 Test  #8377: mpi/p4est_2d_ghost_01.mpirun=4.debug ...................................................   Passed    3.10 sec
11165/11561 Test  #8380: mpi/p4est_2d_ghost_02.mpirun=10.release ................................................   Passed   19.37 sec
            Start  8383: mpi/p4est_2d_refine_01.mpirun=10.debug
            Start  8382: mpi/p4est_2d_ghost_02.mpirun=4.release
11166/11561 Test  #8379: mpi/p4est_2d_ghost_02.mpirun=10.debug ..................................................   Passed   22.36 sec
            Start  8384: mpi/p4est_2d_refine_01.mpirun=10.release
11167/11561 Test  #8382: mpi/p4est_2d_ghost_02.mpirun=4.release .................................................   Passed    3.26 sec
            Start  8381: mpi/p4est_2d_ghost_02.mpirun=4.debug
11168/11561 Test  #8381: mpi/p4est_2d_ghost_02.mpirun=4.debug ...................................................   Passed    3.34 sec
11169/11561 Test  #8384: mpi/p4est_2d_refine_01.mpirun=10.release ...............................................   Passed   18.16 sec
            Start  8387: mpi/p4est_2d_refine_02.mpirun=10.debug
            Start  8386: mpi/p4est_2d_refine_01.mpirun=4.release
11170/11561 Test  #8383: mpi/p4est_2d_refine_01.mpirun=10.debug .................................................   Passed   22.31 sec
            Start  8388: mpi/p4est_2d_refine_02.mpirun=10.release
11171/11561 Test  #8386: mpi/p4est_2d_refine_01.mpirun=4.release ................................................   Passed    3.14 sec
            Start  8385: mpi/p4est_2d_refine_01.mpirun=4.debug
11172/11561 Test  #8385: mpi/p4est_2d_refine_01.mpirun=4.debug ..................................................   Passed    3.02 sec
11173/11561 Test  #8388: mpi/p4est_2d_refine_02.mpirun=10.release ...............................................   Passed   18.77 sec
            Start  8391: mpi/p4est_2d_refine_03.mpirun=10.debug
            Start  8390: mpi/p4est_2d_refine_02.mpirun=4.release
11174/11561 Test  #8387: mpi/p4est_2d_refine_02.mpirun=10.debug .................................................   Passed   23.20 sec
            Start  8392: mpi/p4est_2d_refine_03.mpirun=10.release
11175/11561 Test  #8390: mpi/p4est_2d_refine_02.mpirun=4.release ................................................   Passed    3.06 sec
            Start  8389: mpi/p4est_2d_refine_02.mpirun=4.debug
11176/11561 Test  #8389: mpi/p4est_2d_refine_02.mpirun=4.debug ..................................................   Passed    3.10 sec
11177/11561 Test  #8392: mpi/p4est_2d_refine_03.mpirun=10.release ...............................................   Passed   18.54 sec
            Start  8395: mpi/p4est_2d_renumber_01.mpirun=10.debug
            Start  8394: mpi/p4est_2d_refine_03.mpirun=4.release
11178/11561 Test  #8391: mpi/p4est_2d_refine_03.mpirun=10.debug .................................................   Passed   22.54 sec
            Start  8396: mpi/p4est_2d_renumber_01.mpirun=10.release
11179/11561 Test  #8394: mpi/p4est_2d_refine_03.mpirun=4.release ................................................   Passed    3.11 sec
            Start  8393: mpi/p4est_2d_refine_03.mpirun=4.debug
11180/11561 Test  #8393: mpi/p4est_2d_refine_03.mpirun=4.debug ..................................................   Passed    4.70 sec
11181/11561 Test  #8395: mpi/p4est_2d_renumber_01.mpirun=10.debug ...............................................   Passed   22.95 sec
            Start  8399: mpi/p4est_2d_renumber_02.mpirun=10.debug
            Start  8397: mpi/p4est_2d_renumber_01.mpirun=4.debug
11182/11561 Test  #8396: mpi/p4est_2d_renumber_01.mpirun=10.release .............................................   Passed   21.42 sec
            Start  8400: mpi/p4est_2d_renumber_02.mpirun=10.release
11183/11561 Test  #8397: mpi/p4est_2d_renumber_01.mpirun=4.debug ................................................   Passed    3.27 sec
            Start  8398: mpi/p4est_2d_renumber_01.mpirun=4.release
11184/11561 Test  #8398: mpi/p4est_2d_renumber_01.mpirun=4.release ..............................................   Passed    2.97 sec
11185/11561 Test  #8400: mpi/p4est_2d_renumber_02.mpirun=10.release .............................................   Passed   22.83 sec
            Start  8403: mpi/p4est_2d_simple.mpirun=10.debug
            Start  8402: mpi/p4est_2d_renumber_02.mpirun=4.release
11186/11561 Test  #8399: mpi/p4est_2d_renumber_02.mpirun=10.debug ...............................................   Passed   25.29 sec
            Start  8404: mpi/p4est_2d_simple.mpirun=10.release
11187/11561 Test  #8402: mpi/p4est_2d_renumber_02.mpirun=4.release ..............................................   Passed    3.04 sec
            Start  8401: mpi/p4est_2d_renumber_02.mpirun=4.debug
11188/11561 Test  #8401: mpi/p4est_2d_renumber_02.mpirun=4.debug ................................................   Passed    3.13 sec
11189/11561 Test  #8404: mpi/p4est_2d_simple.mpirun=10.release ..................................................   Passed   13.80 sec
            Start  8407: mpi/p4est_3d_constraintmatrix_01.mpirun=10.debug
            Start  8406: mpi/p4est_2d_simple.mpirun=4.release
11190/11561 Test  #8403: mpi/p4est_2d_simple.mpirun=10.debug ....................................................   Passed   16.38 sec
            Start  8408: mpi/p4est_3d_constraintmatrix_01.mpirun=10.release
11191/11561 Test  #8406: mpi/p4est_2d_simple.mpirun=4.release ...................................................   Passed    2.97 sec
            Start  8405: mpi/p4est_2d_simple.mpirun=4.debug
11192/11561 Test  #8405: mpi/p4est_2d_simple.mpirun=4.debug .....................................................   Passed    3.02 sec
11193/11561 Test  #8408: mpi/p4est_3d_constraintmatrix_01.mpirun=10.release .....................................   Passed   17.66 sec
            Start  8411: mpi/p4est_3d_constraintmatrix_02.mpirun=10.debug
            Start  8410: mpi/p4est_3d_constraintmatrix_01.mpirun=4.release
11194/11561 Test  #8410: mpi/p4est_3d_constraintmatrix_01.mpirun=4.release ......................................   Passed    3.59 sec
11195/11561 Test  #8407: mpi/p4est_3d_constraintmatrix_01.mpirun=10.debug .......................................   Passed   23.34 sec
            Start  8412: mpi/p4est_3d_constraintmatrix_02.mpirun=10.release
            Start  8409: mpi/p4est_3d_constraintmatrix_01.mpirun=4.debug
11196/11561 Test  #8409: mpi/p4est_3d_constraintmatrix_01.mpirun=4.debug ........................................   Passed    4.85 sec
11197/11561 Test  #8411: mpi/p4est_3d_constraintmatrix_02.mpirun=10.debug .......................................   Passed   21.31 sec
            Start  8415: mpi/p4est_3d_constraintmatrix_03.mpirun=10.debug
            Start  8413: mpi/p4est_3d_constraintmatrix_02.mpirun=4.debug
11198/11561 Test  #8412: mpi/p4est_3d_constraintmatrix_02.mpirun=10.release .....................................   Passed   19.52 sec
            Start  8416: mpi/p4est_3d_constraintmatrix_03.mpirun=10.release
11199/11561 Test  #8413: mpi/p4est_3d_constraintmatrix_02.mpirun=4.debug ........................................   Passed    3.35 sec
            Start  8414: mpi/p4est_3d_constraintmatrix_02.mpirun=4.release
11200/11561 Test  #8414: mpi/p4est_3d_constraintmatrix_02.mpirun=4.release ......................................   Passed    3.03 sec
11201/11561 Test  #8416: mpi/p4est_3d_constraintmatrix_03.mpirun=10.release .....................................   Passed   29.09 sec
            Start  8421: mpi/p4est_3d_ghost_01.mpirun=10.debug
            Start  8418: mpi/p4est_3d_constraintmatrix_03.mpirun=4.release
11202/11561 Test  #8418: mpi/p4est_3d_constraintmatrix_03.mpirun=4.release ......................................   Passed    5.10 sec
11203/11561 Test  #8421: mpi/p4est_3d_ghost_01.mpirun=10.debug ..................................................   Passed   28.07 sec
            Start  8422: mpi/p4est_3d_ghost_01.mpirun=10.release
            Start  8423: mpi/p4est_3d_ghost_01.mpirun=4.debug
11204/11561 Test  #8415: mpi/p4est_3d_constraintmatrix_03.mpirun=10.debug .......................................   Passed   60.27 sec
            Start  8425: mpi/p4est_3d_refine_01.mpirun=10.debug
11205/11561 Test  #8423: mpi/p4est_3d_ghost_01.mpirun=4.debug ...................................................   Passed    3.44 sec
            Start  8417: mpi/p4est_3d_constraintmatrix_03.mpirun=4.debug
11206/11561 Test  #8422: mpi/p4est_3d_ghost_01.mpirun=10.release ................................................   Passed   19.03 sec
            Start  8426: mpi/p4est_3d_refine_01.mpirun=10.release
11207/11561 Test  #8425: mpi/p4est_3d_refine_01.mpirun=10.debug .................................................   Passed   37.79 sec
            Start  8429: mpi/p4est_3d_refine_02.mpirun=10.debug
11208/11561 Test  #8426: mpi/p4est_3d_refine_01.mpirun=10.release ...............................................   Passed   23.46 sec
            Start  8430: mpi/p4est_3d_refine_02.mpirun=10.release
11209/11561 Test  #8417: mpi/p4est_3d_constraintmatrix_03.mpirun=4.debug ........................................   Passed   42.11 sec
            Start  8424: mpi/p4est_3d_ghost_01.mpirun=4.release
11210/11561 Test  #8424: mpi/p4est_3d_ghost_01.mpirun=4.release .................................................   Passed    3.06 sec
            Start  8427: mpi/p4est_3d_refine_01.mpirun=4.debug
11211/11561 Test  #8427: mpi/p4est_3d_refine_01.mpirun=4.debug ..................................................   Passed   11.15 sec
            Start  8428: mpi/p4est_3d_refine_01.mpirun=4.release
11212/11561 Test  #8429: mpi/p4est_3d_refine_02.mpirun=10.debug .................................................   Passed   22.47 sec
            Start  8433: mpi/p4est_3d_refine_03.mpirun=10.debug
11213/11561 Test  #8430: mpi/p4est_3d_refine_02.mpirun=10.release ...............................................   Passed   18.77 sec
            Start  8434: mpi/p4est_3d_refine_03.mpirun=10.release
11214/11561 Test  #8428: mpi/p4est_3d_refine_01.mpirun=4.release ................................................   Passed    3.24 sec
            Start  8431: mpi/p4est_3d_refine_02.mpirun=4.debug
11215/11561 Test  #8431: mpi/p4est_3d_refine_02.mpirun=4.debug ..................................................   Passed    3.29 sec
            Start  8432: mpi/p4est_3d_refine_02.mpirun=4.release
11216/11561 Test  #8432: mpi/p4est_3d_refine_02.mpirun=4.release ................................................   Passed    3.61 sec
11217/11561 Test  #8434: mpi/p4est_3d_refine_03.mpirun=10.release ...............................................   Passed   19.41 sec
            Start  8446: mpi/p4est_data_out_01.mpirun=10.debug
            Start  8436: mpi/p4est_3d_refine_03.mpirun=4.release
11218/11561 Test  #8433: mpi/p4est_3d_refine_03.mpirun=10.debug .................................................   Passed   22.26 sec
            Start  8447: mpi/p4est_data_out_01.mpirun=10.release
11219/11561 Test  #8436: mpi/p4est_3d_refine_03.mpirun=4.release ................................................   Passed    3.19 sec
            Start  8435: mpi/p4est_3d_refine_03.mpirun=4.debug
11220/11561 Test  #8435: mpi/p4est_3d_refine_03.mpirun=4.debug ..................................................   Passed    3.08 sec
11221/11561 Test  #8447: mpi/p4est_data_out_01.mpirun=10.release ................................................   Passed   19.59 sec
            Start  8450: mpi/p4est_get_subdomain_association.mpirun=10.debug
            Start  8449: mpi/p4est_data_out_01.mpirun=4.release
11222/11561 Test  #8446: mpi/p4est_data_out_01.mpirun=10.debug ..................................................   Passed   23.21 sec
            Start  8451: mpi/p4est_get_subdomain_association.mpirun=10.release
11223/11561 Test  #8449: mpi/p4est_data_out_01.mpirun=4.release .................................................   Passed    3.02 sec
            Start  8448: mpi/p4est_data_out_01.mpirun=4.debug
11224/11561 Test  #8448: mpi/p4est_data_out_01.mpirun=4.debug ...................................................   Passed    3.02 sec
11225/11561 Test  #8451: mpi/p4est_get_subdomain_association.mpirun=10.release ..................................   Passed   19.56 sec
            Start  8458: mpi/p4est_save_01.mpirun=10.debug
            Start  8453: mpi/p4est_get_subdomain_association.mpirun=4.release
11226/11561 Test  #8450: mpi/p4est_get_subdomain_association.mpirun=10.debug ....................................   Passed   22.36 sec
            Start  8459: mpi/p4est_save_01.mpirun=10.release
11227/11561 Test  #8453: mpi/p4est_get_subdomain_association.mpirun=4.release ...................................   Passed    2.94 sec
            Start  8452: mpi/p4est_get_subdomain_association.mpirun=4.debug
11228/11561 Test  #8452: mpi/p4est_get_subdomain_association.mpirun=4.debug .....................................   Passed    3.11 sec
11229/11561 Test  #8459: mpi/p4est_save_01.mpirun=10.release ....................................................   Passed   19.87 sec
            Start  8482: mpi/parallel_block_vector_01.mpirun=10.debug
            Start  8461: mpi/p4est_save_01.mpirun=4.release
11230/11561 Test  #8458: mpi/p4est_save_01.mpirun=10.debug ......................................................   Passed   22.83 sec
            Start  8483: mpi/parallel_block_vector_01.mpirun=10.release
11231/11561 Test  #8461: mpi/p4est_save_01.mpirun=4.release .....................................................   Passed    3.19 sec
            Start  8460: mpi/p4est_save_01.mpirun=4.debug
11232/11561 Test  #8482: mpi/parallel_block_vector_01.mpirun=10.debug ...........................................   Passed    3.35 sec
            Start  8488: mpi/parallel_block_vector_02.mpirun=10.debug
11233/11561 Test  #8483: mpi/parallel_block_vector_01.mpirun=10.release .........................................   Passed    3.06 sec
            Start  8489: mpi/parallel_block_vector_02.mpirun=10.release
11234/11561 Test  #8460: mpi/p4est_save_01.mpirun=4.debug .......................................................   Passed    3.23 sec
            Start  8484: mpi/parallel_block_vector_01.mpirun=4.debug
11235/11561 Test  #8488: mpi/parallel_block_vector_02.mpirun=10.debug ...........................................   Passed    3.30 sec
            Start  8494: mpi/parallel_block_vector_04.mpirun=10.debug
11236/11561 Test  #8489: mpi/parallel_block_vector_02.mpirun=10.release .........................................   Passed    3.11 sec
            Start  8495: mpi/parallel_block_vector_04.mpirun=10.release
11237/11561 Test  #8484: mpi/parallel_block_vector_01.mpirun=4.debug ............................................   Passed    3.13 sec
            Start  8485: mpi/parallel_block_vector_01.mpirun=4.release
11238/11561 Test  #8494: mpi/parallel_block_vector_04.mpirun=10.debug ...........................................   Passed    3.12 sec
            Start  8526: mpi/parallel_partitioner_01.mpirun=10.debug
11239/11561 Test  #8495: mpi/parallel_block_vector_04.mpirun=10.release .........................................   Passed    2.96 sec
            Start  8527: mpi/parallel_partitioner_01.mpirun=10.release
11240/11561 Test  #8485: mpi/parallel_block_vector_01.mpirun=4.release ..........................................   Passed    2.96 sec
            Start  8490: mpi/parallel_block_vector_02.mpirun=4.debug
11241/11561 Test  #8490: mpi/parallel_block_vector_02.mpirun=4.debug ............................................   Passed    3.03 sec
            Start  8491: mpi/parallel_block_vector_02.mpirun=4.release
11242/11561 Test  #8491: mpi/parallel_block_vector_02.mpirun=4.release ..........................................   Passed    2.98 sec
            Start  8496: mpi/parallel_block_vector_04.mpirun=4.debug
11243/11561 Test  #8496: mpi/parallel_block_vector_04.mpirun=4.debug ............................................   Passed    3.08 sec
            Start  8497: mpi/parallel_block_vector_04.mpirun=4.release
11244/11561 Test  #8527: mpi/parallel_partitioner_01.mpirun=10.release ..........................................   Passed   12.57 sec
            Start  8530: mpi/parallel_partitioner_02.mpirun=10.debug
11245/11561 Test  #8526: mpi/parallel_partitioner_01.mpirun=10.debug ............................................   Passed   13.84 sec
            Start  8531: mpi/parallel_partitioner_02.mpirun=10.release
11246/11561 Test  #8497: mpi/parallel_block_vector_04.mpirun=4.release ..........................................   Passed    3.01 sec
            Start  8528: mpi/parallel_partitioner_01.mpirun=4.debug
11247/11561 Test  #8528: mpi/parallel_partitioner_01.mpirun=4.debug .............................................   Passed    2.88 sec
            Start  8529: mpi/parallel_partitioner_01.mpirun=4.release
11248/11561 Test  #8529: mpi/parallel_partitioner_01.mpirun=4.release ...........................................   Passed    2.89 sec
11249/11561 Test  #8531: mpi/parallel_partitioner_02.mpirun=10.release ..........................................   Passed   11.87 sec
            Start  8534: mpi/parallel_partitioner_03.mpirun=10.debug
            Start  8533: mpi/parallel_partitioner_02.mpirun=4.release
11250/11561 Test  #8530: mpi/parallel_partitioner_02.mpirun=10.debug ............................................   Passed   13.53 sec
            Start  8535: mpi/parallel_partitioner_03.mpirun=10.release
11251/11561 Test  #8533: mpi/parallel_partitioner_02.mpirun=4.release ...........................................   Passed    3.07 sec
            Start  8532: mpi/parallel_partitioner_02.mpirun=4.debug
11252/11561 Test  #8532: mpi/parallel_partitioner_02.mpirun=4.debug .............................................   Passed    3.03 sec
11253/11561 Test  #8535: mpi/parallel_partitioner_03.mpirun=10.release ..........................................   Passed   12.45 sec
            Start  8540: mpi/parallel_partitioner_04.mpirun=10.debug
            Start  8537: mpi/parallel_partitioner_03.mpirun=4.release
11254/11561 Test  #8534: mpi/parallel_partitioner_03.mpirun=10.debug ............................................   Passed   14.52 sec
            Start  8541: mpi/parallel_partitioner_04.mpirun=10.release
11255/11561 Test  #8537: mpi/parallel_partitioner_03.mpirun=4.release ...........................................   Passed    2.97 sec
            Start  8536: mpi/parallel_partitioner_03.mpirun=4.debug
11256/11561 Test  #8536: mpi/parallel_partitioner_03.mpirun=4.debug .............................................   Passed    3.03 sec
11257/11561 Test  #8541: mpi/parallel_partitioner_04.mpirun=10.release ..........................................   Passed   12.70 sec
            Start  8554: mpi/parallel_vector_01.mpirun=10.debug
            Start  8543: mpi/parallel_partitioner_04.mpirun=4.release
11258/11561 Test  #8540: mpi/parallel_partitioner_04.mpirun=10.debug ............................................   Passed   13.63 sec
            Start  8555: mpi/parallel_vector_01.mpirun=10.release
11259/11561 Test  #8543: mpi/parallel_partitioner_04.mpirun=4.release ...........................................   Passed    2.87 sec
            Start  8542: mpi/parallel_partitioner_04.mpirun=4.debug
11260/11561 Test  #8542: mpi/parallel_partitioner_04.mpirun=4.debug .............................................   Passed    2.99 sec
11261/11561 Test  #8555: mpi/parallel_vector_01.mpirun=10.release ...............................................   Passed   12.25 sec
            Start  8558: mpi/parallel_vector_02.mpirun=10.debug
            Start  8557: mpi/parallel_vector_01.mpirun=4.release
11262/11561 Test  #8554: mpi/parallel_vector_01.mpirun=10.debug .................................................   Passed   13.44 sec
            Start  8559: mpi/parallel_vector_02.mpirun=10.release
11263/11561 Test  #8557: mpi/parallel_vector_01.mpirun=4.release ................................................   Passed    3.04 sec
            Start  8556: mpi/parallel_vector_01.mpirun=4.debug
11264/11561 Test  #8556: mpi/parallel_vector_01.mpirun=4.debug ..................................................   Passed    2.99 sec
11265/11561 Test  #8559: mpi/parallel_vector_02.mpirun=10.release ...............................................   Passed   12.19 sec
            Start  8562: mpi/parallel_vector_03.mpirun=10.debug
            Start  8561: mpi/parallel_vector_02.mpirun=4.release
11266/11561 Test  #8558: mpi/parallel_vector_02.mpirun=10.debug .................................................   Passed   13.55 sec
            Start  8563: mpi/parallel_vector_03.mpirun=10.release
11267/11561 Test  #8561: mpi/parallel_vector_02.mpirun=4.release ................................................   Passed    3.31 sec
            Start  8560: mpi/parallel_vector_02.mpirun=4.debug
11268/11561 Test  #8560: mpi/parallel_vector_02.mpirun=4.debug ..................................................   Passed    2.95 sec
11269/11561 Test  #8563: mpi/parallel_vector_03.mpirun=10.release ...............................................   Passed   12.19 sec
            Start  8568: mpi/parallel_vector_04.mpirun=10.debug
            Start  8565: mpi/parallel_vector_03.mpirun=4.release
11270/11561 Test  #8562: mpi/parallel_vector_03.mpirun=10.debug .................................................   Passed   13.22 sec
            Start  8569: mpi/parallel_vector_04.mpirun=10.release
11271/11561 Test  #8565: mpi/parallel_vector_03.mpirun=4.release ................................................   Passed    2.97 sec
            Start  8564: mpi/parallel_vector_03.mpirun=4.debug
11272/11561 Test  #8564: mpi/parallel_vector_03.mpirun=4.debug ..................................................   Passed    3.09 sec
11273/11561 Test  #8569: mpi/parallel_vector_04.mpirun=10.release ...............................................   Passed   12.11 sec
            Start  8572: mpi/parallel_vector_05.mpirun=10.debug
            Start  8571: mpi/parallel_vector_04.mpirun=4.release
11274/11561 Test  #8568: mpi/parallel_vector_04.mpirun=10.debug .................................................   Passed   13.47 sec
            Start  8573: mpi/parallel_vector_05.mpirun=10.release
11275/11561 Test  #8571: mpi/parallel_vector_04.mpirun=4.release ................................................   Passed    2.97 sec
            Start  8570: mpi/parallel_vector_04.mpirun=4.debug
11276/11561 Test  #8570: mpi/parallel_vector_04.mpirun=4.debug ..................................................   Passed    2.97 sec
11277/11561 Test  #8573: mpi/parallel_vector_05.mpirun=10.release ...............................................   Passed   12.14 sec
            Start  8578: mpi/parallel_vector_06.mpirun=10.debug
            Start  8575: mpi/parallel_vector_05.mpirun=4.release
11278/11561 Test  #8572: mpi/parallel_vector_05.mpirun=10.debug .................................................   Passed   13.62 sec
            Start  8579: mpi/parallel_vector_06.mpirun=10.release
11279/11561 Test  #8575: mpi/parallel_vector_05.mpirun=4.release ................................................   Passed    3.05 sec
            Start  8574: mpi/parallel_vector_05.mpirun=4.debug
11280/11561 Test  #8578: mpi/parallel_vector_06.mpirun=10.debug .................................................   Passed    3.31 sec
            Start  8582: mpi/parallel_vector_07.mpirun=10.debug
11281/11561 Test  #8579: mpi/parallel_vector_06.mpirun=10.release ...............................................   Passed    3.52 sec
            Start  8583: mpi/parallel_vector_07.mpirun=10.release
11282/11561 Test  #8574: mpi/parallel_vector_05.mpirun=4.debug ..................................................   Passed    3.17 sec
            Start  8580: mpi/parallel_vector_06.mpirun=4.debug
11283/11561 Test  #8580: mpi/parallel_vector_06.mpirun=4.debug ..................................................   Passed    3.08 sec
            Start  8581: mpi/parallel_vector_06.mpirun=4.release
11284/11561 Test  #8581: mpi/parallel_vector_06.mpirun=4.release ................................................   Passed    2.93 sec
11285/11561 Test  #8583: mpi/parallel_vector_07.mpirun=10.release ...............................................   Passed   12.95 sec
            Start  8586: mpi/parallel_vector_08.mpirun=10.debug
            Start  8585: mpi/parallel_vector_07.mpirun=4.release
11286/11561 Test  #8582: mpi/parallel_vector_07.mpirun=10.debug .................................................   Passed   13.94 sec
            Start  8587: mpi/parallel_vector_08.mpirun=10.release
11287/11561 Test  #8585: mpi/parallel_vector_07.mpirun=4.release ................................................   Passed    2.93 sec
            Start  8584: mpi/parallel_vector_07.mpirun=4.debug
11288/11561 Test  #8584: mpi/parallel_vector_07.mpirun=4.debug ..................................................   Passed    2.97 sec
11289/11561 Test  #8587: mpi/parallel_vector_08.mpirun=10.release ...............................................   Passed   12.49 sec
            Start  8590: mpi/parallel_vector_09.mpirun=10.debug
            Start  8589: mpi/parallel_vector_08.mpirun=4.release
11290/11561 Test  #8586: mpi/parallel_vector_08.mpirun=10.debug .................................................   Passed   13.78 sec
            Start  8591: mpi/parallel_vector_09.mpirun=10.release
11291/11561 Test  #8589: mpi/parallel_vector_08.mpirun=4.release ................................................   Passed    2.94 sec
            Start  8588: mpi/parallel_vector_08.mpirun=4.debug
11292/11561 Test  #8588: mpi/parallel_vector_08.mpirun=4.debug ..................................................   Passed    3.02 sec
11293/11561 Test  #8591: mpi/parallel_vector_09.mpirun=10.release ...............................................   Passed   12.45 sec
            Start  8594: mpi/parallel_vector_10.mpirun=10.debug
            Start  8593: mpi/parallel_vector_09.mpirun=4.release
11294/11561 Test  #8590: mpi/parallel_vector_09.mpirun=10.debug .................................................   Passed   13.78 sec
            Start  8595: mpi/parallel_vector_10.mpirun=10.release
11295/11561 Test  #8593: mpi/parallel_vector_09.mpirun=4.release ................................................   Passed    3.03 sec
            Start  8592: mpi/parallel_vector_09.mpirun=4.debug
11296/11561 Test  #8592: mpi/parallel_vector_09.mpirun=4.debug ..................................................   Passed    3.06 sec
11297/11561 Test  #8595: mpi/parallel_vector_10.mpirun=10.release ...............................................   Passed   12.05 sec
            Start  8598: mpi/parallel_vector_11.mpirun=10.debug
            Start  8597: mpi/parallel_vector_10.mpirun=4.release
11298/11561 Test  #8594: mpi/parallel_vector_10.mpirun=10.debug .................................................   Passed   13.50 sec
            Start  8599: mpi/parallel_vector_11.mpirun=10.release
11299/11561 Test  #8597: mpi/parallel_vector_10.mpirun=4.release ................................................   Passed    2.94 sec
            Start  8596: mpi/parallel_vector_10.mpirun=4.debug
11300/11561 Test  #8596: mpi/parallel_vector_10.mpirun=4.debug ..................................................   Passed    2.92 sec
11301/11561 Test  #8599: mpi/parallel_vector_11.mpirun=10.release ...............................................   Passed   12.90 sec
            Start  8604: mpi/parallel_vector_12.mpirun=10.debug
            Start  8601: mpi/parallel_vector_11.mpirun=4.release
11302/11561 Test  #8598: mpi/parallel_vector_11.mpirun=10.debug .................................................   Passed   14.08 sec
            Start  8605: mpi/parallel_vector_12.mpirun=10.release
11303/11561 Test  #8605: mpi/parallel_vector_12.mpirun=10.release ...............................................   Passed    3.30 sec
            Start  8610: mpi/parallel_vector_12a.mpirun=10.debug
11304/11561 Test  #8601: mpi/parallel_vector_11.mpirun=4.release ................................................   Passed    3.32 sec
            Start  8600: mpi/parallel_vector_11.mpirun=4.debug
11305/11561 Test  #8604: mpi/parallel_vector_12.mpirun=10.debug .................................................   Passed    3.44 sec
            Start  8611: mpi/parallel_vector_12a.mpirun=10.release
11306/11561 Test  #8600: mpi/parallel_vector_11.mpirun=4.debug ..................................................   Passed    3.17 sec
            Start  8606: mpi/parallel_vector_12.mpirun=4.debug
11307/11561 Test  #8610: mpi/parallel_vector_12a.mpirun=10.debug ................................................   Passed    3.37 sec
            Start  8614: mpi/parallel_vector_13.mpirun=10.debug
11308/11561 Test  #8611: mpi/parallel_vector_12a.mpirun=10.release ..............................................   Passed    3.27 sec
            Start  8615: mpi/parallel_vector_13.mpirun=10.release
11309/11561 Test  #8606: mpi/parallel_vector_12.mpirun=4.debug ..................................................   Passed    3.88 sec
            Start  8607: mpi/parallel_vector_12.mpirun=4.release
11310/11561 Test  #8607: mpi/parallel_vector_12.mpirun=4.release ................................................   Passed    2.94 sec
            Start  8612: mpi/parallel_vector_12a.mpirun=4.debug
11311/11561 Test  #8612: mpi/parallel_vector_12a.mpirun=4.debug .................................................   Passed    2.99 sec
            Start  8613: mpi/parallel_vector_12a.mpirun=4.release
11312/11561 Test  #8615: mpi/parallel_vector_13.mpirun=10.release ...............................................   Passed   12.25 sec
            Start  8630: mpi/parallel_vector_18.mpirun=10.debug
11313/11561 Test  #8613: mpi/parallel_vector_12a.mpirun=4.release ...............................................   Passed    2.98 sec
            Start  8617: mpi/parallel_vector_13.mpirun=4.release
11314/11561 Test  #8614: mpi/parallel_vector_13.mpirun=10.debug .................................................   Passed   13.96 sec
            Start  8631: mpi/parallel_vector_18.mpirun=10.release
11315/11561 Test  #8617: mpi/parallel_vector_13.mpirun=4.release ................................................   Passed    3.07 sec
            Start  8616: mpi/parallel_vector_13.mpirun=4.debug
11316/11561 Test  #8630: mpi/parallel_vector_18.mpirun=10.debug .................................................   Passed    3.64 sec
            Start  8636: mpi/parallel_vector_19.mpirun=10.debug
11317/11561 Test  #8631: mpi/parallel_vector_18.mpirun=10.release ...............................................   Passed    3.02 sec
            Start  8637: mpi/parallel_vector_19.mpirun=10.release
11318/11561 Test  #8616: mpi/parallel_vector_13.mpirun=4.debug ..................................................   Passed    3.21 sec
            Start  8632: mpi/parallel_vector_18.mpirun=4.debug
11319/11561 Test  #8636: mpi/parallel_vector_19.mpirun=10.debug .................................................   Passed    3.20 sec
            Start  8644: mpi/parallel_vector_22.mpirun=10.debug
11320/11561 Test  #8637: mpi/parallel_vector_19.mpirun=10.release ...............................................   Passed    3.14 sec
            Start  8645: mpi/parallel_vector_22.mpirun=10.release
11321/11561 Test  #8632: mpi/parallel_vector_18.mpirun=4.debug ..................................................   Passed    3.06 sec
            Start  8633: mpi/parallel_vector_18.mpirun=4.release
11322/11561 Test  #8633: mpi/parallel_vector_18.mpirun=4.release ................................................   Passed    2.90 sec
            Start  8638: mpi/parallel_vector_19.mpirun=4.debug
11323/11561 Test  #8638: mpi/parallel_vector_19.mpirun=4.debug ..................................................   Passed    2.88 sec
            Start  8639: mpi/parallel_vector_19.mpirun=4.release
11324/11561 Test  #8639: mpi/parallel_vector_19.mpirun=4.release ................................................   Passed    2.95 sec
11325/11561 Test  #8645: mpi/parallel_vector_22.mpirun=10.release ...............................................   Passed   12.57 sec
            Start  8706: mpi/refine_and_coarsen_fixed_fraction_01.mpirun=10.debug
            Start  8647: mpi/parallel_vector_22.mpirun=4.release
11326/11561 Test  #8644: mpi/parallel_vector_22.mpirun=10.debug .................................................   Passed   13.72 sec
            Start  8707: mpi/refine_and_coarsen_fixed_fraction_01.mpirun=10.release
11327/11561 Test  #8647: mpi/parallel_vector_22.mpirun=4.release ................................................   Passed    2.90 sec
            Start  8646: mpi/parallel_vector_22.mpirun=4.debug
11328/11561 Test  #8646: mpi/parallel_vector_22.mpirun=4.debug ..................................................   Passed    2.99 sec
11329/11561 Test  #8707: mpi/refine_and_coarsen_fixed_fraction_01.mpirun=10.release .............................   Passed   18.48 sec
            Start  8710: mpi/refine_and_coarsen_fixed_fraction_02.mpirun=10.debug
            Start  8709: mpi/refine_and_coarsen_fixed_fraction_01.mpirun=4.release
11330/11561 Test  #8709: mpi/refine_and_coarsen_fixed_fraction_01.mpirun=4.release ..............................   Passed    3.27 sec
11331/11561 Test  #8706: mpi/refine_and_coarsen_fixed_fraction_01.mpirun=10.debug ...............................   Passed   22.39 sec
            Start  8711: mpi/refine_and_coarsen_fixed_fraction_02.mpirun=10.release
            Start  8708: mpi/refine_and_coarsen_fixed_fraction_01.mpirun=4.debug
11332/11561 Test  #8708: mpi/refine_and_coarsen_fixed_fraction_01.mpirun=4.debug ................................   Passed    3.16 sec
11333/11561 Test  #8710: mpi/refine_and_coarsen_fixed_fraction_02.mpirun=10.debug ...............................   Passed   22.00 sec
            Start  8714: mpi/refine_and_coarsen_fixed_fraction_03.mpirun=10.debug
            Start  8712: mpi/refine_and_coarsen_fixed_fraction_02.mpirun=4.debug
11334/11561 Test  #8711: mpi/refine_and_coarsen_fixed_fraction_02.mpirun=10.release .............................   Passed   18.95 sec
            Start  8715: mpi/refine_and_coarsen_fixed_fraction_03.mpirun=10.release
11335/11561 Test  #8712: mpi/refine_and_coarsen_fixed_fraction_02.mpirun=4.debug ................................   Passed    3.11 sec
            Start  8713: mpi/refine_and_coarsen_fixed_fraction_02.mpirun=4.release
11336/11561 Test  #8713: mpi/refine_and_coarsen_fixed_fraction_02.mpirun=4.release ..............................   Passed    2.92 sec
11337/11561 Test  #8715: mpi/refine_and_coarsen_fixed_fraction_03.mpirun=10.release .............................   Passed   18.49 sec
            Start  8734: mpi/refine_and_coarsen_fixed_number_01.mpirun=10.debug
            Start  8717: mpi/refine_and_coarsen_fixed_fraction_03.mpirun=4.release
11338/11561 Test  #8714: mpi/refine_and_coarsen_fixed_fraction_03.mpirun=10.debug ...............................   Passed   22.00 sec
            Start  8735: mpi/refine_and_coarsen_fixed_number_01.mpirun=10.release
11339/11561 Test  #8717: mpi/refine_and_coarsen_fixed_fraction_03.mpirun=4.release ..............................   Passed    3.06 sec
            Start  8716: mpi/refine_and_coarsen_fixed_fraction_03.mpirun=4.debug
11340/11561 Test  #8716: mpi/refine_and_coarsen_fixed_fraction_03.mpirun=4.debug ................................   Passed    3.25 sec
11341/11561 Test  #8735: mpi/refine_and_coarsen_fixed_number_01.mpirun=10.release ...............................   Passed   18.72 sec
            Start  8738: mpi/refine_and_coarsen_fixed_number_02.mpirun=10.debug
            Start  8737: mpi/refine_and_coarsen_fixed_number_01.mpirun=4.release
11342/11561 Test  #8734: mpi/refine_and_coarsen_fixed_number_01.mpirun=10.debug .................................   Passed   22.09 sec
            Start  8739: mpi/refine_and_coarsen_fixed_number_02.mpirun=10.release
11343/11561 Test  #8737: mpi/refine_and_coarsen_fixed_number_01.mpirun=4.release ................................   Passed    3.00 sec
            Start  8736: mpi/refine_and_coarsen_fixed_number_01.mpirun=4.debug
11344/11561 Test  #8736: mpi/refine_and_coarsen_fixed_number_01.mpirun=4.debug ..................................   Passed    3.20 sec
11345/11561 Test  #8739: mpi/refine_and_coarsen_fixed_number_02.mpirun=10.release ...............................   Passed   18.40 sec
            Start  8742: mpi/refine_and_coarsen_fixed_number_03.mpirun=10.debug
            Start  8741: mpi/refine_and_coarsen_fixed_number_02.mpirun=4.release
11346/11561 Test  #8741: mpi/refine_and_coarsen_fixed_number_02.mpirun=4.release ................................   Passed    3.38 sec
11347/11561 Test  #8738: mpi/refine_and_coarsen_fixed_number_02.mpirun=10.debug .................................   Passed   22.49 sec
            Start  8743: mpi/refine_and_coarsen_fixed_number_03.mpirun=10.release
            Start  8740: mpi/refine_and_coarsen_fixed_number_02.mpirun=4.debug
11348/11561 Test  #8740: mpi/refine_and_coarsen_fixed_number_02.mpirun=4.debug ..................................   Passed    3.96 sec
11349/11561 Test  #8742: mpi/refine_and_coarsen_fixed_number_03.mpirun=10.debug .................................   Passed   23.03 sec
            Start  8752: mpi/refine_and_coarsen_fixed_number_06.mpirun=10.debug
            Start  8744: mpi/refine_and_coarsen_fixed_number_03.mpirun=4.debug
11350/11561 Test  #8743: mpi/refine_and_coarsen_fixed_number_03.mpirun=10.release ...............................   Passed   19.86 sec
            Start  8753: mpi/refine_and_coarsen_fixed_number_06.mpirun=10.release
11351/11561 Test  #8752: mpi/refine_and_coarsen_fixed_number_06.mpirun=10.debug .................................   Passed    3.32 sec
            Start  8758: mpi/refine_and_coarsen_fixed_number_07.mpirun=10.debug
11352/11561 Test  #8744: mpi/refine_and_coarsen_fixed_number_03.mpirun=4.debug ..................................   Passed    3.45 sec
            Start  8745: mpi/refine_and_coarsen_fixed_number_03.mpirun=4.release
11353/11561 Test  #8753: mpi/refine_and_coarsen_fixed_number_06.mpirun=10.release ...............................   Passed    3.50 sec
            Start  8759: mpi/refine_and_coarsen_fixed_number_07.mpirun=10.release
11354/11561 Test  #8745: mpi/refine_and_coarsen_fixed_number_03.mpirun=4.release ................................   Passed    3.66 sec
            Start  8754: mpi/refine_and_coarsen_fixed_number_06.mpirun=4.debug
11355/11561 Test  #8758: mpi/refine_and_coarsen_fixed_number_07.mpirun=10.debug .................................   Passed    4.73 sec
            Start  8788: mpi/renumber_z_order_01.mpirun=10.debug
11356/11561 Test  #8759: mpi/refine_and_coarsen_fixed_number_07.mpirun=10.release ...............................   Passed    4.24 sec
            Start  8789: mpi/renumber_z_order_01.mpirun=10.release
11357/11561 Test  #8754: mpi/refine_and_coarsen_fixed_number_06.mpirun=4.debug ..................................   Passed    3.52 sec
            Start  8755: mpi/refine_and_coarsen_fixed_number_06.mpirun=4.release
11358/11561 Test  #8789: mpi/renumber_z_order_01.mpirun=10.release ..............................................   Passed    3.27 sec
            Start  8794: mpi/renumber_z_order_02.mpirun=10.debug
11359/11561 Test  #8788: mpi/renumber_z_order_01.mpirun=10.debug ................................................   Passed    3.44 sec
            Start  8795: mpi/renumber_z_order_02.mpirun=10.release
11360/11561 Test  #8755: mpi/refine_and_coarsen_fixed_number_06.mpirun=4.release ................................   Passed    3.11 sec
            Start  8760: mpi/refine_and_coarsen_fixed_number_07.mpirun=4.debug
11361/11561 Test  #8794: mpi/renumber_z_order_02.mpirun=10.debug ................................................   Passed    3.31 sec
            Start  8870: mpi/tria_ghost_owners_02.mpirun=11.debug
11362/11561 Test  #8795: mpi/renumber_z_order_02.mpirun=10.release ..............................................   Passed    3.46 sec
            Start  8871: mpi/tria_ghost_owners_02.mpirun=11.release
11363/11561 Test  #8760: mpi/refine_and_coarsen_fixed_number_07.mpirun=4.debug ..................................   Passed    3.94 sec
            Start  8761: mpi/refine_and_coarsen_fixed_number_07.mpirun=4.release
11364/11561 Test  #8761: mpi/refine_and_coarsen_fixed_number_07.mpirun=4.release ................................   Passed    3.04 sec
            Start  8790: mpi/renumber_z_order_01.mpirun=4.debug
11365/11561 Test  #8790: mpi/renumber_z_order_01.mpirun=4.debug .................................................   Passed    2.95 sec
            Start  8791: mpi/renumber_z_order_01.mpirun=4.release
11366/11561 Test  #8791: mpi/renumber_z_order_01.mpirun=4.release ...............................................   Passed    2.91 sec
            Start  8796: mpi/renumber_z_order_02.mpirun=4.debug
11367/11561 Test  #8796: mpi/renumber_z_order_02.mpirun=4.debug .................................................   Passed    3.05 sec
            Start  8797: mpi/renumber_z_order_02.mpirun=4.release
11368/11561 Test  #8797: mpi/renumber_z_order_02.mpirun=4.release ...............................................   Passed    2.94 sec
11369/11561 Test  #8871: mpi/tria_ghost_owners_02.mpirun=11.release .............................................   Passed   19.51 sec
            Start  8876: mpi/tria_signals_01.mpirun=11.debug
            Start  8873: mpi/tria_ghost_owners_02.mpirun=5.release
11370/11561 Test  #8873: mpi/tria_ghost_owners_02.mpirun=5.release ..............................................   Passed   14.69 sec
11371/11561 Test  #8876: mpi/tria_signals_01.mpirun=11.debug ....................................................   Passed   16.56 sec
            Start  8877: mpi/tria_signals_01.mpirun=11.release
            Start  8878: mpi/tria_signals_01.mpirun=4.debug
11372/11561 Test  #8878: mpi/tria_signals_01.mpirun=4.debug .....................................................   Passed    4.53 sec
11373/11561 Test  #8870: mpi/tria_ghost_owners_02.mpirun=11.debug ...............................................   Passed   49.57 sec
            Start  8882: mpi/tria_signals_02.mpirun=11.debug
            Start  8872: mpi/tria_ghost_owners_02.mpirun=5.debug
11374/11561 Test  #8877: mpi/tria_signals_01.mpirun=11.release ..................................................   Passed   13.23 sec
            Start  8883: mpi/tria_signals_02.mpirun=11.release
11375/11561 Test  #8883: mpi/tria_signals_02.mpirun=11.release ..................................................   Passed    3.57 sec
            Start  8888: mpi/tria_signals_03.mpirun=11.debug
11376/11561 Test  #8882: mpi/tria_signals_02.mpirun=11.debug ....................................................   Passed    6.29 sec
            Start  8889: mpi/tria_signals_03.mpirun=11.release
11377/11561 Test  #8872: mpi/tria_ghost_owners_02.mpirun=5.debug ................................................   Passed   17.56 sec
            Start  8879: mpi/tria_signals_01.mpirun=4.release
11378/11561 Test  #8879: mpi/tria_signals_01.mpirun=4.release ...................................................   Passed    8.97 sec
            Start  8884: mpi/tria_signals_02.mpirun=4.debug
11379/11561 Test  #8884: mpi/tria_signals_02.mpirun=4.debug .....................................................   Passed   11.48 sec
            Start  8885: mpi/tria_signals_02.mpirun=4.release
11380/11561 Test  #8889: mpi/tria_signals_03.mpirun=11.release ..................................................   Passed   36.62 sec
            Start  8894: mpi/tria_signals_04.mpirun=11.debug
11381/11561 Test  #8885: mpi/tria_signals_02.mpirun=4.release ...................................................   Passed    5.60 sec
            Start  8891: mpi/tria_signals_03.mpirun=4.release
11382/11561 Test  #8891: mpi/tria_signals_03.mpirun=4.release ...................................................   Passed   10.28 sec
11383/11561 Test  #8888: mpi/tria_signals_03.mpirun=11.debug ....................................................   Passed   88.63 sec
            Start  8895: mpi/tria_signals_04.mpirun=11.release
            Start  8890: mpi/tria_signals_03.mpirun=4.debug
11384/11561 Test  #8895: mpi/tria_signals_04.mpirun=11.release ..................................................   Passed   39.31 sec
            Start  8900: mpi/tria_signals_05.mpirun=11.debug
11385/11561 Test  #8894: mpi/tria_signals_04.mpirun=11.debug ....................................................   Passed  100.06 sec
            Start  8901: mpi/tria_signals_05.mpirun=11.release
11386/11561 Test  #8900: mpi/tria_signals_05.mpirun=11.debug ....................................................   Passed   12.02 sec
            Start  8906: mpi/trilinos_01.mpirun=10.debug
11387/11561 Test  #8901: mpi/tria_signals_05.mpirun=11.release ..................................................   Passed    4.78 sec
            Start  8907: mpi/trilinos_01.mpirun=10.release
11388/11561 Test  #8906: mpi/trilinos_01.mpirun=10.debug ........................................................   Passed   17.30 sec
            Start  8910: mpi/trilinos_02.mpirun=10.debug
11389/11561 Test  #8907: mpi/trilinos_01.mpirun=10.release ......................................................   Passed   16.12 sec
            Start  8911: mpi/trilinos_02.mpirun=10.release
11390/11561 Test  #8890: mpi/tria_signals_03.mpirun=4.debug .....................................................   Passed   80.63 sec
            Start  8896: mpi/tria_signals_04.mpirun=4.debug
11391/11561 Test  #8910: mpi/trilinos_02.mpirun=10.debug ........................................................   Passed   13.98 sec
            Start  8950: mpi/trilinos_ghost_01.mpirun=10.debug
11392/11561 Test  #8911: mpi/trilinos_02.mpirun=10.release ......................................................   Passed   12.64 sec
            Start  8951: mpi/trilinos_ghost_01.mpirun=10.release
11393/11561 Test  #8950: mpi/trilinos_ghost_01.mpirun=10.debug ..................................................   Passed   14.59 sec
            Start  8954: mpi/trilinos_ghost_02.mpirun=10.debug
11394/11561 Test  #8951: mpi/trilinos_ghost_01.mpirun=10.release ................................................   Passed   12.97 sec
            Start  8955: mpi/trilinos_ghost_02.mpirun=10.release
11395/11561 Test  #8955: mpi/trilinos_ghost_02.mpirun=10.release ................................................   Passed   12.49 sec
            Start  8958: mpi/trilinos_ghost_03.mpirun=10.debug
11396/11561 Test  #8954: mpi/trilinos_ghost_02.mpirun=10.debug ..................................................   Passed   14.11 sec
            Start  8960: mpi/trilinos_ghost_03_linfty.mpirun=10.debug
11397/11561 Test  #8958: mpi/trilinos_ghost_03.mpirun=10.debug ..................................................   Passed   13.65 sec
            Start  8962: mpi/trilinos_ghost_05.mpirun=10.debug
11398/11561 Test  #8960: mpi/trilinos_ghost_03_linfty.mpirun=10.debug ...........................................   Passed   14.04 sec
            Start  8963: mpi/trilinos_ghost_05.mpirun=10.release
11399/11561 Test  #8962: mpi/trilinos_ghost_05.mpirun=10.debug ..................................................   Passed   14.02 sec
            Start  9205: multigrid/transfer_matrix_free_06.mpirun=10.debug
11400/11561 Test  #8963: mpi/trilinos_ghost_05.mpirun=10.release ................................................   Passed   12.70 sec
            Start  9206: multigrid/transfer_matrix_free_06.mpirun=10.release
11401/11561 Test  #8896: mpi/tria_signals_04.mpirun=4.debug .....................................................   Passed   59.16 sec
            Start  8897: mpi/tria_signals_04.mpirun=4.release
11402/11561 Test  #8897: mpi/tria_signals_04.mpirun=4.release ...................................................   Passed    4.44 sec
            Start  8902: mpi/tria_signals_05.mpirun=4.debug
11403/11561 Test  #8902: mpi/tria_signals_05.mpirun=4.debug .....................................................   Passed    4.93 sec
            Start  8903: mpi/tria_signals_05.mpirun=4.release
11404/11561 Test  #8903: mpi/tria_signals_05.mpirun=4.release ...................................................   Passed    2.96 sec
            Start  8908: mpi/trilinos_01.mpirun=4.debug
11405/11561 Test  #8908: mpi/trilinos_01.mpirun=4.debug .........................................................   Passed    5.99 sec
            Start  8909: mpi/trilinos_01.mpirun=4.release
11406/11561 Test  #8909: mpi/trilinos_01.mpirun=4.release .......................................................   Passed    6.77 sec
            Start  8912: mpi/trilinos_02.mpirun=4.debug
11407/11561 Test  #8912: mpi/trilinos_02.mpirun=4.debug .........................................................   Passed    6.02 sec
            Start  8913: mpi/trilinos_02.mpirun=4.release
11408/11561 Test  #8913: mpi/trilinos_02.mpirun=4.release .......................................................   Passed    6.20 sec
            Start  8952: mpi/trilinos_ghost_01.mpirun=4.debug
11409/11561 Test  #8952: mpi/trilinos_ghost_01.mpirun=4.debug ...................................................   Passed    6.59 sec
            Start  8953: mpi/trilinos_ghost_01.mpirun=4.release
11410/11561 Test  #8953: mpi/trilinos_ghost_01.mpirun=4.release .................................................   Passed    6.49 sec
            Start  8956: mpi/trilinos_ghost_02.mpirun=4.debug
11411/11561 Test  #8956: mpi/trilinos_ghost_02.mpirun=4.debug ...................................................   Passed    8.84 sec
            Start  8957: mpi/trilinos_ghost_02.mpirun=4.release
11412/11561 Test  #8957: mpi/trilinos_ghost_02.mpirun=4.release .................................................   Passed    7.04 sec
            Start  8959: mpi/trilinos_ghost_03.mpirun=4.debug
11413/11561 Test  #8959: mpi/trilinos_ghost_03.mpirun=4.debug ...................................................   Passed    7.17 sec
            Start  8961: mpi/trilinos_ghost_03_linfty.mpirun=4.debug
11414/11561 Test  #9206: multigrid/transfer_matrix_free_06.mpirun=10.release ....................................   Passed   76.04 sec
            Start  1659: base/mpi_some_to_some_01.mpirun=6.release
            Start  8964: mpi/trilinos_ghost_05.mpirun=4.debug
11415/11561 Test  #9205: multigrid/transfer_matrix_free_06.mpirun=10.debug ......................................   Passed   78.19 sec
            Start  4828: fullydistributed_grids/copy_serial_tria_05.mpirun=9.debug
11416/11561 Test  #1659: base/mpi_some_to_some_01.mpirun=6.release ..............................................   Passed    2.72 sec
            Start  4829: fullydistributed_grids/copy_serial_tria_05.mpirun=9.release
11417/11561 Test  #8961: mpi/trilinos_ghost_03_linfty.mpirun=4.debug ............................................   Passed    3.58 sec
            Start  8965: mpi/trilinos_ghost_05.mpirun=4.release
11418/11561 Test  #8964: mpi/trilinos_ghost_05.mpirun=4.debug ...................................................   Passed    3.19 sec
            Start  9207: multigrid/transfer_matrix_free_06.mpirun=5.debug
11419/11561 Test  #8965: mpi/trilinos_ghost_05.mpirun=4.release .................................................   Passed    3.01 sec
            Start  9208: multigrid/transfer_matrix_free_06.mpirun=5.release
11420/11561 Test  #9208: multigrid/transfer_matrix_free_06.mpirun=5.release .....................................   Passed    1.18 sec
11421/11561 Test  #9207: multigrid/transfer_matrix_free_06.mpirun=5.debug .......................................   Passed    5.16 sec
            Start  4850: fullydistributed_grids/copy_serial_tria_grouped_01.mpirun=7.debug
11422/11561 Test  #4829: fullydistributed_grids/copy_serial_tria_05.mpirun=9.release ............................   Passed   22.11 sec
            Start  4851: fullydistributed_grids/copy_serial_tria_grouped_01.mpirun=7.release
11423/11561 Test  #4828: fullydistributed_grids/copy_serial_tria_05.mpirun=9.debug ..............................   Passed   27.67 sec
            Start  6319: lac/diagonal_matrix_02.mpirun=7.debug
            Start  6320: lac/diagonal_matrix_02.mpirun=7.release
11424/11561 Test  #6320: lac/diagonal_matrix_02.mpirun=7.release ................................................   Passed    1.77 sec
            Start  7128: matrix_free/cell_categorization.mpirun=7.debug
11425/11561 Test  #6319: lac/diagonal_matrix_02.mpirun=7.debug ..................................................   Passed    2.06 sec
            Start  7129: matrix_free/cell_categorization.mpirun=7.release
11426/11561 Test  #7129: matrix_free/cell_categorization.mpirun=7.release .......................................   Passed    5.67 sec
            Start  7134: matrix_free/cell_categorization_02.mpirun=7.debug
11427/11561 Test  #7128: matrix_free/cell_categorization.mpirun=7.debug .........................................   Passed    6.15 sec
            Start  7135: matrix_free/cell_categorization_02.mpirun=7.release
11428/11561 Test  #7135: matrix_free/cell_categorization_02.mpirun=7.release ....................................   Passed    2.41 sec
            Start  7166: matrix_free/dg_pbc_01.mpirun=7.debug
11429/11561 Test  #7166: matrix_free/dg_pbc_01.mpirun=7.debug ...................................................   Passed    2.37 sec
            Start  7167: matrix_free/dg_pbc_01.mpirun=7.release
11430/11561 Test  #7167: matrix_free/dg_pbc_01.mpirun=7.release .................................................   Passed    1.99 sec
            Start  7170: matrix_free/dg_pbc_02.mpirun=7.debug
11431/11561 Test  #7170: matrix_free/dg_pbc_02.mpirun=7.debug ...................................................   Passed    2.96 sec
            Start  7171: matrix_free/dg_pbc_02.mpirun=7.release
11432/11561 Test  #7134: matrix_free/cell_categorization_02.mpirun=7.debug ......................................   Passed   12.02 sec
            Start  7525: matrix_free/parallel_multigrid.mpirun=7.debug
11433/11561 Test  #7171: matrix_free/dg_pbc_02.mpirun=7.release .................................................   Passed    2.22 sec
            Start  7526: matrix_free/parallel_multigrid.mpirun=7.release
11434/11561 Test  #7526: matrix_free/parallel_multigrid.mpirun=7.release ........................................   Passed    2.58 sec
            Start  7529: matrix_free/parallel_multigrid_02.mpirun=7.debug
11435/11561 Test  #7529: matrix_free/parallel_multigrid_02.mpirun=7.debug .......................................   Passed    6.46 sec
            Start  7530: matrix_free/parallel_multigrid_02.mpirun=7.release
11436/11561 Test  #7530: matrix_free/parallel_multigrid_02.mpirun=7.release .....................................   Passed    2.01 sec
            Start  7533: matrix_free/parallel_multigrid_adaptive_01.mpirun=7.debug
11437/11561 Test  #7525: matrix_free/parallel_multigrid.mpirun=7.debug ..........................................   Passed   22.93 sec
            Start  7534: matrix_free/parallel_multigrid_adaptive_01.mpirun=7.release
11438/11561 Test  #7534: matrix_free/parallel_multigrid_adaptive_01.mpirun=7.release ............................   Passed    3.31 sec
            Start  7537: matrix_free/parallel_multigrid_adaptive_02.mpirun=7.debug
11439/11561 Test  #4850: fullydistributed_grids/copy_serial_tria_grouped_01.mpirun=7.debug ......................   Passed   82.25 sec
            Start  7538: matrix_free/parallel_multigrid_adaptive_02.mpirun=7.release
11440/11561 Test  #7533: matrix_free/parallel_multigrid_adaptive_01.mpirun=7.debug ..............................   Passed   43.16 sec
            Start  7555: matrix_free/parallel_multigrid_mf.mpirun=7.debug
11441/11561 Test  #7538: matrix_free/parallel_multigrid_adaptive_02.mpirun=7.release ............................   Passed   14.50 sec
            Start  7556: matrix_free/parallel_multigrid_mf.mpirun=7.release
11442/11561 Test  #4851: fullydistributed_grids/copy_serial_tria_grouped_01.mpirun=7.release ....................   Passed   80.31 sec
            Start  7989: mpi/derivative_approximation_02.mpirun=7.debug
11443/11561 Test  #7989: mpi/derivative_approximation_02.mpirun=7.debug .........................................   Passed    3.86 sec
            Start  7990: mpi/derivative_approximation_02.mpirun=7.release
11444/11561 Test  #7990: mpi/derivative_approximation_02.mpirun=7.release .......................................   Passed    4.69 sec
            Start  8081: mpi/has_hanging_nodes.mpirun=7.debug
11445/11561 Test  #8081: mpi/has_hanging_nodes.mpirun=7.debug ...................................................   Passed    6.26 sec
            Start  8082: mpi/has_hanging_nodes.mpirun=7.release
11446/11561 Test  #8082: mpi/has_hanging_nodes.mpirun=7.release .................................................   Passed    5.28 sec
            Start  8159: mpi/hp_unify_dof_indices_08.mpirun=7.debug
11447/11561 Test  #7537: matrix_free/parallel_multigrid_adaptive_02.mpirun=7.debug ..............................   Passed   57.98 sec
            Start  8160: mpi/hp_unify_dof_indices_08.mpirun=7.release
11448/11561 Test  #8160: mpi/hp_unify_dof_indices_08.mpirun=7.release ...........................................   Passed    4.67 sec
            Start  8277: mpi/mg_06.mpirun=7.debug
11449/11561 Test  #8277: mpi/mg_06.mpirun=7.debug ...............................................................   Passed   25.84 sec
            Start  8278: mpi/mg_06.mpirun=7.release
11450/11561 Test  #8159: mpi/hp_unify_dof_indices_08.mpirun=7.debug .............................................   Passed   43.37 sec
            Start  8281: mpi/mg_ghost_dofs_periodic_01.mpirun=7.debug
11451/11561 Test  #8281: mpi/mg_ghost_dofs_periodic_01.mpirun=7.debug ...........................................   Passed    3.84 sec
            Start  8282: mpi/mg_ghost_dofs_periodic_01.mpirun=7.release
11452/11561 Test  #8282: mpi/mg_ghost_dofs_periodic_01.mpirun=7.release .........................................   Passed    4.11 sec
            Start  8293: mpi/mg_ghost_dofs_periodic_06.mpirun=7.debug
11453/11561 Test  #7555: matrix_free/parallel_multigrid_mf.mpirun=7.debug .......................................   Passed   75.68 sec
            Start  8294: mpi/mg_ghost_dofs_periodic_06.mpirun=7.release
11454/11561 Test  #8278: mpi/mg_06.mpirun=7.release .............................................................   Passed   19.57 sec
            Start  8307: mpi/muelu_periodicity.mpirun=7.debug
11455/11561 Test  #7556: matrix_free/parallel_multigrid_mf.mpirun=7.release .....................................   Passed   81.70 sec
            Start  8308: mpi/muelu_periodicity.mpirun=7.release
11456/11561 Test  #8307: mpi/muelu_periodicity.mpirun=7.debug ...................................................   Passed    4.63 sec
            Start  8670: mpi/periodicity_02.mpirun=7.debug
11457/11561 Test  #8308: mpi/muelu_periodicity.mpirun=7.release .................................................   Passed    5.71 sec
            Start  8671: mpi/periodicity_02.mpirun=7.release
11458/11561 Test  #8670: mpi/periodicity_02.mpirun=7.debug ......................................................   Passed    4.66 sec
            Start  8678: mpi/periodicity_04.mpirun=7.debug
11459/11561 Test  #8671: mpi/periodicity_02.mpirun=7.release ....................................................   Passed    6.06 sec
            Start  8679: mpi/periodicity_04.mpirun=7.release
11460/11561 Test  #8294: mpi/mg_ghost_dofs_periodic_06.mpirun=7.release .........................................   Passed   20.77 sec
            Start  8700: mpi/point_value_01.mpirun=6.debug
11461/11561 Test  #8293: mpi/mg_ghost_dofs_periodic_06.mpirun=7.debug ...........................................   Passed   24.19 sec
            Start  8701: mpi/point_value_01.mpirun=6.release
11462/11561 Test  #8679: mpi/periodicity_04.mpirun=7.release ....................................................   Passed    5.44 sec
            Start  8838: mpi/step-37.mpirun=7.debug
11463/11561 Test  #8700: mpi/point_value_01.mpirun=6.debug ......................................................   Passed    4.33 sec
            Start  8839: mpi/step-37.mpirun=7.release
11464/11561 Test  #8701: mpi/point_value_01.mpirun=6.release ....................................................   Passed    3.82 sec
            Start  8846: mpi/step-39.mpirun=6.debug
11465/11561 Test  #8839: mpi/step-37.mpirun=7.release ...........................................................   Passed   10.50 sec
            Start  8847: mpi/step-39.mpirun=6.release
11466/11561 Test  #8847: mpi/step-39.mpirun=6.release ...........................................................   Passed   72.67 sec
            Start  8868: mpi/tria_ghost_owners_01.mpirun=7.debug
11467/11561 Test  #8838: mpi/step-37.mpirun=7.debug .............................................................   Passed  103.31 sec
            Start  8869: mpi/tria_ghost_owners_01.mpirun=7.release
11468/11561 Test  #8846: mpi/step-39.mpirun=6.debug .............................................................   Passed  103.11 sec
            Start  9133: multigrid/step-16-50-mpi.mpirun=7.debug
11469/11561 Test  #8678: mpi/periodicity_04.mpirun=7.debug ......................................................   Passed  116.50 sec
            Start  9134: multigrid/step-16-50-mpi.mpirun=7.release
11470/11561 Test  #9134: multigrid/step-16-50-mpi.mpirun=7.release ..............................................   Passed    2.28 sec
            Start  9183: multigrid/transfer_matrix_free_01.mpirun=7.debug
11471/11561 Test  #9133: multigrid/step-16-50-mpi.mpirun=7.debug ................................................   Passed    4.34 sec
            Start  9184: multigrid/transfer_matrix_free_01.mpirun=7.release
11472/11561 Test  #9184: multigrid/transfer_matrix_free_01.mpirun=7.release .....................................   Passed    2.37 sec
            Start  9199: multigrid/transfer_matrix_free_04.mpirun=7.debug
11473/11561 Test  #8869: mpi/tria_ghost_owners_01.mpirun=7.release ..............................................   Passed   65.26 sec
            Start  9200: multigrid/transfer_matrix_free_04.mpirun=7.release
11474/11561 Test  #8868: mpi/tria_ghost_owners_01.mpirun=7.debug ................................................   Passed  117.56 sec
11475/11561 Test  #9200: multigrid/transfer_matrix_free_04.mpirun=7.release .....................................   Passed   46.10 sec
            Start  7436: matrix_free/matrix_vector_faces_16.mpirun=11.debug
11476/11561 Test  #9183: multigrid/transfer_matrix_free_01.mpirun=7.debug .......................................   Passed  114.41 sec
            Start  7705: mpi/attach_data_01.mpirun=8.debug
11477/11561 Test  #7705: mpi/attach_data_01.mpirun=8.debug ......................................................   Passed    3.48 sec
            Start  7706: mpi/attach_data_01.mpirun=8.release
11478/11561 Test  #9199: multigrid/transfer_matrix_free_04.mpirun=7.debug .......................................   Passed  116.37 sec
11479/11561 Test  #7706: mpi/attach_data_01.mpirun=8.release ....................................................   Passed    4.14 sec
            Start  7437: matrix_free/matrix_vector_faces_16.mpirun=11.release
11480/11561 Test  #7436: matrix_free/matrix_vector_faces_16.mpirun=11.debug .....................................   Passed   39.72 sec
            Start  7711: mpi/attach_data_02.mpirun=8.debug
11481/11561 Test  #7711: mpi/attach_data_02.mpirun=8.debug ......................................................   Passed    3.23 sec
            Start  7712: mpi/attach_data_02.mpirun=8.release
11482/11561 Test  #7712: mpi/attach_data_02.mpirun=8.release ....................................................   Passed    3.11 sec
            Start  7723: mpi/cell_data_transfer_01.mpirun=8.debug
11483/11561 Test  #7437: matrix_free/matrix_vector_faces_16.mpirun=11.release ...................................   Passed   35.03 sec
            Start  7724: mpi/cell_data_transfer_01.mpirun=8.release
            Start  7727: mpi/cell_data_transfer_02.mpirun=8.debug
11484/11561 Test  #7723: mpi/cell_data_transfer_01.mpirun=8.debug ...............................................   Passed    3.80 sec
            Start  7728: mpi/cell_data_transfer_02.mpirun=8.release
11485/11561 Test  #7724: mpi/cell_data_transfer_01.mpirun=8.release .............................................   Passed    4.46 sec
            Start  7731: mpi/cell_data_transfer_03.mpirun=8.debug
11486/11561 Test  #7727: mpi/cell_data_transfer_02.mpirun=8.debug ...............................................   Passed    4.56 sec
            Start  7732: mpi/cell_data_transfer_03.mpirun=8.release
11487/11561 Test  #7728: mpi/cell_data_transfer_02.mpirun=8.release .............................................   Passed    4.48 sec
            Start  7995: mpi/distort_random_01.mpirun=8.debug
11488/11561 Test  #7731: mpi/cell_data_transfer_03.mpirun=8.debug ...............................................   Passed    4.67 sec
            Start  7996: mpi/distort_random_01.mpirun=8.release
11489/11561 Test  #7732: mpi/cell_data_transfer_03.mpirun=8.release .............................................   Passed    4.63 sec
            Start  8001: mpi/distort_random_02.mpirun=8.debug
11490/11561 Test  #7995: mpi/distort_random_01.mpirun=8.debug ...................................................   Passed    5.15 sec
            Start  8002: mpi/distort_random_02.mpirun=8.release
11491/11561 Test  #7996: mpi/distort_random_01.mpirun=8.release .................................................   Passed    5.54 sec
            Start  8085: mpi/hp_active_fe_indices_transfer_01.mpirun=8.debug
11492/11561 Test  #8002: mpi/distort_random_02.mpirun=8.release .................................................   Passed    5.36 sec
            Start  8086: mpi/hp_active_fe_indices_transfer_01.mpirun=8.release
11493/11561 Test  #8001: mpi/distort_random_02.mpirun=8.debug ...................................................   Passed    6.11 sec
            Start  8089: mpi/hp_active_fe_indices_transfer_02.mpirun=8.debug
11494/11561 Test  #8086: mpi/hp_active_fe_indices_transfer_01.mpirun=8.release ..................................   Passed    3.93 sec
            Start  8090: mpi/hp_active_fe_indices_transfer_02.mpirun=8.release
11495/11561 Test  #8085: mpi/hp_active_fe_indices_transfer_01.mpirun=8.debug ....................................   Passed    4.83 sec
            Start  8093: mpi/hp_active_fe_indices_transfer_03.mpirun=8.debug
11496/11561 Test  #8089: mpi/hp_active_fe_indices_transfer_02.mpirun=8.debug ....................................   Passed    4.43 sec
            Start  8094: mpi/hp_active_fe_indices_transfer_03.mpirun=8.release
11497/11561 Test  #8093: mpi/hp_active_fe_indices_transfer_03.mpirun=8.debug ....................................   Passed    3.97 sec
            Start  8317: mpi/no_flux_constraints.mpirun=9.debug
11498/11561 Test  #8094: mpi/hp_active_fe_indices_transfer_03.mpirun=8.release ..................................   Passed    3.83 sec
            Start  8318: mpi/no_flux_constraints.mpirun=9.release
11499/11561 Test  #8090: mpi/hp_active_fe_indices_transfer_02.mpirun=8.release ..................................   Passed    4.52 sec
            Start  8321: mpi/no_flux_constraints_02.mpirun=9.debug
11500/11561 Test  #8321: mpi/no_flux_constraints_02.mpirun=9.debug ..............................................   Passed   11.87 sec
            Start  8322: mpi/no_flux_constraints_02.mpirun=9.release
11501/11561 Test  #8322: mpi/no_flux_constraints_02.mpirun=9.release ............................................   Passed    5.43 sec
            Start  8325: mpi/no_flux_constraints_03.mpirun=9.debug
11502/11561 Test  #8325: mpi/no_flux_constraints_03.mpirun=9.debug ..............................................   Passed    5.52 sec
            Start  8326: mpi/no_flux_constraints_03.mpirun=9.release
11503/11561 Test  #8318: mpi/no_flux_constraints.mpirun=9.release ...............................................   Passed   23.11 sec
            Start  8327: mpi/normal_flux_constraints.mpirun=9.debug
11504/11561 Test  #8326: mpi/no_flux_constraints_03.mpirun=9.release ............................................   Passed    5.92 sec
            Start  8328: mpi/normal_flux_constraints.mpirun=9.release
11505/11561 Test  #8317: mpi/no_flux_constraints.mpirun=9.debug .................................................   Passed   33.17 sec
            Start  8472: mpi/p_adaptivity_fixed_number.mpirun=8.debug
11506/11561 Test  #8472: mpi/p_adaptivity_fixed_number.mpirun=8.debug ...........................................   Passed    3.24 sec
            Start  8473: mpi/p_adaptivity_fixed_number.mpirun=8.release
11507/11561 Test  #8473: mpi/p_adaptivity_fixed_number.mpirun=8.release .........................................   Passed    3.16 sec
            Start  8478: mpi/p_refinement_and_coarsening.mpirun=8.debug
11508/11561 Test  #8478: mpi/p_refinement_and_coarsening.mpirun=8.debug .........................................   Passed    3.26 sec
            Start  8479: mpi/p_refinement_and_coarsening.mpirun=8.release
11509/11561 Test  #8479: mpi/p_refinement_and_coarsening.mpirun=8.release .......................................   Passed    2.99 sec
            Start  8680: mpi/periodicity_05.mpirun=9.debug
11510/11561 Test  #8328: mpi/normal_flux_constraints.mpirun=9.release ...........................................   Passed   24.90 sec
            Start  8681: mpi/periodicity_05.mpirun=9.release
11511/11561 Test  #8327: mpi/normal_flux_constraints.mpirun=9.debug .............................................   Passed   32.50 sec
            Start  9022: multigrid/constrained_dofs_02.mpirun=8.debug
11512/11561 Test  #9022: multigrid/constrained_dofs_02.mpirun=8.debug ...........................................   Passed    1.16 sec
            Start  9023: multigrid/constrained_dofs_02.mpirun=8.release
11513/11561 Test  #9023: multigrid/constrained_dofs_02.mpirun=8.release .........................................   Passed    0.70 sec
            Start  9153: multigrid/step-50_01.mpirun=8.debug
11514/11561 Test  #9153: multigrid/step-50_01.mpirun=8.debug ....................................................   Passed    1.61 sec
            Start  9154: multigrid/step-50_01.mpirun=8.release
11515/11561 Test  #9154: multigrid/step-50_01.mpirun=8.release ..................................................   Passed    1.07 sec
            Start 10252: remote_point_evaluation/remote_point_evaluation_03.mpirun=8.debug
11516/11561 Test  #8680: mpi/periodicity_05.mpirun=9.debug ......................................................   Passed   27.25 sec
            Start 10253: remote_point_evaluation/remote_point_evaluation_03.mpirun=8.release
11517/11561 Test  #8681: mpi/periodicity_05.mpirun=9.release ....................................................   Passed   21.28 sec
            Start 10254: remote_point_evaluation/vector_tools_evaluate_at_points_01.mpirun=8.debug
11518/11561 Test #10252: remote_point_evaluation/remote_point_evaluation_03.mpirun=8.debug ......................   Passed   40.74 sec
            Start 10255: remote_point_evaluation/vector_tools_evaluate_at_points_01.mpirun=8.release
11519/11561 Test #10253: remote_point_evaluation/remote_point_evaluation_03.mpirun=8.release ....................   Passed   34.14 sec
            Start 10256: remote_point_evaluation/vector_tools_evaluate_at_points_02.mpirun=8.debug
11520/11561 Test #10254: remote_point_evaluation/vector_tools_evaluate_at_points_01.mpirun=8.debug ..............   Passed   32.25 sec
            Start 10257: remote_point_evaluation/vector_tools_evaluate_at_points_02.mpirun=8.release
11521/11561 Test #10255: remote_point_evaluation/vector_tools_evaluate_at_points_01.mpirun=8.release ............   Passed   28.09 sec
            Start 11100: trilinos/n_nonzeros_02_parallel.mpirun=9.debug
11522/11561 Test #10257: remote_point_evaluation/vector_tools_evaluate_at_points_02.mpirun=8.release ............***Failed   35.19 sec
            Start 11101: trilinos/n_nonzeros_02_parallel.mpirun=9.release
11523/11561 Test #10256: remote_point_evaluation/vector_tools_evaluate_at_points_02.mpirun=8.debug ..............***Failed   40.03 sec
11524/11561 Test #11100: trilinos/n_nonzeros_02_parallel.mpirun=9.debug .........................................   Passed   19.42 sec
            Start  8069: mpi/fe_tools_extrapolate_06.mpirun=10.debug
11525/11561 Test  #8069: mpi/fe_tools_extrapolate_06.mpirun=10.debug ............................................   Passed    6.74 sec
            Start  8070: mpi/fe_tools_extrapolate_06.mpirun=10.release
11526/11561 Test  #8070: mpi/fe_tools_extrapolate_06.mpirun=10.release ..........................................   Passed    3.96 sec
            Start  8075: mpi/has_active_dofs_01.mpirun=10.debug
11527/11561 Test #11101: trilinos/n_nonzeros_02_parallel.mpirun=9.release .......................................   Passed   17.48 sec
            Start  8076: mpi/has_active_dofs_01.mpirun=10.release
11528/11561 Test  #8076: mpi/has_active_dofs_01.mpirun=10.release ...............................................   Passed   19.00 sec
            Start  8077: mpi/has_active_dofs_02.mpirun=10.debug
11529/11561 Test  #8075: mpi/has_active_dofs_01.mpirun=10.debug .................................................   Passed   22.49 sec
            Start  8078: mpi/has_active_dofs_02.mpirun=10.release
11530/11561 Test  #8078: mpi/has_active_dofs_02.mpirun=10.release ...............................................   Passed   15.93 sec
            Start  8161: mpi/hp_unify_dof_indices_09.mpirun=10.debug
11531/11561 Test  #8077: mpi/has_active_dofs_02.mpirun=10.debug .................................................   Passed   21.87 sec
            Start  8162: mpi/hp_unify_dof_indices_09.mpirun=10.release
11532/11561 Test  #8162: mpi/hp_unify_dof_indices_09.mpirun=10.release ..........................................   Passed   18.88 sec
            Start  8275: mpi/mg_05.mpirun=10.debug
11533/11561 Test  #8161: mpi/hp_unify_dof_indices_09.mpirun=10.debug ............................................   Passed   22.21 sec
            Start  8276: mpi/mg_05.mpirun=10.release
11534/11561 Test  #8276: mpi/mg_05.mpirun=10.release ............................................................   Passed   18.00 sec
            Start  8524: mpi/parallel_block_vector_13.mpirun=10.debug
11535/11561 Test  #8275: mpi/mg_05.mpirun=10.debug ..............................................................   Passed   26.85 sec
            Start  8525: mpi/parallel_block_vector_13.mpirun=10.release
11536/11561 Test  #8524: mpi/parallel_block_vector_13.mpirun=10.debug ...........................................   Passed   14.76 sec
            Start  8684: mpi/periodicity_07.mpirun=13.debug
11537/11561 Test  #8525: mpi/parallel_block_vector_13.mpirun=10.release .........................................   Passed   14.50 sec
            Start  8685: mpi/periodicity_07.mpirun=13.release
11538/11561 Test  #8684: mpi/periodicity_07.mpirun=13.debug .....................................................   Passed   34.67 sec
11539/11561 Test  #8685: mpi/periodicity_07.mpirun=13.release ...................................................   Passed   29.61 sec
            Start  8289: mpi/mg_ghost_dofs_periodic_05.mpirun=28.debug
11540/11561 Test  #8289: mpi/mg_ghost_dofs_periodic_05.mpirun=28.debug ..........................................   Passed   44.62 sec
            Start  8290: mpi/mg_ghost_dofs_periodic_05.mpirun=28.release
11541/11561 Test  #8290: mpi/mg_ghost_dofs_periodic_05.mpirun=28.release ........................................   Passed   23.03 sec
            Start  8441: mpi/p4est_3d_refine_04.mpirun=24.debug
11542/11561 Test  #8441: mpi/p4est_3d_refine_04.mpirun=24.debug .................................................   Passed   10.60 sec
            Start  8442: mpi/p4est_3d_refine_04.mpirun=24.release
11543/11561 Test  #8442: mpi/p4est_3d_refine_04.mpirun=24.release ...............................................   Passed    3.87 sec
            Start  8768: mpi/refinement_listener_01.mpirun=20.debug
            Start  8443: mpi/p4est_3d_refine_04.mpirun=4.debug
11544/11561 Test  #8768: mpi/refinement_listener_01.mpirun=20.debug .............................................   Passed    4.44 sec
            Start  8769: mpi/refinement_listener_01.mpirun=20.release
11545/11561 Test  #8769: mpi/refinement_listener_01.mpirun=20.release ...........................................   Passed    3.58 sec
            Start  8774: mpi/refinement_listener_02.mpirun=20.debug
11546/11561 Test  #8443: mpi/p4est_3d_refine_04.mpirun=4.debug ..................................................   Passed   10.24 sec
            Start  8444: mpi/p4est_3d_refine_04.mpirun=4.release
11547/11561 Test  #8774: mpi/refinement_listener_02.mpirun=20.debug .............................................   Passed    4.70 sec
            Start  8775: mpi/refinement_listener_02.mpirun=20.release
11548/11561 Test  #8444: mpi/p4est_3d_refine_04.mpirun=4.release ................................................   Passed    3.69 sec
            Start  8770: mpi/refinement_listener_01.mpirun=4.debug
11549/11561 Test  #8775: mpi/refinement_listener_02.mpirun=20.release ...........................................   Passed    3.38 sec
            Start  9039: multigrid/distribute_bug_01.mpirun=20.debug
11550/11561 Test  #8770: mpi/refinement_listener_01.mpirun=4.debug ..............................................   Passed    5.02 sec
            Start  8771: mpi/refinement_listener_01.mpirun=4.release
11551/11561 Test  #8771: mpi/refinement_listener_01.mpirun=4.release ............................................   Passed    3.57 sec
            Start  8776: mpi/refinement_listener_02.mpirun=4.debug
11552/11561 Test  #9039: multigrid/distribute_bug_01.mpirun=20.debug ............................................   Passed    6.80 sec
            Start  9040: multigrid/distribute_bug_01.mpirun=20.release
11553/11561 Test  #9040: multigrid/distribute_bug_01.mpirun=20.release ..........................................   Passed    1.35 sec
            Start  8291: mpi/mg_ghost_dofs_periodic_05.mpirun=6.debug
            Start  8292: mpi/mg_ghost_dofs_periodic_05.mpirun=6.release
            Start  8777: mpi/refinement_listener_02.mpirun=4.release
11554/11561 Test  #8776: mpi/refinement_listener_02.mpirun=4.debug ..............................................   Passed    3.70 sec
            Start  9041: multigrid/distribute_bug_01.mpirun=6.debug
11555/11561 Test  #8777: mpi/refinement_listener_02.mpirun=4.release ............................................   Passed    3.51 sec
            Start  9042: multigrid/distribute_bug_01.mpirun=6.release
11556/11561 Test  #8292: mpi/mg_ghost_dofs_periodic_05.mpirun=6.release .........................................   Passed    5.03 sec
11557/11561 Test  #9041: multigrid/distribute_bug_01.mpirun=6.debug .............................................   Passed    4.24 sec
11558/11561 Test  #9042: multigrid/distribute_bug_01.mpirun=6.release ...........................................   Passed    2.73 sec
11559/11561 Test  #8291: mpi/mg_ghost_dofs_periodic_05.mpirun=6.debug ...........................................   Passed   23.53 sec
            Start  8297: mpi/mg_ghost_dofs_periodic_07.mpirun=43.debug
11560/11561 Test  #8297: mpi/mg_ghost_dofs_periodic_07.mpirun=43.debug ..........................................   Passed    8.27 sec
            Start  8298: mpi/mg_ghost_dofs_periodic_07.mpirun=43.release
11561/11561 Test  #8298: mpi/mg_ghost_dofs_periodic_07.mpirun=43.release ........................................   Passed    4.36 sec

99% tests passed, 20 tests failed out of 11561

Total Test time (real) = 25658.21 sec

The following tests FAILED:
	2919 - cuda/precondition_03.mpirun=2.debug (Failed)
	2935 - cuda/solver_08.debug (Failed)
	2936 - cuda/solver_08.release (Failed)
	3173 - distributed_grids/3d_coarse_grid_02.debug (Failed)
	4862 - fullydistributed_grids/repartitioning_05.mpirun=4.debug (Failed)
	4863 - fullydistributed_grids/repartitioning_05.mpirun=4.release (Failed)
	5661 - hp/distribute_dofs_linear_time.debug (Timeout)
	7474 - matrix_free/matrix_vector_hessians_faces.debug (Failed)
	7475 - matrix_free/matrix_vector_hessians_faces.release (Failed)
	8055 - mpi/fe_tools_extrapolate_01.mpirun=3.debug (Failed)
	8056 - mpi/fe_tools_extrapolate_01.mpirun=3.release (Failed)
	8061 - mpi/fe_tools_extrapolate_03.mpirun=3.debug (Failed)
	8062 - mpi/fe_tools_extrapolate_03.mpirun=3.release (Failed)
	8065 - mpi/fe_tools_extrapolate_04.mpirun=3.debug (Failed)
	8066 - mpi/fe_tools_extrapolate_04.mpirun=3.release (Failed)
	10081 - particles/generators_11.mpirun=3.release (Failed)
	10256 - remote_point_evaluation/vector_tools_evaluate_at_points_02.mpirun=8.debug (Failed)
	10257 - remote_point_evaluation/vector_tools_evaluate_at_points_02.mpirun=8.release (Failed)
	11094 - trilinos/mg_transfer_prebuilt_01.mpirun=1.debug (Failed)
	11095 - trilinos/mg_transfer_prebuilt_01.mpirun=1.release (Failed)
-- Running CTEST_SUBMIT()
	Add file: /home/build/revision.log
	Add file: /home/build/summary.log
	Add file: /home/build/detailed.log
	Add file: /home/build/include/deal.II/base/config.h
Submit files
   Send to group: Continuous
   SubmitURL: https://cdash.43-1.org/submit.php?project=deal.II
   Uploaded: /home/build/Testing/20210904-0500/Update.xml
   Uploaded: /home/build/Testing/20210904-0500/Configure.xml
   Uploaded: /home/build/Testing/20210904-0500/Build.xml
   Error when uploading file: /home/build/Testing/20210904-0500/Test.xml
   Error message was: Operation too slow. Less than 1 bytes/sec transferred the last 120 seconds
   Problems when submitting via HTTP
+ docker stop cuda11_deal_ci
cuda11_deal_ci
+ docker rm -f cuda11_deal_ci
cuda11_deal_ci
INFO: Processing CTest-Version 3.x (default)
INFO: [CTest-Version 3.x (default)] - 1 test report file(s) were found with the pattern 'build/Testing/**/Test.xml' relative to '/var/jenkins/workspace/deal.II-CUDA11.0' for the testing framework 'CTest-Version 3.x (default)'.
INFO: Check 'Failed Tests' threshold.
INFO: The total number of tests for the threshold 'Failed Tests' exceeds the specified "failure threshold" value.
INFO: Setting the build status to FAILURE
Build step 'Publish xUnit test result report' changed build result to FAILURE
Finished: FAILURE