Console Output

Skipping 2,196 KB.. Full Log
            Start  8194: mpi/interpolate_03.mpirun=4.release
11094/11561 Test  #8191: mpi/interpolate_03.mpirun=10.debug .....................................................   Passed   25.30 sec
            Start  8202: mpi/is_locally_owned.mpirun=10.release
11095/11561 Test  #8194: mpi/interpolate_03.mpirun=4.release ....................................................   Passed    3.08 sec
            Start  8193: mpi/interpolate_03.mpirun=4.debug
11096/11561 Test  #8193: mpi/interpolate_03.mpirun=4.debug ......................................................   Passed    3.26 sec
11097/11561 Test  #8202: mpi/is_locally_owned.mpirun=10.release .................................................   Passed   18.96 sec
            Start  8227: mpi/make_zero_boundary_values.mpirun=10.debug
            Start  8204: mpi/is_locally_owned.mpirun=4.release
11098/11561 Test  #8201: mpi/is_locally_owned.mpirun=10.debug ...................................................   Passed   22.46 sec
            Start  8228: mpi/make_zero_boundary_values.mpirun=10.release
11099/11561 Test  #8204: mpi/is_locally_owned.mpirun=4.release ..................................................   Passed    3.19 sec
            Start  8203: mpi/is_locally_owned.mpirun=4.debug
11100/11561 Test  #8203: mpi/is_locally_owned.mpirun=4.debug ....................................................   Passed    3.18 sec
11101/11561 Test  #8227: mpi/make_zero_boundary_values.mpirun=10.debug ..........................................   Passed   22.11 sec
            Start  8231: mpi/map_dofs_to_support_points.mpirun=10.debug
            Start  8229: mpi/make_zero_boundary_values.mpirun=4.debug
11102/11561 Test  #8228: mpi/make_zero_boundary_values.mpirun=10.release ........................................   Passed   20.58 sec
            Start  8232: mpi/map_dofs_to_support_points.mpirun=10.release
11103/11561 Test  #8229: mpi/make_zero_boundary_values.mpirun=4.debug ...........................................   Passed    3.59 sec
            Start  8230: mpi/make_zero_boundary_values.mpirun=4.release
11104/11561 Test  #8230: mpi/make_zero_boundary_values.mpirun=4.release .........................................   Passed    2.96 sec
11105/11561 Test  #8232: mpi/map_dofs_to_support_points.mpirun=10.release .......................................   Passed   19.16 sec
            Start  8253: mpi/mg_01.mpirun=10.debug
            Start  8234: mpi/map_dofs_to_support_points.mpirun=4.release
11106/11561 Test  #8231: mpi/map_dofs_to_support_points.mpirun=10.debug .........................................   Passed   21.73 sec
            Start  8254: mpi/mg_01.mpirun=10.release
11107/11561 Test  #8234: mpi/map_dofs_to_support_points.mpirun=4.release ........................................   Passed    3.02 sec
            Start  8233: mpi/map_dofs_to_support_points.mpirun=4.debug
11108/11561 Test  #8233: mpi/map_dofs_to_support_points.mpirun=4.debug ..........................................   Passed    3.21 sec
11109/11561 Test  #8254: mpi/mg_01.mpirun=10.release ............................................................   Passed   15.98 sec
            Start  8257: mpi/mg_02.mpirun=10.debug
            Start  8256: mpi/mg_01.mpirun=4.release
11110/11561 Test  #8253: mpi/mg_01.mpirun=10.debug ..............................................................   Passed   18.77 sec
            Start  8258: mpi/mg_02.mpirun=10.release
11111/11561 Test  #8256: mpi/mg_01.mpirun=4.release .............................................................   Passed    3.05 sec
            Start  8255: mpi/mg_01.mpirun=4.debug
11112/11561 Test  #8255: mpi/mg_01.mpirun=4.debug ...............................................................   Passed    3.06 sec
11113/11561 Test  #8258: mpi/mg_02.mpirun=10.release ............................................................   Passed   23.22 sec
            Start  8263: mpi/mg_03.mpirun=10.debug
            Start  8260: mpi/mg_02.mpirun=4.release
11114/11561 Test  #8257: mpi/mg_02.mpirun=10.debug ..............................................................   Passed   25.59 sec
            Start  8264: mpi/mg_03.mpirun=10.release
11115/11561 Test  #8260: mpi/mg_02.mpirun=4.release .............................................................   Passed    3.05 sec
            Start  8259: mpi/mg_02.mpirun=4.debug
11116/11561 Test  #8263: mpi/mg_03.mpirun=10.debug ..............................................................   Passed    3.34 sec
            Start  8333: mpi/p4est_2d_coarse_01.mpirun=10.debug
11117/11561 Test  #8264: mpi/mg_03.mpirun=10.release ............................................................   Passed    3.14 sec
            Start  8334: mpi/p4est_2d_coarse_01.mpirun=10.release
11118/11561 Test  #8259: mpi/mg_02.mpirun=4.debug ...............................................................   Passed    3.18 sec
            Start  8265: mpi/mg_03.mpirun=4.debug
11119/11561 Test  #8265: mpi/mg_03.mpirun=4.debug ...............................................................   Passed    3.22 sec
            Start  8266: mpi/mg_03.mpirun=4.release
11120/11561 Test  #8266: mpi/mg_03.mpirun=4.release .............................................................   Passed    2.86 sec
11121/11561 Test  #8334: mpi/p4est_2d_coarse_01.mpirun=10.release ...............................................   Passed   19.36 sec
            Start  8337: mpi/p4est_2d_constraintmatrix_01.mpirun=10.debug
            Start  8336: mpi/p4est_2d_coarse_01.mpirun=4.release
11122/11561 Test  #8336: mpi/p4est_2d_coarse_01.mpirun=4.release ................................................   Passed    3.53 sec
11123/11561 Test  #8333: mpi/p4est_2d_coarse_01.mpirun=10.debug .................................................   Passed   33.79 sec
            Start  8338: mpi/p4est_2d_constraintmatrix_01.mpirun=10.release
            Start  8335: mpi/p4est_2d_coarse_01.mpirun=4.debug
11124/11561 Test  #8337: mpi/p4est_2d_constraintmatrix_01.mpirun=10.debug .......................................   Passed   20.80 sec
            Start  8341: mpi/p4est_2d_constraintmatrix_02.mpirun=10.debug
11125/11561 Test  #8335: mpi/p4est_2d_coarse_01.mpirun=4.debug ..................................................   Passed   13.94 sec
            Start  8339: mpi/p4est_2d_constraintmatrix_01.mpirun=4.debug
11126/11561 Test  #8339: mpi/p4est_2d_constraintmatrix_01.mpirun=4.debug ........................................   Passed    3.04 sec
11127/11561 Test  #8338: mpi/p4est_2d_constraintmatrix_01.mpirun=10.release .....................................   Passed   17.87 sec
            Start  8342: mpi/p4est_2d_constraintmatrix_02.mpirun=10.release
            Start  8340: mpi/p4est_2d_constraintmatrix_01.mpirun=4.release
11128/11561 Test  #8340: mpi/p4est_2d_constraintmatrix_01.mpirun=4.release ......................................   Passed    3.07 sec
11129/11561 Test  #8341: mpi/p4est_2d_constraintmatrix_02.mpirun=10.debug .......................................   Passed   21.42 sec
            Start  8345: mpi/p4est_2d_constraintmatrix_03.mpirun=10.debug
            Start  8343: mpi/p4est_2d_constraintmatrix_02.mpirun=4.debug
11130/11561 Test  #8343: mpi/p4est_2d_constraintmatrix_02.mpirun=4.debug ........................................   Passed    3.42 sec
11131/11561 Test  #8342: mpi/p4est_2d_constraintmatrix_02.mpirun=10.release .....................................   Passed   18.53 sec
            Start  8346: mpi/p4est_2d_constraintmatrix_03.mpirun=10.release
            Start  8344: mpi/p4est_2d_constraintmatrix_02.mpirun=4.release
11132/11561 Test  #8344: mpi/p4est_2d_constraintmatrix_02.mpirun=4.release ......................................   Passed    3.09 sec
11133/11561 Test  #8345: mpi/p4est_2d_constraintmatrix_03.mpirun=10.debug .......................................   Passed   26.60 sec
            Start  8349: mpi/p4est_2d_constraintmatrix_04.mpirun=10.debug
            Start  8347: mpi/p4est_2d_constraintmatrix_03.mpirun=4.debug
11134/11561 Test  #8347: mpi/p4est_2d_constraintmatrix_03.mpirun=4.debug ........................................   Passed    3.86 sec
11135/11561 Test  #8346: mpi/p4est_2d_constraintmatrix_03.mpirun=10.release .....................................   Passed   23.44 sec
            Start  8350: mpi/p4est_2d_constraintmatrix_04.mpirun=10.release
            Start  8348: mpi/p4est_2d_constraintmatrix_03.mpirun=4.release
11136/11561 Test  #8348: mpi/p4est_2d_constraintmatrix_03.mpirun=4.release ......................................   Passed    3.15 sec
11137/11561 Test  #8349: mpi/p4est_2d_constraintmatrix_04.mpirun=10.debug .......................................   Passed   27.34 sec
            Start  8355: mpi/p4est_2d_dofhandler_01.mpirun=10.debug
            Start  8351: mpi/p4est_2d_constraintmatrix_04.mpirun=4.debug
11138/11561 Test  #8350: mpi/p4est_2d_constraintmatrix_04.mpirun=10.release .....................................   Passed   23.22 sec
            Start  8356: mpi/p4est_2d_dofhandler_01.mpirun=10.release
11139/11561 Test  #8351: mpi/p4est_2d_constraintmatrix_04.mpirun=4.debug ........................................   Passed    4.84 sec
            Start  8352: mpi/p4est_2d_constraintmatrix_04.mpirun=4.release
11140/11561 Test  #8352: mpi/p4est_2d_constraintmatrix_04.mpirun=4.release ......................................   Passed    3.19 sec
11141/11561 Test  #8356: mpi/p4est_2d_dofhandler_01.mpirun=10.release ...........................................   Passed   19.01 sec
            Start  8359: mpi/p4est_2d_dofhandler_02.mpirun=10.debug
            Start  8358: mpi/p4est_2d_dofhandler_01.mpirun=4.release
11142/11561 Test  #8358: mpi/p4est_2d_dofhandler_01.mpirun=4.release ............................................   Passed    3.00 sec
11143/11561 Test  #8355: mpi/p4est_2d_dofhandler_01.mpirun=10.debug .............................................   Passed   23.82 sec
            Start  8360: mpi/p4est_2d_dofhandler_02.mpirun=10.release
            Start  8357: mpi/p4est_2d_dofhandler_01.mpirun=4.debug
11144/11561 Test  #8357: mpi/p4est_2d_dofhandler_01.mpirun=4.debug ..............................................   Passed    3.13 sec
11145/11561 Test  #8360: mpi/p4est_2d_dofhandler_02.mpirun=10.release ...........................................   Passed   21.67 sec
            Start  8363: mpi/p4est_2d_dofhandler_03.mpirun=10.debug
            Start  8362: mpi/p4est_2d_dofhandler_02.mpirun=4.release
11146/11561 Test  #8359: mpi/p4est_2d_dofhandler_02.mpirun=10.debug .............................................   Passed   29.25 sec
            Start  8364: mpi/p4est_2d_dofhandler_03.mpirun=10.release
11147/11561 Test  #8362: mpi/p4est_2d_dofhandler_02.mpirun=4.release ............................................   Passed    3.12 sec
            Start  8361: mpi/p4est_2d_dofhandler_02.mpirun=4.debug
11148/11561 Test  #8361: mpi/p4est_2d_dofhandler_02.mpirun=4.debug ..............................................   Passed    5.07 sec
11149/11561 Test  #8364: mpi/p4est_2d_dofhandler_03.mpirun=10.release ...........................................   Passed   19.20 sec
            Start  8367: mpi/p4est_2d_dofhandler_04.mpirun=10.debug
            Start  8366: mpi/p4est_2d_dofhandler_03.mpirun=4.release
11150/11561 Test  #8366: mpi/p4est_2d_dofhandler_03.mpirun=4.release ............................................   Passed    3.26 sec
11151/11561 Test  #8363: mpi/p4est_2d_dofhandler_03.mpirun=10.debug .............................................   Passed   27.76 sec
            Start  8368: mpi/p4est_2d_dofhandler_04.mpirun=10.release
            Start  8365: mpi/p4est_2d_dofhandler_03.mpirun=4.debug
11152/11561 Test  #8365: mpi/p4est_2d_dofhandler_03.mpirun=4.debug ..............................................   Passed    5.04 sec
11153/11561 Test  #8368: mpi/p4est_2d_dofhandler_04.mpirun=10.release ...........................................   Passed   23.16 sec
            Start  8371: mpi/p4est_2d_dofhandler_05.mpirun=10.debug
            Start  8370: mpi/p4est_2d_dofhandler_04.mpirun=4.release
11154/11561 Test  #8367: mpi/p4est_2d_dofhandler_04.mpirun=10.debug .............................................   Passed   29.53 sec
            Start  8372: mpi/p4est_2d_dofhandler_05.mpirun=10.release
11155/11561 Test  #8370: mpi/p4est_2d_dofhandler_04.mpirun=4.release ............................................   Passed    3.09 sec
            Start  8369: mpi/p4est_2d_dofhandler_04.mpirun=4.debug
11156/11561 Test  #8369: mpi/p4est_2d_dofhandler_04.mpirun=4.debug ..............................................   Passed    5.30 sec
11157/11561 Test  #8372: mpi/p4est_2d_dofhandler_05.mpirun=10.release ...........................................   Passed   17.52 sec
            Start  8375: mpi/p4est_2d_ghost_01.mpirun=10.debug
            Start  8374: mpi/p4est_2d_dofhandler_05.mpirun=4.release
11158/11561 Test  #8371: mpi/p4est_2d_dofhandler_05.mpirun=10.debug .............................................   Passed   20.33 sec
            Start  8376: mpi/p4est_2d_ghost_01.mpirun=10.release
11159/11561 Test  #8374: mpi/p4est_2d_dofhandler_05.mpirun=4.release ............................................   Passed    2.99 sec
            Start  8373: mpi/p4est_2d_dofhandler_05.mpirun=4.debug
11160/11561 Test  #8373: mpi/p4est_2d_dofhandler_05.mpirun=4.debug ..............................................   Passed    3.06 sec
11161/11561 Test  #8376: mpi/p4est_2d_ghost_01.mpirun=10.release ................................................   Passed   18.59 sec
            Start  8379: mpi/p4est_2d_ghost_02.mpirun=10.debug
            Start  8378: mpi/p4est_2d_ghost_01.mpirun=4.release
11162/11561 Test  #8375: mpi/p4est_2d_ghost_01.mpirun=10.debug ..................................................   Passed   21.84 sec
            Start  8380: mpi/p4est_2d_ghost_02.mpirun=10.release
11163/11561 Test  #8378: mpi/p4est_2d_ghost_01.mpirun=4.release .................................................   Passed    3.08 sec
            Start  8377: mpi/p4est_2d_ghost_01.mpirun=4.debug
11164/11561 Test  #8377: mpi/p4est_2d_ghost_01.mpirun=4.debug ...................................................   Passed    3.25 sec
11165/11561 Test  #8380: mpi/p4est_2d_ghost_02.mpirun=10.release ................................................   Passed   18.33 sec
            Start  8383: mpi/p4est_2d_refine_01.mpirun=10.debug
            Start  8382: mpi/p4est_2d_ghost_02.mpirun=4.release
11166/11561 Test  #8379: mpi/p4est_2d_ghost_02.mpirun=10.debug ..................................................   Passed   22.22 sec
            Start  8384: mpi/p4est_2d_refine_01.mpirun=10.release
11167/11561 Test  #8382: mpi/p4est_2d_ghost_02.mpirun=4.release .................................................   Passed    3.07 sec
            Start  8381: mpi/p4est_2d_ghost_02.mpirun=4.debug
11168/11561 Test  #8381: mpi/p4est_2d_ghost_02.mpirun=4.debug ...................................................   Passed    3.26 sec
11169/11561 Test  #8384: mpi/p4est_2d_refine_01.mpirun=10.release ...............................................   Passed   18.90 sec
            Start  8387: mpi/p4est_2d_refine_02.mpirun=10.debug
            Start  8386: mpi/p4est_2d_refine_01.mpirun=4.release
11170/11561 Test  #8383: mpi/p4est_2d_refine_01.mpirun=10.debug .................................................   Passed   21.79 sec
            Start  8388: mpi/p4est_2d_refine_02.mpirun=10.release
11171/11561 Test  #8386: mpi/p4est_2d_refine_01.mpirun=4.release ................................................   Passed    3.05 sec
            Start  8385: mpi/p4est_2d_refine_01.mpirun=4.debug
11172/11561 Test  #8385: mpi/p4est_2d_refine_01.mpirun=4.debug ..................................................   Passed    3.12 sec
11173/11561 Test  #8388: mpi/p4est_2d_refine_02.mpirun=10.release ...............................................   Passed   19.16 sec
            Start  8391: mpi/p4est_2d_refine_03.mpirun=10.debug
            Start  8390: mpi/p4est_2d_refine_02.mpirun=4.release
11174/11561 Test  #8390: mpi/p4est_2d_refine_02.mpirun=4.release ................................................   Passed    3.25 sec
11175/11561 Test  #8387: mpi/p4est_2d_refine_02.mpirun=10.debug .................................................   Passed   22.63 sec
            Start  8392: mpi/p4est_2d_refine_03.mpirun=10.release
            Start  8389: mpi/p4est_2d_refine_02.mpirun=4.debug
11176/11561 Test  #8389: mpi/p4est_2d_refine_02.mpirun=4.debug ..................................................   Passed    3.21 sec
11177/11561 Test  #8392: mpi/p4est_2d_refine_03.mpirun=10.release ...............................................   Passed   18.63 sec
            Start  8395: mpi/p4est_2d_renumber_01.mpirun=10.debug
            Start  8394: mpi/p4est_2d_refine_03.mpirun=4.release
11178/11561 Test  #8391: mpi/p4est_2d_refine_03.mpirun=10.debug .................................................   Passed   22.97 sec
            Start  8396: mpi/p4est_2d_renumber_01.mpirun=10.release
11179/11561 Test  #8394: mpi/p4est_2d_refine_03.mpirun=4.release ................................................   Passed    3.09 sec
            Start  8393: mpi/p4est_2d_refine_03.mpirun=4.debug
11180/11561 Test  #8393: mpi/p4est_2d_refine_03.mpirun=4.debug ..................................................   Passed    4.46 sec
11181/11561 Test  #8396: mpi/p4est_2d_renumber_01.mpirun=10.release .............................................   Passed   20.51 sec
            Start  8399: mpi/p4est_2d_renumber_02.mpirun=10.debug
            Start  8398: mpi/p4est_2d_renumber_01.mpirun=4.release
11182/11561 Test  #8395: mpi/p4est_2d_renumber_01.mpirun=10.debug ...............................................   Passed   22.64 sec
            Start  8400: mpi/p4est_2d_renumber_02.mpirun=10.release
11183/11561 Test  #8398: mpi/p4est_2d_renumber_01.mpirun=4.release ..............................................   Passed    3.05 sec
            Start  8397: mpi/p4est_2d_renumber_01.mpirun=4.debug
11184/11561 Test  #8397: mpi/p4est_2d_renumber_01.mpirun=4.debug ................................................   Passed    3.30 sec
11185/11561 Test  #8400: mpi/p4est_2d_renumber_02.mpirun=10.release .............................................   Passed   24.56 sec
            Start  8403: mpi/p4est_2d_simple.mpirun=10.debug
            Start  8402: mpi/p4est_2d_renumber_02.mpirun=4.release
11186/11561 Test  #8399: mpi/p4est_2d_renumber_02.mpirun=10.debug ...............................................   Passed   25.74 sec
            Start  8404: mpi/p4est_2d_simple.mpirun=10.release
11187/11561 Test  #8402: mpi/p4est_2d_renumber_02.mpirun=4.release ..............................................   Passed    3.07 sec
            Start  8401: mpi/p4est_2d_renumber_02.mpirun=4.debug
11188/11561 Test  #8401: mpi/p4est_2d_renumber_02.mpirun=4.debug ................................................   Passed    3.08 sec
11189/11561 Test  #8404: mpi/p4est_2d_simple.mpirun=10.release ..................................................   Passed   14.70 sec
            Start  8407: mpi/p4est_3d_constraintmatrix_01.mpirun=10.debug
            Start  8406: mpi/p4est_2d_simple.mpirun=4.release
11190/11561 Test  #8403: mpi/p4est_2d_simple.mpirun=10.debug ....................................................   Passed   17.64 sec
            Start  8408: mpi/p4est_3d_constraintmatrix_01.mpirun=10.release
11191/11561 Test  #8406: mpi/p4est_2d_simple.mpirun=4.release ...................................................   Passed    3.11 sec
            Start  8405: mpi/p4est_2d_simple.mpirun=4.debug
11192/11561 Test  #8405: mpi/p4est_2d_simple.mpirun=4.debug .....................................................   Passed    3.09 sec
11193/11561 Test  #8407: mpi/p4est_3d_constraintmatrix_01.mpirun=10.debug .......................................   Passed   23.39 sec
            Start  8411: mpi/p4est_3d_constraintmatrix_02.mpirun=10.debug
            Start  8409: mpi/p4est_3d_constraintmatrix_01.mpirun=4.debug
11194/11561 Test  #8408: mpi/p4est_3d_constraintmatrix_01.mpirun=10.release .....................................   Passed   20.50 sec
            Start  8412: mpi/p4est_3d_constraintmatrix_02.mpirun=10.release
11195/11561 Test  #8409: mpi/p4est_3d_constraintmatrix_01.mpirun=4.debug ........................................   Passed    4.81 sec
            Start  8410: mpi/p4est_3d_constraintmatrix_01.mpirun=4.release
11196/11561 Test  #8410: mpi/p4est_3d_constraintmatrix_01.mpirun=4.release ......................................   Passed    3.04 sec
11197/11561 Test  #8412: mpi/p4est_3d_constraintmatrix_02.mpirun=10.release .....................................   Passed   17.80 sec
            Start  8415: mpi/p4est_3d_constraintmatrix_03.mpirun=10.debug
            Start  8414: mpi/p4est_3d_constraintmatrix_02.mpirun=4.release
11198/11561 Test  #8414: mpi/p4est_3d_constraintmatrix_02.mpirun=4.release ......................................   Passed    3.12 sec
11199/11561 Test  #8411: mpi/p4est_3d_constraintmatrix_02.mpirun=10.debug .......................................   Passed   21.00 sec
            Start  8416: mpi/p4est_3d_constraintmatrix_03.mpirun=10.release
            Start  8413: mpi/p4est_3d_constraintmatrix_02.mpirun=4.debug
11200/11561 Test  #8413: mpi/p4est_3d_constraintmatrix_02.mpirun=4.debug ........................................   Passed    3.26 sec
11201/11561 Test  #8416: mpi/p4est_3d_constraintmatrix_03.mpirun=10.release .....................................   Passed   34.45 sec
            Start  8421: mpi/p4est_3d_ghost_01.mpirun=10.debug
            Start  8418: mpi/p4est_3d_constraintmatrix_03.mpirun=4.release
11202/11561 Test  #8418: mpi/p4est_3d_constraintmatrix_03.mpirun=4.release ......................................   Passed    4.97 sec
11203/11561 Test  #8415: mpi/p4est_3d_constraintmatrix_03.mpirun=10.debug .......................................   Passed   54.12 sec
            Start  8422: mpi/p4est_3d_ghost_01.mpirun=10.release
            Start  8417: mpi/p4est_3d_constraintmatrix_03.mpirun=4.debug
11204/11561 Test  #8421: mpi/p4est_3d_ghost_01.mpirun=10.debug ..................................................   Passed   23.20 sec
            Start  8425: mpi/p4est_3d_refine_01.mpirun=10.debug
11205/11561 Test  #8422: mpi/p4est_3d_ghost_01.mpirun=10.release ................................................   Passed   19.45 sec
            Start  8426: mpi/p4est_3d_refine_01.mpirun=10.release
11206/11561 Test  #8417: mpi/p4est_3d_constraintmatrix_03.mpirun=4.debug ........................................   Passed   37.86 sec
            Start  8423: mpi/p4est_3d_ghost_01.mpirun=4.debug
11207/11561 Test  #8425: mpi/p4est_3d_refine_01.mpirun=10.debug .................................................   Passed   34.99 sec
            Start  8429: mpi/p4est_3d_refine_02.mpirun=10.debug
11208/11561 Test  #8426: mpi/p4est_3d_refine_01.mpirun=10.release ...............................................   Passed   22.35 sec
            Start  8430: mpi/p4est_3d_refine_02.mpirun=10.release
11209/11561 Test  #8423: mpi/p4est_3d_ghost_01.mpirun=4.debug ...................................................   Passed    4.63 sec
            Start  8424: mpi/p4est_3d_ghost_01.mpirun=4.release
11210/11561 Test  #8424: mpi/p4est_3d_ghost_01.mpirun=4.release .................................................   Passed    3.08 sec
            Start  8427: mpi/p4est_3d_refine_01.mpirun=4.debug
11211/11561 Test  #8427: mpi/p4est_3d_refine_01.mpirun=4.debug ..................................................   Passed   10.95 sec
            Start  8428: mpi/p4est_3d_refine_01.mpirun=4.release
11212/11561 Test  #8428: mpi/p4est_3d_refine_01.mpirun=4.release ................................................   Passed    3.22 sec
11213/11561 Test  #8430: mpi/p4est_3d_refine_02.mpirun=10.release ...............................................   Passed   19.00 sec
            Start  8433: mpi/p4est_3d_refine_03.mpirun=10.debug
            Start  8432: mpi/p4est_3d_refine_02.mpirun=4.release
11214/11561 Test  #8432: mpi/p4est_3d_refine_02.mpirun=4.release ................................................   Passed    3.08 sec
11215/11561 Test  #8429: mpi/p4est_3d_refine_02.mpirun=10.debug .................................................   Passed   22.62 sec
            Start  8434: mpi/p4est_3d_refine_03.mpirun=10.release
            Start  8431: mpi/p4est_3d_refine_02.mpirun=4.debug
11216/11561 Test  #8431: mpi/p4est_3d_refine_02.mpirun=4.debug ..................................................   Passed    3.09 sec
11217/11561 Test  #8433: mpi/p4est_3d_refine_03.mpirun=10.debug .................................................   Passed   21.91 sec
            Start  8446: mpi/p4est_data_out_01.mpirun=10.debug
            Start  8435: mpi/p4est_3d_refine_03.mpirun=4.debug
11218/11561 Test  #8434: mpi/p4est_3d_refine_03.mpirun=10.release ...............................................   Passed   18.58 sec
            Start  8447: mpi/p4est_data_out_01.mpirun=10.release
11219/11561 Test  #8435: mpi/p4est_3d_refine_03.mpirun=4.debug ..................................................   Passed    3.14 sec
            Start  8436: mpi/p4est_3d_refine_03.mpirun=4.release
11220/11561 Test  #8436: mpi/p4est_3d_refine_03.mpirun=4.release ................................................   Passed    3.10 sec
11221/11561 Test  #8447: mpi/p4est_data_out_01.mpirun=10.release ................................................   Passed   19.89 sec
            Start  8450: mpi/p4est_get_subdomain_association.mpirun=10.debug
            Start  8449: mpi/p4est_data_out_01.mpirun=4.release
11222/11561 Test  #8449: mpi/p4est_data_out_01.mpirun=4.release .................................................   Passed    3.06 sec
11223/11561 Test  #8446: mpi/p4est_data_out_01.mpirun=10.debug ..................................................   Passed   24.20 sec
            Start  8451: mpi/p4est_get_subdomain_association.mpirun=10.release
            Start  8448: mpi/p4est_data_out_01.mpirun=4.debug
11224/11561 Test  #8448: mpi/p4est_data_out_01.mpirun=4.debug ...................................................   Passed    3.07 sec
11225/11561 Test  #8451: mpi/p4est_get_subdomain_association.mpirun=10.release ..................................   Passed   18.18 sec
            Start  8458: mpi/p4est_save_01.mpirun=10.debug
            Start  8453: mpi/p4est_get_subdomain_association.mpirun=4.release
11226/11561 Test  #8450: mpi/p4est_get_subdomain_association.mpirun=10.debug ....................................   Passed   22.86 sec
            Start  8459: mpi/p4est_save_01.mpirun=10.release
11227/11561 Test  #8453: mpi/p4est_get_subdomain_association.mpirun=4.release ...................................   Passed    3.05 sec
            Start  8452: mpi/p4est_get_subdomain_association.mpirun=4.debug
11228/11561 Test  #8452: mpi/p4est_get_subdomain_association.mpirun=4.debug .....................................   Passed    3.10 sec
11229/11561 Test  #8459: mpi/p4est_save_01.mpirun=10.release ....................................................   Passed   19.28 sec
            Start  8482: mpi/parallel_block_vector_01.mpirun=10.debug
            Start  8461: mpi/p4est_save_01.mpirun=4.release
11230/11561 Test  #8458: mpi/p4est_save_01.mpirun=10.debug ......................................................   Passed   22.34 sec
            Start  8483: mpi/parallel_block_vector_01.mpirun=10.release
11231/11561 Test  #8482: mpi/parallel_block_vector_01.mpirun=10.debug ...........................................   Passed    3.22 sec
            Start  8488: mpi/parallel_block_vector_02.mpirun=10.debug
11232/11561 Test  #8461: mpi/p4est_save_01.mpirun=4.release .....................................................   Passed    3.25 sec
            Start  8460: mpi/p4est_save_01.mpirun=4.debug
11233/11561 Test  #8483: mpi/parallel_block_vector_01.mpirun=10.release .........................................   Passed    3.09 sec
            Start  8489: mpi/parallel_block_vector_02.mpirun=10.release
11234/11561 Test  #8460: mpi/p4est_save_01.mpirun=4.debug .......................................................   Passed    3.17 sec
            Start  8484: mpi/parallel_block_vector_01.mpirun=4.debug
11235/11561 Test  #8488: mpi/parallel_block_vector_02.mpirun=10.debug ...........................................   Passed    3.22 sec
            Start  8494: mpi/parallel_block_vector_04.mpirun=10.debug
11236/11561 Test  #8489: mpi/parallel_block_vector_02.mpirun=10.release .........................................   Passed    3.15 sec
            Start  8495: mpi/parallel_block_vector_04.mpirun=10.release
11237/11561 Test  #8484: mpi/parallel_block_vector_01.mpirun=4.debug ............................................   Passed    3.07 sec
            Start  8485: mpi/parallel_block_vector_01.mpirun=4.release
11238/11561 Test  #8494: mpi/parallel_block_vector_04.mpirun=10.debug ...........................................   Passed    3.19 sec
            Start  8526: mpi/parallel_partitioner_01.mpirun=10.debug
11239/11561 Test  #8495: mpi/parallel_block_vector_04.mpirun=10.release .........................................   Passed    3.11 sec
            Start  8527: mpi/parallel_partitioner_01.mpirun=10.release
11240/11561 Test  #8485: mpi/parallel_block_vector_01.mpirun=4.release ..........................................   Passed    3.01 sec
            Start  8490: mpi/parallel_block_vector_02.mpirun=4.debug
11241/11561 Test  #8490: mpi/parallel_block_vector_02.mpirun=4.debug ............................................   Passed    3.00 sec
            Start  8491: mpi/parallel_block_vector_02.mpirun=4.release
11242/11561 Test  #8491: mpi/parallel_block_vector_02.mpirun=4.release ..........................................   Passed    2.94 sec
            Start  8496: mpi/parallel_block_vector_04.mpirun=4.debug
11243/11561 Test  #8496: mpi/parallel_block_vector_04.mpirun=4.debug ............................................   Passed    3.02 sec
            Start  8497: mpi/parallel_block_vector_04.mpirun=4.release
11244/11561 Test  #8526: mpi/parallel_partitioner_01.mpirun=10.debug ............................................   Passed   13.53 sec
            Start  8530: mpi/parallel_partitioner_02.mpirun=10.debug
11245/11561 Test  #8497: mpi/parallel_block_vector_04.mpirun=4.release ..........................................   Passed    2.95 sec
            Start  8528: mpi/parallel_partitioner_01.mpirun=4.debug
11246/11561 Test  #8527: mpi/parallel_partitioner_01.mpirun=10.release ..........................................   Passed   12.75 sec
            Start  8531: mpi/parallel_partitioner_02.mpirun=10.release
11247/11561 Test  #8528: mpi/parallel_partitioner_01.mpirun=4.debug .............................................   Passed    3.12 sec
            Start  8529: mpi/parallel_partitioner_01.mpirun=4.release
11248/11561 Test  #8529: mpi/parallel_partitioner_01.mpirun=4.release ...........................................   Passed    2.82 sec
11249/11561 Test  #8530: mpi/parallel_partitioner_02.mpirun=10.debug ............................................   Passed   13.54 sec
            Start  8534: mpi/parallel_partitioner_03.mpirun=10.debug
            Start  8532: mpi/parallel_partitioner_02.mpirun=4.debug
11250/11561 Test  #8531: mpi/parallel_partitioner_02.mpirun=10.release ..........................................   Passed   12.38 sec
            Start  8535: mpi/parallel_partitioner_03.mpirun=10.release
11251/11561 Test  #8532: mpi/parallel_partitioner_02.mpirun=4.debug .............................................   Passed    3.14 sec
            Start  8533: mpi/parallel_partitioner_02.mpirun=4.release
11252/11561 Test  #8533: mpi/parallel_partitioner_02.mpirun=4.release ...........................................   Passed    2.96 sec
11253/11561 Test  #8535: mpi/parallel_partitioner_03.mpirun=10.release ..........................................   Passed   12.76 sec
            Start  8540: mpi/parallel_partitioner_04.mpirun=10.debug
            Start  8537: mpi/parallel_partitioner_03.mpirun=4.release
11254/11561 Test  #8534: mpi/parallel_partitioner_03.mpirun=10.debug ............................................   Passed   14.27 sec
            Start  8541: mpi/parallel_partitioner_04.mpirun=10.release
11255/11561 Test  #8537: mpi/parallel_partitioner_03.mpirun=4.release ...........................................   Passed    2.96 sec
            Start  8536: mpi/parallel_partitioner_03.mpirun=4.debug
11256/11561 Test  #8536: mpi/parallel_partitioner_03.mpirun=4.debug .............................................   Passed    3.08 sec
11257/11561 Test  #8540: mpi/parallel_partitioner_04.mpirun=10.debug ............................................   Passed   13.95 sec
            Start  8554: mpi/parallel_vector_01.mpirun=10.debug
            Start  8542: mpi/parallel_partitioner_04.mpirun=4.debug
11258/11561 Test  #8541: mpi/parallel_partitioner_04.mpirun=10.release ..........................................   Passed   12.92 sec
            Start  8555: mpi/parallel_vector_01.mpirun=10.release
11259/11561 Test  #8542: mpi/parallel_partitioner_04.mpirun=4.debug .............................................   Passed    2.93 sec
            Start  8543: mpi/parallel_partitioner_04.mpirun=4.release
11260/11561 Test  #8543: mpi/parallel_partitioner_04.mpirun=4.release ...........................................   Passed    2.97 sec
11261/11561 Test  #8555: mpi/parallel_vector_01.mpirun=10.release ...............................................   Passed   12.07 sec
            Start  8558: mpi/parallel_vector_02.mpirun=10.debug
            Start  8557: mpi/parallel_vector_01.mpirun=4.release
11262/11561 Test  #8554: mpi/parallel_vector_01.mpirun=10.debug .................................................   Passed   13.56 sec
            Start  8559: mpi/parallel_vector_02.mpirun=10.release
11263/11561 Test  #8557: mpi/parallel_vector_01.mpirun=4.release ................................................   Passed    3.00 sec
            Start  8556: mpi/parallel_vector_01.mpirun=4.debug
11264/11561 Test  #8556: mpi/parallel_vector_01.mpirun=4.debug ..................................................   Passed    3.02 sec
11265/11561 Test  #8559: mpi/parallel_vector_02.mpirun=10.release ...............................................   Passed   12.18 sec
            Start  8562: mpi/parallel_vector_03.mpirun=10.debug
            Start  8561: mpi/parallel_vector_02.mpirun=4.release
11266/11561 Test  #8558: mpi/parallel_vector_02.mpirun=10.debug .................................................   Passed   13.86 sec
            Start  8563: mpi/parallel_vector_03.mpirun=10.release
11267/11561 Test  #8561: mpi/parallel_vector_02.mpirun=4.release ................................................   Passed    3.03 sec
            Start  8560: mpi/parallel_vector_02.mpirun=4.debug
11268/11561 Test  #8560: mpi/parallel_vector_02.mpirun=4.debug ..................................................   Passed    3.07 sec
11269/11561 Test  #8563: mpi/parallel_vector_03.mpirun=10.release ...............................................   Passed   12.43 sec
            Start  8568: mpi/parallel_vector_04.mpirun=10.debug
            Start  8565: mpi/parallel_vector_03.mpirun=4.release
11270/11561 Test  #8562: mpi/parallel_vector_03.mpirun=10.debug .................................................   Passed   13.84 sec
            Start  8569: mpi/parallel_vector_04.mpirun=10.release
11271/11561 Test  #8565: mpi/parallel_vector_03.mpirun=4.release ................................................   Passed    3.01 sec
            Start  8564: mpi/parallel_vector_03.mpirun=4.debug
11272/11561 Test  #8564: mpi/parallel_vector_03.mpirun=4.debug ..................................................   Passed    3.09 sec
11273/11561 Test  #8569: mpi/parallel_vector_04.mpirun=10.release ...............................................   Passed   12.66 sec
            Start  8572: mpi/parallel_vector_05.mpirun=10.debug
            Start  8571: mpi/parallel_vector_04.mpirun=4.release
11274/11561 Test  #8568: mpi/parallel_vector_04.mpirun=10.debug .................................................   Passed   14.12 sec
            Start  8573: mpi/parallel_vector_05.mpirun=10.release
11275/11561 Test  #8571: mpi/parallel_vector_04.mpirun=4.release ................................................   Passed    2.96 sec
            Start  8570: mpi/parallel_vector_04.mpirun=4.debug
11276/11561 Test  #8570: mpi/parallel_vector_04.mpirun=4.debug ..................................................   Passed    3.12 sec
11277/11561 Test  #8573: mpi/parallel_vector_05.mpirun=10.release ...............................................   Passed   12.68 sec
            Start  8578: mpi/parallel_vector_06.mpirun=10.debug
            Start  8575: mpi/parallel_vector_05.mpirun=4.release
11278/11561 Test  #8572: mpi/parallel_vector_05.mpirun=10.debug .................................................   Passed   14.04 sec
            Start  8579: mpi/parallel_vector_06.mpirun=10.release
11279/11561 Test  #8575: mpi/parallel_vector_05.mpirun=4.release ................................................   Passed    3.13 sec
            Start  8574: mpi/parallel_vector_05.mpirun=4.debug
11280/11561 Test  #8578: mpi/parallel_vector_06.mpirun=10.debug .................................................   Passed    3.31 sec
            Start  8582: mpi/parallel_vector_07.mpirun=10.debug
11281/11561 Test  #8579: mpi/parallel_vector_06.mpirun=10.release ...............................................   Passed    3.07 sec
            Start  8583: mpi/parallel_vector_07.mpirun=10.release
11282/11561 Test  #8574: mpi/parallel_vector_05.mpirun=4.debug ..................................................   Passed    3.05 sec
            Start  8580: mpi/parallel_vector_06.mpirun=4.debug
11283/11561 Test  #8580: mpi/parallel_vector_06.mpirun=4.debug ..................................................   Passed    3.10 sec
            Start  8581: mpi/parallel_vector_06.mpirun=4.release
11284/11561 Test  #8581: mpi/parallel_vector_06.mpirun=4.release ................................................   Passed    2.85 sec
11285/11561 Test  #8583: mpi/parallel_vector_07.mpirun=10.release ...............................................   Passed   13.13 sec
            Start  8586: mpi/parallel_vector_08.mpirun=10.debug
            Start  8585: mpi/parallel_vector_07.mpirun=4.release
11286/11561 Test  #8582: mpi/parallel_vector_07.mpirun=10.debug .................................................   Passed   14.28 sec
            Start  8587: mpi/parallel_vector_08.mpirun=10.release
11287/11561 Test  #8585: mpi/parallel_vector_07.mpirun=4.release ................................................   Passed    3.12 sec
            Start  8584: mpi/parallel_vector_07.mpirun=4.debug
11288/11561 Test  #8584: mpi/parallel_vector_07.mpirun=4.debug ..................................................   Passed    3.04 sec
11289/11561 Test  #8587: mpi/parallel_vector_08.mpirun=10.release ...............................................   Passed   13.21 sec
            Start  8590: mpi/parallel_vector_09.mpirun=10.debug
            Start  8589: mpi/parallel_vector_08.mpirun=4.release
11290/11561 Test  #8586: mpi/parallel_vector_08.mpirun=10.debug .................................................   Passed   14.32 sec
            Start  8591: mpi/parallel_vector_09.mpirun=10.release
11291/11561 Test  #8589: mpi/parallel_vector_08.mpirun=4.release ................................................   Passed    3.02 sec
            Start  8588: mpi/parallel_vector_08.mpirun=4.debug
11292/11561 Test  #8588: mpi/parallel_vector_08.mpirun=4.debug ..................................................   Passed    3.11 sec
11293/11561 Test  #8591: mpi/parallel_vector_09.mpirun=10.release ...............................................   Passed   12.43 sec
            Start  8594: mpi/parallel_vector_10.mpirun=10.debug
            Start  8593: mpi/parallel_vector_09.mpirun=4.release
11294/11561 Test  #8590: mpi/parallel_vector_09.mpirun=10.debug .................................................   Passed   13.97 sec
            Start  8595: mpi/parallel_vector_10.mpirun=10.release
11295/11561 Test  #8593: mpi/parallel_vector_09.mpirun=4.release ................................................   Passed    3.01 sec
            Start  8592: mpi/parallel_vector_09.mpirun=4.debug
11296/11561 Test  #8592: mpi/parallel_vector_09.mpirun=4.debug ..................................................   Passed    3.04 sec
11297/11561 Test  #8595: mpi/parallel_vector_10.mpirun=10.release ...............................................   Passed   11.98 sec
            Start  8598: mpi/parallel_vector_11.mpirun=10.debug
            Start  8597: mpi/parallel_vector_10.mpirun=4.release
11298/11561 Test  #8594: mpi/parallel_vector_10.mpirun=10.debug .................................................   Passed   13.51 sec
            Start  8599: mpi/parallel_vector_11.mpirun=10.release
11299/11561 Test  #8597: mpi/parallel_vector_10.mpirun=4.release ................................................   Passed    3.11 sec
            Start  8596: mpi/parallel_vector_10.mpirun=4.debug
11300/11561 Test  #8596: mpi/parallel_vector_10.mpirun=4.debug ..................................................   Passed    3.00 sec
11301/11561 Test  #8599: mpi/parallel_vector_11.mpirun=10.release ...............................................   Passed   12.10 sec
            Start  8604: mpi/parallel_vector_12.mpirun=10.debug
            Start  8601: mpi/parallel_vector_11.mpirun=4.release
11302/11561 Test  #8598: mpi/parallel_vector_11.mpirun=10.debug .................................................   Passed   13.66 sec
            Start  8605: mpi/parallel_vector_12.mpirun=10.release
11303/11561 Test  #8601: mpi/parallel_vector_11.mpirun=4.release ................................................   Passed    3.04 sec
            Start  8600: mpi/parallel_vector_11.mpirun=4.debug
11304/11561 Test  #8604: mpi/parallel_vector_12.mpirun=10.debug .................................................   Passed    3.15 sec
            Start  8610: mpi/parallel_vector_12a.mpirun=10.debug
11305/11561 Test  #8605: mpi/parallel_vector_12.mpirun=10.release ...............................................   Passed    3.02 sec
            Start  8611: mpi/parallel_vector_12a.mpirun=10.release
11306/11561 Test  #8600: mpi/parallel_vector_11.mpirun=4.debug ..................................................   Passed    3.08 sec
            Start  8606: mpi/parallel_vector_12.mpirun=4.debug
11307/11561 Test  #8610: mpi/parallel_vector_12a.mpirun=10.debug ................................................   Passed    3.13 sec
            Start  8614: mpi/parallel_vector_13.mpirun=10.debug
11308/11561 Test  #8611: mpi/parallel_vector_12a.mpirun=10.release ..............................................   Passed    3.01 sec
            Start  8615: mpi/parallel_vector_13.mpirun=10.release
11309/11561 Test  #8606: mpi/parallel_vector_12.mpirun=4.debug ..................................................   Passed    3.00 sec
            Start  8607: mpi/parallel_vector_12.mpirun=4.release
11310/11561 Test  #8607: mpi/parallel_vector_12.mpirun=4.release ................................................   Passed    2.98 sec
            Start  8612: mpi/parallel_vector_12a.mpirun=4.debug
11311/11561 Test  #8612: mpi/parallel_vector_12a.mpirun=4.debug .................................................   Passed    3.01 sec
            Start  8613: mpi/parallel_vector_12a.mpirun=4.release
11312/11561 Test  #8613: mpi/parallel_vector_12a.mpirun=4.release ...............................................   Passed    2.94 sec
11313/11561 Test  #8615: mpi/parallel_vector_13.mpirun=10.release ...............................................   Passed   12.68 sec
            Start  8630: mpi/parallel_vector_18.mpirun=10.debug
            Start  8617: mpi/parallel_vector_13.mpirun=4.release
11314/11561 Test  #8614: mpi/parallel_vector_13.mpirun=10.debug .................................................   Passed   13.68 sec
            Start  8631: mpi/parallel_vector_18.mpirun=10.release
11315/11561 Test  #8617: mpi/parallel_vector_13.mpirun=4.release ................................................   Passed    3.36 sec
            Start  8616: mpi/parallel_vector_13.mpirun=4.debug
11316/11561 Test  #8630: mpi/parallel_vector_18.mpirun=10.debug .................................................   Passed    3.48 sec
            Start  8636: mpi/parallel_vector_19.mpirun=10.debug
11317/11561 Test  #8631: mpi/parallel_vector_18.mpirun=10.release ...............................................   Passed    3.24 sec
            Start  8637: mpi/parallel_vector_19.mpirun=10.release
11318/11561 Test  #8616: mpi/parallel_vector_13.mpirun=4.debug ..................................................   Passed    3.21 sec
            Start  8632: mpi/parallel_vector_18.mpirun=4.debug
11319/11561 Test  #8636: mpi/parallel_vector_19.mpirun=10.debug .................................................   Passed    3.27 sec
            Start  8644: mpi/parallel_vector_22.mpirun=10.debug
11320/11561 Test  #8637: mpi/parallel_vector_19.mpirun=10.release ...............................................   Passed    3.20 sec
            Start  8645: mpi/parallel_vector_22.mpirun=10.release
11321/11561 Test  #8632: mpi/parallel_vector_18.mpirun=4.debug ..................................................   Passed    3.05 sec
            Start  8633: mpi/parallel_vector_18.mpirun=4.release
11322/11561 Test  #8633: mpi/parallel_vector_18.mpirun=4.release ................................................   Passed    3.00 sec
            Start  8638: mpi/parallel_vector_19.mpirun=4.debug
11323/11561 Test  #8638: mpi/parallel_vector_19.mpirun=4.debug ..................................................   Passed    3.01 sec
            Start  8639: mpi/parallel_vector_19.mpirun=4.release
11324/11561 Test  #8639: mpi/parallel_vector_19.mpirun=4.release ................................................   Passed    2.91 sec
11325/11561 Test  #8645: mpi/parallel_vector_22.mpirun=10.release ...............................................   Passed   12.40 sec
            Start  8706: mpi/refine_and_coarsen_fixed_fraction_01.mpirun=10.debug
            Start  8647: mpi/parallel_vector_22.mpirun=4.release
11326/11561 Test  #8644: mpi/parallel_vector_22.mpirun=10.debug .................................................   Passed   13.48 sec
            Start  8707: mpi/refine_and_coarsen_fixed_fraction_01.mpirun=10.release
11327/11561 Test  #8647: mpi/parallel_vector_22.mpirun=4.release ................................................   Passed    2.95 sec
            Start  8646: mpi/parallel_vector_22.mpirun=4.debug
11328/11561 Test  #8646: mpi/parallel_vector_22.mpirun=4.debug ..................................................   Passed    3.09 sec
11329/11561 Test  #8707: mpi/refine_and_coarsen_fixed_fraction_01.mpirun=10.release .............................   Passed   18.81 sec
            Start  8710: mpi/refine_and_coarsen_fixed_fraction_02.mpirun=10.debug
            Start  8709: mpi/refine_and_coarsen_fixed_fraction_01.mpirun=4.release
11330/11561 Test  #8706: mpi/refine_and_coarsen_fixed_fraction_01.mpirun=10.debug ...............................   Passed   23.02 sec
            Start  8711: mpi/refine_and_coarsen_fixed_fraction_02.mpirun=10.release
11331/11561 Test  #8709: mpi/refine_and_coarsen_fixed_fraction_01.mpirun=4.release ..............................   Passed    3.16 sec
            Start  8708: mpi/refine_and_coarsen_fixed_fraction_01.mpirun=4.debug
11332/11561 Test  #8708: mpi/refine_and_coarsen_fixed_fraction_01.mpirun=4.debug ................................   Passed    3.33 sec
11333/11561 Test  #8711: mpi/refine_and_coarsen_fixed_fraction_02.mpirun=10.release .............................   Passed   19.48 sec
            Start  8714: mpi/refine_and_coarsen_fixed_fraction_03.mpirun=10.debug
            Start  8713: mpi/refine_and_coarsen_fixed_fraction_02.mpirun=4.release
11334/11561 Test  #8710: mpi/refine_and_coarsen_fixed_fraction_02.mpirun=10.debug ...............................   Passed   22.75 sec
            Start  8715: mpi/refine_and_coarsen_fixed_fraction_03.mpirun=10.release
11335/11561 Test  #8713: mpi/refine_and_coarsen_fixed_fraction_02.mpirun=4.release ..............................   Passed    3.09 sec
            Start  8712: mpi/refine_and_coarsen_fixed_fraction_02.mpirun=4.debug
11336/11561 Test  #8712: mpi/refine_and_coarsen_fixed_fraction_02.mpirun=4.debug ................................   Passed    3.14 sec
11337/11561 Test  #8715: mpi/refine_and_coarsen_fixed_fraction_03.mpirun=10.release .............................   Passed   19.59 sec
            Start  8734: mpi/refine_and_coarsen_fixed_number_01.mpirun=10.debug
            Start  8717: mpi/refine_and_coarsen_fixed_fraction_03.mpirun=4.release
11338/11561 Test  #8717: mpi/refine_and_coarsen_fixed_fraction_03.mpirun=4.release ..............................   Passed    3.04 sec
11339/11561 Test  #8714: mpi/refine_and_coarsen_fixed_fraction_03.mpirun=10.debug ...............................   Passed   23.25 sec
            Start  8735: mpi/refine_and_coarsen_fixed_number_01.mpirun=10.release
            Start  8716: mpi/refine_and_coarsen_fixed_fraction_03.mpirun=4.debug
11340/11561 Test  #8716: mpi/refine_and_coarsen_fixed_fraction_03.mpirun=4.debug ................................   Passed    3.20 sec
11341/11561 Test  #8735: mpi/refine_and_coarsen_fixed_number_01.mpirun=10.release ...............................   Passed   18.55 sec
            Start  8738: mpi/refine_and_coarsen_fixed_number_02.mpirun=10.debug
            Start  8737: mpi/refine_and_coarsen_fixed_number_01.mpirun=4.release
11342/11561 Test  #8734: mpi/refine_and_coarsen_fixed_number_01.mpirun=10.debug .................................   Passed   22.95 sec
            Start  8739: mpi/refine_and_coarsen_fixed_number_02.mpirun=10.release
11343/11561 Test  #8737: mpi/refine_and_coarsen_fixed_number_01.mpirun=4.release ................................   Passed    3.14 sec
            Start  8736: mpi/refine_and_coarsen_fixed_number_01.mpirun=4.debug
11344/11561 Test  #8736: mpi/refine_and_coarsen_fixed_number_01.mpirun=4.debug ..................................   Passed    3.12 sec
11345/11561 Test  #8739: mpi/refine_and_coarsen_fixed_number_02.mpirun=10.release ...............................   Passed   19.69 sec
            Start  8742: mpi/refine_and_coarsen_fixed_number_03.mpirun=10.debug
            Start  8741: mpi/refine_and_coarsen_fixed_number_02.mpirun=4.release
11346/11561 Test  #8738: mpi/refine_and_coarsen_fixed_number_02.mpirun=10.debug .................................   Passed   22.85 sec
            Start  8743: mpi/refine_and_coarsen_fixed_number_03.mpirun=10.release
11347/11561 Test  #8741: mpi/refine_and_coarsen_fixed_number_02.mpirun=4.release ................................   Passed    3.05 sec
            Start  8740: mpi/refine_and_coarsen_fixed_number_02.mpirun=4.debug
11348/11561 Test  #8740: mpi/refine_and_coarsen_fixed_number_02.mpirun=4.debug ..................................   Passed    3.15 sec
11349/11561 Test  #8743: mpi/refine_and_coarsen_fixed_number_03.mpirun=10.release ...............................   Passed   19.64 sec
            Start  8752: mpi/refine_and_coarsen_fixed_number_06.mpirun=10.debug
            Start  8745: mpi/refine_and_coarsen_fixed_number_03.mpirun=4.release
11350/11561 Test  #8742: mpi/refine_and_coarsen_fixed_number_03.mpirun=10.debug .................................   Passed   22.53 sec
            Start  8753: mpi/refine_and_coarsen_fixed_number_06.mpirun=10.release
11351/11561 Test  #8745: mpi/refine_and_coarsen_fixed_number_03.mpirun=4.release ................................   Passed    3.11 sec
            Start  8744: mpi/refine_and_coarsen_fixed_number_03.mpirun=4.debug
11352/11561 Test  #8752: mpi/refine_and_coarsen_fixed_number_06.mpirun=10.debug .................................   Passed    3.15 sec
            Start  8758: mpi/refine_and_coarsen_fixed_number_07.mpirun=10.debug
11353/11561 Test  #8753: mpi/refine_and_coarsen_fixed_number_06.mpirun=10.release ...............................   Passed    3.03 sec
            Start  8759: mpi/refine_and_coarsen_fixed_number_07.mpirun=10.release
11354/11561 Test  #8744: mpi/refine_and_coarsen_fixed_number_03.mpirun=4.debug ..................................   Passed    3.26 sec
            Start  8754: mpi/refine_and_coarsen_fixed_number_06.mpirun=4.debug
11355/11561 Test  #8759: mpi/refine_and_coarsen_fixed_number_07.mpirun=10.release ...............................   Passed    7.03 sec
            Start  8788: mpi/renumber_z_order_01.mpirun=10.debug
11356/11561 Test  #8754: mpi/refine_and_coarsen_fixed_number_06.mpirun=4.debug ..................................   Passed    4.34 sec
            Start  8755: mpi/refine_and_coarsen_fixed_number_06.mpirun=4.release
11357/11561 Test  #8758: mpi/refine_and_coarsen_fixed_number_07.mpirun=10.debug .................................   Passed    7.79 sec
            Start  8789: mpi/renumber_z_order_01.mpirun=10.release
11358/11561 Test  #8755: mpi/refine_and_coarsen_fixed_number_06.mpirun=4.release ................................   Passed    3.34 sec
            Start  8760: mpi/refine_and_coarsen_fixed_number_07.mpirun=4.debug
11359/11561 Test  #8788: mpi/renumber_z_order_01.mpirun=10.debug ................................................   Passed    3.55 sec
            Start  8794: mpi/renumber_z_order_02.mpirun=10.debug
11360/11561 Test  #8789: mpi/renumber_z_order_01.mpirun=10.release ..............................................   Passed    3.29 sec
            Start  8795: mpi/renumber_z_order_02.mpirun=10.release
11361/11561 Test  #8795: mpi/renumber_z_order_02.mpirun=10.release ..............................................   Passed    5.55 sec
            Start  8870: mpi/tria_ghost_owners_02.mpirun=11.debug
11362/11561 Test  #8760: mpi/refine_and_coarsen_fixed_number_07.mpirun=4.debug ..................................   Passed    5.81 sec
            Start  8761: mpi/refine_and_coarsen_fixed_number_07.mpirun=4.release
11363/11561 Test  #8794: mpi/renumber_z_order_02.mpirun=10.debug ................................................   Passed    5.69 sec
            Start  8871: mpi/tria_ghost_owners_02.mpirun=11.release
11364/11561 Test  #8761: mpi/refine_and_coarsen_fixed_number_07.mpirun=4.release ................................   Passed    3.13 sec
            Start  8790: mpi/renumber_z_order_01.mpirun=4.debug
11365/11561 Test  #8790: mpi/renumber_z_order_01.mpirun=4.debug .................................................   Passed    3.02 sec
            Start  8791: mpi/renumber_z_order_01.mpirun=4.release
11366/11561 Test  #8791: mpi/renumber_z_order_01.mpirun=4.release ...............................................   Passed    2.88 sec
            Start  8796: mpi/renumber_z_order_02.mpirun=4.debug
11367/11561 Test  #8796: mpi/renumber_z_order_02.mpirun=4.debug .................................................   Passed    2.98 sec
            Start  8797: mpi/renumber_z_order_02.mpirun=4.release
11368/11561 Test  #8797: mpi/renumber_z_order_02.mpirun=4.release ...............................................   Passed    2.94 sec
11369/11561 Test  #8871: mpi/tria_ghost_owners_02.mpirun=11.release .............................................   Passed   19.46 sec
            Start  8876: mpi/tria_signals_01.mpirun=11.debug
            Start  8873: mpi/tria_ghost_owners_02.mpirun=5.release
11370/11561 Test  #8873: mpi/tria_ghost_owners_02.mpirun=5.release ..............................................   Passed    4.36 sec
11371/11561 Test  #8876: mpi/tria_signals_01.mpirun=11.debug ....................................................   Passed   10.80 sec
            Start  8877: mpi/tria_signals_01.mpirun=11.release
            Start  8878: mpi/tria_signals_01.mpirun=4.debug
11372/11561 Test  #8878: mpi/tria_signals_01.mpirun=4.debug .....................................................   Passed    7.12 sec
11373/11561 Test  #8877: mpi/tria_signals_01.mpirun=11.release ..................................................   Passed   11.65 sec
            Start  8882: mpi/tria_signals_02.mpirun=11.debug
            Start  8879: mpi/tria_signals_01.mpirun=4.release
11374/11561 Test  #8870: mpi/tria_ghost_owners_02.mpirun=11.debug ...............................................   Passed   42.01 sec
            Start  8883: mpi/tria_signals_02.mpirun=11.release
11375/11561 Test  #8883: mpi/tria_signals_02.mpirun=11.release ..................................................   Passed    3.54 sec
            Start  8888: mpi/tria_signals_03.mpirun=11.debug
11376/11561 Test  #8879: mpi/tria_signals_01.mpirun=4.release ...................................................   Passed    3.57 sec
            Start  8872: mpi/tria_ghost_owners_02.mpirun=5.debug
11377/11561 Test  #8882: mpi/tria_signals_02.mpirun=11.debug ....................................................   Passed    3.74 sec
            Start  8889: mpi/tria_signals_03.mpirun=11.release
11378/11561 Test  #8872: mpi/tria_ghost_owners_02.mpirun=5.debug ................................................   Passed   29.52 sec
            Start  8884: mpi/tria_signals_02.mpirun=4.debug
11379/11561 Test  #8889: mpi/tria_signals_03.mpirun=11.release ..................................................   Passed   36.72 sec
            Start  8894: mpi/tria_signals_04.mpirun=11.debug
11380/11561 Test  #8884: mpi/tria_signals_02.mpirun=4.debug .....................................................   Passed    7.47 sec
            Start  8885: mpi/tria_signals_02.mpirun=4.release
11381/11561 Test  #8885: mpi/tria_signals_02.mpirun=4.release ...................................................   Passed    5.28 sec
            Start  8891: mpi/tria_signals_03.mpirun=4.release
11382/11561 Test  #8891: mpi/tria_signals_03.mpirun=4.release ...................................................   Passed   11.47 sec
11383/11561 Test  #8888: mpi/tria_signals_03.mpirun=11.debug ....................................................   Passed   80.29 sec
            Start  8895: mpi/tria_signals_04.mpirun=11.release
            Start  8890: mpi/tria_signals_03.mpirun=4.debug
11384/11561 Test  #8895: mpi/tria_signals_04.mpirun=11.release ..................................................   Passed   41.32 sec
            Start  8900: mpi/tria_signals_05.mpirun=11.debug
11385/11561 Test  #8894: mpi/tria_signals_04.mpirun=11.debug ....................................................   Passed   88.15 sec
            Start  8901: mpi/tria_signals_05.mpirun=11.release
11386/11561 Test  #8900: mpi/tria_signals_05.mpirun=11.debug ....................................................   Passed    4.34 sec
            Start  8906: mpi/trilinos_01.mpirun=10.debug
11387/11561 Test  #8901: mpi/tria_signals_05.mpirun=11.release ..................................................   Passed    3.39 sec
            Start  8907: mpi/trilinos_01.mpirun=10.release
11388/11561 Test  #8906: mpi/trilinos_01.mpirun=10.debug ........................................................   Passed   16.63 sec
            Start  8910: mpi/trilinos_02.mpirun=10.debug
11389/11561 Test  #8907: mpi/trilinos_01.mpirun=10.release ......................................................   Passed   14.33 sec
            Start  8911: mpi/trilinos_02.mpirun=10.release
11390/11561 Test  #8911: mpi/trilinos_02.mpirun=10.release ......................................................   Passed   12.04 sec
            Start  8950: mpi/trilinos_ghost_01.mpirun=10.debug
11391/11561 Test  #8890: mpi/tria_signals_03.mpirun=4.debug .....................................................   Passed   75.48 sec
            Start  8896: mpi/tria_signals_04.mpirun=4.debug
11392/11561 Test  #8910: mpi/trilinos_02.mpirun=10.debug ........................................................   Passed   13.94 sec
            Start  8951: mpi/trilinos_ghost_01.mpirun=10.release
11393/11561 Test  #8950: mpi/trilinos_ghost_01.mpirun=10.debug ..................................................   Passed   14.00 sec
            Start  8954: mpi/trilinos_ghost_02.mpirun=10.debug
11394/11561 Test  #8951: mpi/trilinos_ghost_01.mpirun=10.release ................................................   Passed   12.66 sec
            Start  8955: mpi/trilinos_ghost_02.mpirun=10.release
11395/11561 Test  #8955: mpi/trilinos_ghost_02.mpirun=10.release ................................................   Passed   12.73 sec
            Start  8958: mpi/trilinos_ghost_03.mpirun=10.debug
11396/11561 Test  #8954: mpi/trilinos_ghost_02.mpirun=10.debug ..................................................   Passed   14.35 sec
            Start  8960: mpi/trilinos_ghost_03_linfty.mpirun=10.debug
11397/11561 Test  #8958: mpi/trilinos_ghost_03.mpirun=10.debug ..................................................   Passed   14.05 sec
            Start  8962: mpi/trilinos_ghost_05.mpirun=10.debug
11398/11561 Test  #8960: mpi/trilinos_ghost_03_linfty.mpirun=10.debug ...........................................   Passed   14.09 sec
            Start  8963: mpi/trilinos_ghost_05.mpirun=10.release
11399/11561 Test  #8962: mpi/trilinos_ghost_05.mpirun=10.debug ..................................................   Passed   13.80 sec
            Start  9205: multigrid/transfer_matrix_free_06.mpirun=10.debug
11400/11561 Test  #8963: mpi/trilinos_ghost_05.mpirun=10.release ................................................   Passed   12.66 sec
            Start  9206: multigrid/transfer_matrix_free_06.mpirun=10.release
11401/11561 Test  #8896: mpi/tria_signals_04.mpirun=4.debug .....................................................   Passed   60.25 sec
            Start  8897: mpi/tria_signals_04.mpirun=4.release
11402/11561 Test  #8897: mpi/tria_signals_04.mpirun=4.release ...................................................   Passed    4.28 sec
            Start  8902: mpi/tria_signals_05.mpirun=4.debug
11403/11561 Test  #8902: mpi/tria_signals_05.mpirun=4.debug .....................................................   Passed    3.41 sec
            Start  8903: mpi/tria_signals_05.mpirun=4.release
11404/11561 Test  #8903: mpi/tria_signals_05.mpirun=4.release ...................................................   Passed    2.98 sec
            Start  8908: mpi/trilinos_01.mpirun=4.debug
11405/11561 Test  #8908: mpi/trilinos_01.mpirun=4.debug .........................................................   Passed    6.07 sec
            Start  8909: mpi/trilinos_01.mpirun=4.release
11406/11561 Test  #9206: multigrid/transfer_matrix_free_06.mpirun=10.release ....................................   Passed   23.29 sec
            Start  1659: base/mpi_some_to_some_01.mpirun=6.release
            Start  8912: mpi/trilinos_02.mpirun=4.debug
11407/11561 Test  #1659: base/mpi_some_to_some_01.mpirun=6.release ..............................................   Passed    3.24 sec
            Start  4850: fullydistributed_grids/copy_serial_tria_grouped_01.mpirun=7.debug
11408/11561 Test  #8912: mpi/trilinos_02.mpirun=4.debug .........................................................   Passed    3.67 sec
            Start  8913: mpi/trilinos_02.mpirun=4.release
11409/11561 Test  #8909: mpi/trilinos_01.mpirun=4.release .......................................................   Passed    6.27 sec
            Start  8952: mpi/trilinos_ghost_01.mpirun=4.debug
11410/11561 Test  #9205: multigrid/transfer_matrix_free_06.mpirun=10.debug ......................................   Passed   29.54 sec
            Start  4828: fullydistributed_grids/copy_serial_tria_05.mpirun=9.debug
11411/11561 Test  #8913: mpi/trilinos_02.mpirun=4.release .......................................................   Passed    2.89 sec
            Start  4851: fullydistributed_grids/copy_serial_tria_grouped_01.mpirun=7.release
11412/11561 Test  #8952: mpi/trilinos_ghost_01.mpirun=4.debug ...................................................   Passed    3.07 sec
            Start  8953: mpi/trilinos_ghost_01.mpirun=4.release
11413/11561 Test  #8953: mpi/trilinos_ghost_01.mpirun=4.release .................................................   Passed    2.91 sec
            Start  8956: mpi/trilinos_ghost_02.mpirun=4.debug
11414/11561 Test  #8956: mpi/trilinos_ghost_02.mpirun=4.debug ...................................................   Passed    3.04 sec
            Start  8957: mpi/trilinos_ghost_02.mpirun=4.release
11415/11561 Test  #8957: mpi/trilinos_ghost_02.mpirun=4.release .................................................   Passed    2.98 sec
            Start  8959: mpi/trilinos_ghost_03.mpirun=4.debug
11416/11561 Test  #8959: mpi/trilinos_ghost_03.mpirun=4.debug ...................................................   Passed    2.99 sec
            Start  8961: mpi/trilinos_ghost_03_linfty.mpirun=4.debug
11417/11561 Test  #8961: mpi/trilinos_ghost_03_linfty.mpirun=4.debug ............................................   Passed    2.86 sec
            Start  8964: mpi/trilinos_ghost_05.mpirun=4.debug
11418/11561 Test  #8964: mpi/trilinos_ghost_05.mpirun=4.debug ...................................................   Passed    3.04 sec
            Start  8965: mpi/trilinos_ghost_05.mpirun=4.release
11419/11561 Test  #8965: mpi/trilinos_ghost_05.mpirun=4.release .................................................   Passed    3.09 sec
            Start  9207: multigrid/transfer_matrix_free_06.mpirun=5.debug
11420/11561 Test  #4828: fullydistributed_grids/copy_serial_tria_05.mpirun=9.debug ..............................   Passed   26.97 sec
            Start  4829: fullydistributed_grids/copy_serial_tria_05.mpirun=9.release
11421/11561 Test  #9207: multigrid/transfer_matrix_free_06.mpirun=5.debug .......................................   Passed    5.35 sec
            Start  9208: multigrid/transfer_matrix_free_06.mpirun=5.release
11422/11561 Test  #9208: multigrid/transfer_matrix_free_06.mpirun=5.release .....................................   Passed    1.07 sec
11423/11561 Test  #4829: fullydistributed_grids/copy_serial_tria_05.mpirun=9.release ............................   Passed   22.42 sec
            Start  6319: lac/diagonal_matrix_02.mpirun=7.debug
            Start  6320: lac/diagonal_matrix_02.mpirun=7.release
11424/11561 Test  #6320: lac/diagonal_matrix_02.mpirun=7.release ................................................   Passed    1.67 sec
            Start  7128: matrix_free/cell_categorization.mpirun=7.debug
11425/11561 Test  #6319: lac/diagonal_matrix_02.mpirun=7.debug ..................................................   Passed    1.89 sec
            Start  7129: matrix_free/cell_categorization.mpirun=7.release
11426/11561 Test  #7129: matrix_free/cell_categorization.mpirun=7.release .......................................   Passed    1.98 sec
            Start  7134: matrix_free/cell_categorization_02.mpirun=7.debug
11427/11561 Test  #7128: matrix_free/cell_categorization.mpirun=7.debug .........................................   Passed    2.33 sec
            Start  7135: matrix_free/cell_categorization_02.mpirun=7.release
11428/11561 Test  #7135: matrix_free/cell_categorization_02.mpirun=7.release ....................................   Passed    2.36 sec
            Start  7166: matrix_free/dg_pbc_01.mpirun=7.debug
11429/11561 Test  #7166: matrix_free/dg_pbc_01.mpirun=7.debug ...................................................   Passed    2.13 sec
            Start  7167: matrix_free/dg_pbc_01.mpirun=7.release
11430/11561 Test  #7167: matrix_free/dg_pbc_01.mpirun=7.release .................................................   Passed    1.73 sec
            Start  7170: matrix_free/dg_pbc_02.mpirun=7.debug
11431/11561 Test  #7170: matrix_free/dg_pbc_02.mpirun=7.debug ...................................................   Passed    2.82 sec
            Start  7171: matrix_free/dg_pbc_02.mpirun=7.release
11432/11561 Test  #4851: fullydistributed_grids/copy_serial_tria_grouped_01.mpirun=7.release ....................   Passed   63.39 sec
            Start  7525: matrix_free/parallel_multigrid.mpirun=7.debug
11433/11561 Test  #7134: matrix_free/cell_categorization_02.mpirun=7.debug ......................................   Passed   11.20 sec
            Start  7526: matrix_free/parallel_multigrid.mpirun=7.release
11434/11561 Test  #7171: matrix_free/dg_pbc_02.mpirun=7.release .................................................   Passed    2.10 sec
            Start  7529: matrix_free/parallel_multigrid_02.mpirun=7.debug
11435/11561 Test  #4850: fullydistributed_grids/copy_serial_tria_grouped_01.mpirun=7.debug ......................   Passed   68.86 sec
            Start  7530: matrix_free/parallel_multigrid_02.mpirun=7.release
11436/11561 Test  #7526: matrix_free/parallel_multigrid.mpirun=7.release ........................................   Passed   27.36 sec
            Start  7533: matrix_free/parallel_multigrid_adaptive_01.mpirun=7.debug
11437/11561 Test  #7530: matrix_free/parallel_multigrid_02.mpirun=7.release .....................................   Passed   26.97 sec
            Start  7534: matrix_free/parallel_multigrid_adaptive_01.mpirun=7.release
11438/11561 Test  #7529: matrix_free/parallel_multigrid_02.mpirun=7.debug .......................................   Passed   61.01 sec
            Start  7537: matrix_free/parallel_multigrid_adaptive_02.mpirun=7.debug
11439/11561 Test  #7534: matrix_free/parallel_multigrid_adaptive_01.mpirun=7.release ............................   Passed   37.59 sec
            Start  7538: matrix_free/parallel_multigrid_adaptive_02.mpirun=7.release
11440/11561 Test  #7525: matrix_free/parallel_multigrid.mpirun=7.debug ..........................................   Passed  152.34 sec
            Start  7555: matrix_free/parallel_multigrid_mf.mpirun=7.debug
11441/11561 Test  #7538: matrix_free/parallel_multigrid_adaptive_02.mpirun=7.release ............................   Passed   90.69 sec
            Start  7556: matrix_free/parallel_multigrid_mf.mpirun=7.release
11442/11561 Test  #7533: matrix_free/parallel_multigrid_adaptive_01.mpirun=7.debug ..............................   Passed  152.16 sec
            Start  7989: mpi/derivative_approximation_02.mpirun=7.debug
11443/11561 Test  #7989: mpi/derivative_approximation_02.mpirun=7.debug .........................................   Passed    3.77 sec
            Start  7990: mpi/derivative_approximation_02.mpirun=7.release
11444/11561 Test  #7990: mpi/derivative_approximation_02.mpirun=7.release .......................................   Passed    3.25 sec
            Start  8081: mpi/has_hanging_nodes.mpirun=7.debug
11445/11561 Test  #8081: mpi/has_hanging_nodes.mpirun=7.debug ...................................................   Passed    5.85 sec
            Start  8082: mpi/has_hanging_nodes.mpirun=7.release
11446/11561 Test  #7537: matrix_free/parallel_multigrid_adaptive_02.mpirun=7.debug ..............................   Passed  133.03 sec
            Start  8159: mpi/hp_unify_dof_indices_08.mpirun=7.debug
11447/11561 Test  #8082: mpi/has_hanging_nodes.mpirun=7.release .................................................   Passed    3.16 sec
            Start  8160: mpi/hp_unify_dof_indices_08.mpirun=7.release
11448/11561 Test  #8160: mpi/hp_unify_dof_indices_08.mpirun=7.release ...........................................   Passed    4.94 sec
            Start  8277: mpi/mg_06.mpirun=7.debug
11449/11561 Test  #8277: mpi/mg_06.mpirun=7.debug ...............................................................   Passed   38.06 sec
            Start  8278: mpi/mg_06.mpirun=7.release
11450/11561 Test  #8159: mpi/hp_unify_dof_indices_08.mpirun=7.debug .............................................   Passed   46.61 sec
            Start  8281: mpi/mg_ghost_dofs_periodic_01.mpirun=7.debug
11451/11561 Test  #7556: matrix_free/parallel_multigrid_mf.mpirun=7.release .....................................   Passed   84.23 sec
            Start  8282: mpi/mg_ghost_dofs_periodic_01.mpirun=7.release
11452/11561 Test  #7555: matrix_free/parallel_multigrid_mf.mpirun=7.debug .......................................   Passed   89.31 sec
            Start  8293: mpi/mg_ghost_dofs_periodic_06.mpirun=7.debug
11453/11561 Test  #8282: mpi/mg_ghost_dofs_periodic_01.mpirun=7.release .........................................   Passed    3.59 sec
            Start  8294: mpi/mg_ghost_dofs_periodic_06.mpirun=7.release
11454/11561 Test  #8281: mpi/mg_ghost_dofs_periodic_01.mpirun=7.debug ...........................................   Passed    3.97 sec
            Start  8307: mpi/muelu_periodicity.mpirun=7.debug
11455/11561 Test  #8307: mpi/muelu_periodicity.mpirun=7.debug ...................................................   Passed    4.52 sec
            Start  8308: mpi/muelu_periodicity.mpirun=7.release
11456/11561 Test  #8308: mpi/muelu_periodicity.mpirun=7.release .................................................   Passed    3.83 sec
            Start  8670: mpi/periodicity_02.mpirun=7.debug
11457/11561 Test  #8670: mpi/periodicity_02.mpirun=7.debug ......................................................   Passed    4.28 sec
            Start  8671: mpi/periodicity_02.mpirun=7.release
11458/11561 Test  #8278: mpi/mg_06.mpirun=7.release .............................................................   Passed   19.12 sec
            Start  8678: mpi/periodicity_04.mpirun=7.debug
11459/11561 Test  #8671: mpi/periodicity_02.mpirun=7.release ....................................................   Passed    3.87 sec
            Start  8679: mpi/periodicity_04.mpirun=7.release
11460/11561 Test  #8293: mpi/mg_ghost_dofs_periodic_06.mpirun=7.debug ...........................................   Passed   23.59 sec
            Start  8700: mpi/point_value_01.mpirun=6.debug
11461/11561 Test  #8294: mpi/mg_ghost_dofs_periodic_06.mpirun=7.release .........................................   Passed   20.13 sec
            Start  8701: mpi/point_value_01.mpirun=6.release
11462/11561 Test  #8679: mpi/periodicity_04.mpirun=7.release ....................................................   Passed    5.11 sec
            Start  8838: mpi/step-37.mpirun=7.debug
11463/11561 Test  #8700: mpi/point_value_01.mpirun=6.debug ......................................................   Passed    3.37 sec
            Start  8839: mpi/step-37.mpirun=7.release
11464/11561 Test  #8701: mpi/point_value_01.mpirun=6.release ....................................................   Passed    3.43 sec
            Start  8846: mpi/step-39.mpirun=6.debug
11465/11561 Test  #8839: mpi/step-37.mpirun=7.release ...........................................................   Passed   25.29 sec
            Start  8847: mpi/step-39.mpirun=6.release
11466/11561 Test  #8846: mpi/step-39.mpirun=6.debug .............................................................   Passed   68.10 sec
            Start  8868: mpi/tria_ghost_owners_01.mpirun=7.debug
11467/11561 Test  #8838: mpi/step-37.mpirun=7.debug .............................................................   Passed   75.61 sec
            Start  8869: mpi/tria_ghost_owners_01.mpirun=7.release
11468/11561 Test  #8847: mpi/step-39.mpirun=6.release ...........................................................   Passed   49.10 sec
            Start  9133: multigrid/step-16-50-mpi.mpirun=7.debug
11469/11561 Test  #9133: multigrid/step-16-50-mpi.mpirun=7.debug ................................................   Passed    4.60 sec
            Start  9134: multigrid/step-16-50-mpi.mpirun=7.release
11470/11561 Test  #9134: multigrid/step-16-50-mpi.mpirun=7.release ..............................................   Passed    1.70 sec
            Start  9183: multigrid/transfer_matrix_free_01.mpirun=7.debug
11471/11561 Test  #8678: mpi/periodicity_04.mpirun=7.debug ......................................................   Passed   96.40 sec
            Start  9184: multigrid/transfer_matrix_free_01.mpirun=7.release
11472/11561 Test  #9184: multigrid/transfer_matrix_free_01.mpirun=7.release .....................................   Passed    2.24 sec
            Start  9199: multigrid/transfer_matrix_free_04.mpirun=7.debug
11473/11561 Test  #8869: mpi/tria_ghost_owners_01.mpirun=7.release ..............................................   Passed   35.01 sec
            Start  9200: multigrid/transfer_matrix_free_04.mpirun=7.release
11474/11561 Test  #9183: multigrid/transfer_matrix_free_01.mpirun=7.debug .......................................   Passed   81.83 sec
11475/11561 Test  #9200: multigrid/transfer_matrix_free_04.mpirun=7.release .....................................   Passed   62.62 sec
            Start  7436: matrix_free/matrix_vector_faces_16.mpirun=11.debug
11476/11561 Test  #8868: mpi/tria_ghost_owners_01.mpirun=7.debug ................................................   Passed  108.22 sec
            Start  7705: mpi/attach_data_01.mpirun=8.debug
11477/11561 Test  #7705: mpi/attach_data_01.mpirun=8.debug ......................................................   Passed    3.27 sec
            Start  7706: mpi/attach_data_01.mpirun=8.release
11478/11561 Test  #9199: multigrid/transfer_matrix_free_04.mpirun=7.debug .......................................   Passed   93.00 sec
11479/11561 Test  #7706: mpi/attach_data_01.mpirun=8.release ....................................................   Passed    3.05 sec
            Start  7437: matrix_free/matrix_vector_faces_16.mpirun=11.release
11480/11561 Test  #7436: matrix_free/matrix_vector_faces_16.mpirun=11.debug .....................................   Passed   38.75 sec
            Start  7711: mpi/attach_data_02.mpirun=8.debug
11481/11561 Test  #7711: mpi/attach_data_02.mpirun=8.debug ......................................................   Passed    3.16 sec
            Start  7712: mpi/attach_data_02.mpirun=8.release
11482/11561 Test  #7712: mpi/attach_data_02.mpirun=8.release ....................................................   Passed    3.16 sec
            Start  7723: mpi/cell_data_transfer_01.mpirun=8.debug
11483/11561 Test  #7437: matrix_free/matrix_vector_faces_16.mpirun=11.release ...................................   Passed   35.26 sec
            Start  7724: mpi/cell_data_transfer_01.mpirun=8.release
            Start  7727: mpi/cell_data_transfer_02.mpirun=8.debug
11484/11561 Test  #7723: mpi/cell_data_transfer_01.mpirun=8.debug ...............................................   Passed    3.48 sec
            Start  7728: mpi/cell_data_transfer_02.mpirun=8.release
11485/11561 Test  #7724: mpi/cell_data_transfer_01.mpirun=8.release .............................................   Passed    3.62 sec
            Start  7731: mpi/cell_data_transfer_03.mpirun=8.debug
11486/11561 Test  #7727: mpi/cell_data_transfer_02.mpirun=8.debug ...............................................   Passed    3.78 sec
            Start  7732: mpi/cell_data_transfer_03.mpirun=8.release
11487/11561 Test  #7728: mpi/cell_data_transfer_02.mpirun=8.release .............................................   Passed    3.14 sec
            Start  7995: mpi/distort_random_01.mpirun=8.debug
11488/11561 Test  #7732: mpi/cell_data_transfer_03.mpirun=8.release .............................................   Passed    3.12 sec
            Start  7996: mpi/distort_random_01.mpirun=8.release
11489/11561 Test  #7731: mpi/cell_data_transfer_03.mpirun=8.debug ...............................................   Passed    3.42 sec
            Start  8001: mpi/distort_random_02.mpirun=8.debug
11490/11561 Test  #7995: mpi/distort_random_01.mpirun=8.debug ...................................................   Passed    3.89 sec
            Start  8002: mpi/distort_random_02.mpirun=8.release
11491/11561 Test  #7996: mpi/distort_random_01.mpirun=8.release .................................................   Passed    3.46 sec
            Start  8085: mpi/hp_active_fe_indices_transfer_01.mpirun=8.debug
11492/11561 Test  #8001: mpi/distort_random_02.mpirun=8.debug ...................................................   Passed    4.28 sec
            Start  8086: mpi/hp_active_fe_indices_transfer_01.mpirun=8.release
11493/11561 Test  #8002: mpi/distort_random_02.mpirun=8.release .................................................   Passed    3.64 sec
            Start  8089: mpi/hp_active_fe_indices_transfer_02.mpirun=8.debug
11494/11561 Test  #8085: mpi/hp_active_fe_indices_transfer_01.mpirun=8.debug ....................................   Passed    3.51 sec
            Start  8090: mpi/hp_active_fe_indices_transfer_02.mpirun=8.release
11495/11561 Test  #8086: mpi/hp_active_fe_indices_transfer_01.mpirun=8.release ..................................   Passed    3.13 sec
            Start  8093: mpi/hp_active_fe_indices_transfer_03.mpirun=8.debug
11496/11561 Test  #8089: mpi/hp_active_fe_indices_transfer_02.mpirun=8.debug ....................................   Passed    3.84 sec
            Start  8094: mpi/hp_active_fe_indices_transfer_03.mpirun=8.release
11497/11561 Test  #8090: mpi/hp_active_fe_indices_transfer_02.mpirun=8.release ..................................   Passed    3.10 sec
            Start  8317: mpi/no_flux_constraints.mpirun=9.debug
11498/11561 Test  #8093: mpi/hp_active_fe_indices_transfer_03.mpirun=8.debug ....................................   Passed    3.41 sec
            Start  8318: mpi/no_flux_constraints.mpirun=9.release
11499/11561 Test  #8094: mpi/hp_active_fe_indices_transfer_03.mpirun=8.release ..................................   Passed    3.15 sec
            Start  8321: mpi/no_flux_constraints_02.mpirun=9.debug
11500/11561 Test  #8321: mpi/no_flux_constraints_02.mpirun=9.debug ..............................................   Passed   10.84 sec
            Start  8322: mpi/no_flux_constraints_02.mpirun=9.release
11501/11561 Test  #8322: mpi/no_flux_constraints_02.mpirun=9.release ............................................   Passed    4.35 sec
            Start  8325: mpi/no_flux_constraints_03.mpirun=9.debug
11502/11561 Test  #8325: mpi/no_flux_constraints_03.mpirun=9.debug ..............................................   Passed    5.20 sec
            Start  8326: mpi/no_flux_constraints_03.mpirun=9.release
11503/11561 Test  #8318: mpi/no_flux_constraints.mpirun=9.release ...............................................   Passed   22.74 sec
            Start  8327: mpi/normal_flux_constraints.mpirun=9.debug
11504/11561 Test  #8326: mpi/no_flux_constraints_03.mpirun=9.release ............................................   Passed    7.64 sec
            Start  8328: mpi/normal_flux_constraints.mpirun=9.release
11505/11561 Test  #8317: mpi/no_flux_constraints.mpirun=9.debug .................................................   Passed   34.09 sec
            Start  8472: mpi/p_adaptivity_fixed_number.mpirun=8.debug
11506/11561 Test  #8472: mpi/p_adaptivity_fixed_number.mpirun=8.debug ...........................................   Passed    3.25 sec
            Start  8473: mpi/p_adaptivity_fixed_number.mpirun=8.release
11507/11561 Test  #8473: mpi/p_adaptivity_fixed_number.mpirun=8.release .........................................   Passed    2.96 sec
            Start  8478: mpi/p_refinement_and_coarsening.mpirun=8.debug
11508/11561 Test  #8478: mpi/p_refinement_and_coarsening.mpirun=8.debug .........................................   Passed    3.43 sec
            Start  8479: mpi/p_refinement_and_coarsening.mpirun=8.release
11509/11561 Test  #8479: mpi/p_refinement_and_coarsening.mpirun=8.release .......................................   Passed    3.03 sec
            Start  8680: mpi/periodicity_05.mpirun=9.debug
11510/11561 Test  #8328: mpi/normal_flux_constraints.mpirun=9.release ...........................................   Passed   26.09 sec
            Start  8681: mpi/periodicity_05.mpirun=9.release
11511/11561 Test  #8327: mpi/normal_flux_constraints.mpirun=9.debug .............................................   Passed   34.50 sec
            Start  9022: multigrid/constrained_dofs_02.mpirun=8.debug
11512/11561 Test  #9022: multigrid/constrained_dofs_02.mpirun=8.debug ...........................................   Passed    1.02 sec
            Start  9023: multigrid/constrained_dofs_02.mpirun=8.release
11513/11561 Test  #9023: multigrid/constrained_dofs_02.mpirun=8.release .........................................   Passed    0.78 sec
            Start  9153: multigrid/step-50_01.mpirun=8.debug
11514/11561 Test  #9153: multigrid/step-50_01.mpirun=8.debug ....................................................   Passed    1.75 sec
            Start  9154: multigrid/step-50_01.mpirun=8.release
11515/11561 Test  #9154: multigrid/step-50_01.mpirun=8.release ..................................................   Passed    1.07 sec
            Start 10252: remote_point_evaluation/remote_point_evaluation_03.mpirun=8.debug
11516/11561 Test  #8680: mpi/periodicity_05.mpirun=9.debug ......................................................   Passed   27.10 sec
            Start 10253: remote_point_evaluation/remote_point_evaluation_03.mpirun=8.release
11517/11561 Test  #8681: mpi/periodicity_05.mpirun=9.release ....................................................   Passed   21.34 sec
            Start 10254: remote_point_evaluation/vector_tools_evaluate_at_points_01.mpirun=8.debug
11518/11561 Test #10252: remote_point_evaluation/remote_point_evaluation_03.mpirun=8.debug ......................   Passed   41.34 sec
            Start 10255: remote_point_evaluation/vector_tools_evaluate_at_points_01.mpirun=8.release
11519/11561 Test #10253: remote_point_evaluation/remote_point_evaluation_03.mpirun=8.release ....................   Passed   34.14 sec
            Start 10256: remote_point_evaluation/vector_tools_evaluate_at_points_02.mpirun=8.debug
11520/11561 Test #10254: remote_point_evaluation/vector_tools_evaluate_at_points_01.mpirun=8.debug ..............   Passed   31.70 sec
            Start 10257: remote_point_evaluation/vector_tools_evaluate_at_points_02.mpirun=8.release
11521/11561 Test #10255: remote_point_evaluation/vector_tools_evaluate_at_points_01.mpirun=8.release ............   Passed   28.72 sec
            Start 11100: trilinos/n_nonzeros_02_parallel.mpirun=9.debug
11522/11561 Test #10256: remote_point_evaluation/vector_tools_evaluate_at_points_02.mpirun=8.debug ..............***Failed   41.16 sec
            Start 11101: trilinos/n_nonzeros_02_parallel.mpirun=9.release
11523/11561 Test #10257: remote_point_evaluation/vector_tools_evaluate_at_points_02.mpirun=8.release ............***Failed   39.71 sec
11524/11561 Test #11100: trilinos/n_nonzeros_02_parallel.mpirun=9.debug .........................................   Passed   19.82 sec
            Start  8069: mpi/fe_tools_extrapolate_06.mpirun=10.debug
11525/11561 Test  #8069: mpi/fe_tools_extrapolate_06.mpirun=10.debug ............................................   Passed    6.55 sec
            Start  8070: mpi/fe_tools_extrapolate_06.mpirun=10.release
11526/11561 Test  #8070: mpi/fe_tools_extrapolate_06.mpirun=10.release ..........................................   Passed    3.44 sec
            Start  8075: mpi/has_active_dofs_01.mpirun=10.debug
11527/11561 Test #11101: trilinos/n_nonzeros_02_parallel.mpirun=9.release .......................................   Passed   16.69 sec
            Start  8076: mpi/has_active_dofs_01.mpirun=10.release
11528/11561 Test  #8075: mpi/has_active_dofs_01.mpirun=10.debug .................................................   Passed   21.78 sec
            Start  8077: mpi/has_active_dofs_02.mpirun=10.debug
11529/11561 Test  #8076: mpi/has_active_dofs_01.mpirun=10.release ...............................................   Passed   19.85 sec
            Start  8078: mpi/has_active_dofs_02.mpirun=10.release
11530/11561 Test  #8078: mpi/has_active_dofs_02.mpirun=10.release ...............................................   Passed   16.63 sec
            Start  8161: mpi/hp_unify_dof_indices_09.mpirun=10.debug
11531/11561 Test  #8077: mpi/has_active_dofs_02.mpirun=10.debug .................................................   Passed   19.32 sec
            Start  8162: mpi/hp_unify_dof_indices_09.mpirun=10.release
11532/11561 Test  #8162: mpi/hp_unify_dof_indices_09.mpirun=10.release ..........................................   Passed   18.16 sec
            Start  8275: mpi/mg_05.mpirun=10.debug
11533/11561 Test  #8161: mpi/hp_unify_dof_indices_09.mpirun=10.debug ............................................   Passed   21.82 sec
            Start  8276: mpi/mg_05.mpirun=10.release
11534/11561 Test  #8276: mpi/mg_05.mpirun=10.release ............................................................   Passed   17.96 sec
            Start  8524: mpi/parallel_block_vector_13.mpirun=10.debug
11535/11561 Test  #8275: mpi/mg_05.mpirun=10.debug ..............................................................   Passed   21.79 sec
            Start  8525: mpi/parallel_block_vector_13.mpirun=10.release
11536/11561 Test  #8524: mpi/parallel_block_vector_13.mpirun=10.debug ...........................................   Passed   14.64 sec
            Start  8684: mpi/periodicity_07.mpirun=13.debug
11537/11561 Test  #8525: mpi/parallel_block_vector_13.mpirun=10.release .........................................   Passed   13.60 sec
            Start  8685: mpi/periodicity_07.mpirun=13.release
11538/11561 Test  #8685: mpi/periodicity_07.mpirun=13.release ...................................................   Passed   27.40 sec
11539/11561 Test  #8684: mpi/periodicity_07.mpirun=13.debug .....................................................   Passed   31.72 sec
            Start  8289: mpi/mg_ghost_dofs_periodic_05.mpirun=28.debug
11540/11561 Test  #8289: mpi/mg_ghost_dofs_periodic_05.mpirun=28.debug ..........................................   Passed   45.43 sec
            Start  8290: mpi/mg_ghost_dofs_periodic_05.mpirun=28.release
11541/11561 Test  #8290: mpi/mg_ghost_dofs_periodic_05.mpirun=28.release ........................................   Passed   24.32 sec
            Start  8441: mpi/p4est_3d_refine_04.mpirun=24.debug
11542/11561 Test  #8441: mpi/p4est_3d_refine_04.mpirun=24.debug .................................................   Passed   10.07 sec
            Start  8442: mpi/p4est_3d_refine_04.mpirun=24.release
11543/11561 Test  #8442: mpi/p4est_3d_refine_04.mpirun=24.release ...............................................   Passed    3.45 sec
            Start  8768: mpi/refinement_listener_01.mpirun=20.debug
            Start  8443: mpi/p4est_3d_refine_04.mpirun=4.debug
11544/11561 Test  #8768: mpi/refinement_listener_01.mpirun=20.debug .............................................   Passed    4.74 sec
            Start  8769: mpi/refinement_listener_01.mpirun=20.release
11545/11561 Test  #8769: mpi/refinement_listener_01.mpirun=20.release ...........................................   Passed    3.57 sec
            Start  8774: mpi/refinement_listener_02.mpirun=20.debug
11546/11561 Test  #8443: mpi/p4est_3d_refine_04.mpirun=4.debug ..................................................   Passed   10.05 sec
            Start  8444: mpi/p4est_3d_refine_04.mpirun=4.release
11547/11561 Test  #8774: mpi/refinement_listener_02.mpirun=20.debug .............................................   Passed    3.79 sec
            Start  8775: mpi/refinement_listener_02.mpirun=20.release
11548/11561 Test  #8444: mpi/p4est_3d_refine_04.mpirun=4.release ................................................   Passed    3.40 sec
            Start  8770: mpi/refinement_listener_01.mpirun=4.debug
11549/11561 Test  #8775: mpi/refinement_listener_02.mpirun=20.release ...........................................   Passed    3.34 sec
            Start  9039: multigrid/distribute_bug_01.mpirun=20.debug
11550/11561 Test  #8770: mpi/refinement_listener_01.mpirun=4.debug ..............................................   Passed    4.14 sec
            Start  8771: mpi/refinement_listener_01.mpirun=4.release
11551/11561 Test  #9039: multigrid/distribute_bug_01.mpirun=20.debug ............................................   Passed    5.56 sec
            Start  9040: multigrid/distribute_bug_01.mpirun=20.release
11552/11561 Test  #8771: mpi/refinement_listener_01.mpirun=4.release ............................................   Passed    3.75 sec
            Start  8776: mpi/refinement_listener_02.mpirun=4.debug
11553/11561 Test  #9040: multigrid/distribute_bug_01.mpirun=20.release ..........................................   Passed    1.25 sec
            Start  8291: mpi/mg_ghost_dofs_periodic_05.mpirun=6.debug
            Start  8292: mpi/mg_ghost_dofs_periodic_05.mpirun=6.release
            Start  8777: mpi/refinement_listener_02.mpirun=4.release
11554/11561 Test  #8776: mpi/refinement_listener_02.mpirun=4.debug ..............................................   Passed    3.57 sec
            Start  9041: multigrid/distribute_bug_01.mpirun=6.debug
11555/11561 Test  #8777: mpi/refinement_listener_02.mpirun=4.release ............................................   Passed    3.66 sec
            Start  9042: multigrid/distribute_bug_01.mpirun=6.release
11556/11561 Test  #8292: mpi/mg_ghost_dofs_periodic_05.mpirun=6.release .........................................   Passed    4.72 sec
11557/11561 Test  #9042: multigrid/distribute_bug_01.mpirun=6.release ...........................................   Passed    3.09 sec
11558/11561 Test  #9041: multigrid/distribute_bug_01.mpirun=6.debug .............................................   Passed    4.58 sec
11559/11561 Test  #8291: mpi/mg_ghost_dofs_periodic_05.mpirun=6.debug ...........................................   Passed   22.89 sec
            Start  8297: mpi/mg_ghost_dofs_periodic_07.mpirun=43.debug
11560/11561 Test  #8297: mpi/mg_ghost_dofs_periodic_07.mpirun=43.debug ..........................................   Passed    7.77 sec
            Start  8298: mpi/mg_ghost_dofs_periodic_07.mpirun=43.release
11561/11561 Test  #8298: mpi/mg_ghost_dofs_periodic_07.mpirun=43.release ........................................   Passed    4.87 sec

99% tests passed, 30 tests failed out of 11561

Total Test time (real) = 23672.98 sec

The following tests FAILED:
	2811 - cuda/coefficient_eval.debug (Failed)
	2831 - cuda/cuda_vector_05.debug (Failed)
	2832 - cuda/cuda_vector_05.release (Failed)
	2837 - cuda/matrix_free_matrix_vector_01.debug (Failed)
	2839 - cuda/matrix_free_matrix_vector_02.debug (Failed)
	2841 - cuda/matrix_free_matrix_vector_03.debug (Failed)
	2842 - cuda/matrix_free_matrix_vector_03.release (Failed)
	2843 - cuda/matrix_free_matrix_vector_03b.debug (Failed)
	2844 - cuda/matrix_free_matrix_vector_03b.release (Failed)
	2845 - cuda/matrix_free_matrix_vector_04.debug (Failed)
	2847 - cuda/matrix_free_matrix_vector_05.debug (Failed)
	2848 - cuda/matrix_free_matrix_vector_05.release (Failed)
	2919 - cuda/precondition_03.mpirun=2.debug (Failed)
	2935 - cuda/solver_08.debug (Failed)
	3173 - distributed_grids/3d_coarse_grid_02.debug (Failed)
	4862 - fullydistributed_grids/repartitioning_05.mpirun=4.debug (Failed)
	4863 - fullydistributed_grids/repartitioning_05.mpirun=4.release (Failed)
	5661 - hp/distribute_dofs_linear_time.debug (Timeout)
	7474 - matrix_free/matrix_vector_hessians_faces.debug (Failed)
	7475 - matrix_free/matrix_vector_hessians_faces.release (Failed)
	8055 - mpi/fe_tools_extrapolate_01.mpirun=3.debug (Failed)
	8056 - mpi/fe_tools_extrapolate_01.mpirun=3.release (Failed)
	8061 - mpi/fe_tools_extrapolate_03.mpirun=3.debug (Failed)
	8062 - mpi/fe_tools_extrapolate_03.mpirun=3.release (Failed)
	8065 - mpi/fe_tools_extrapolate_04.mpirun=3.debug (Failed)
	8066 - mpi/fe_tools_extrapolate_04.mpirun=3.release (Failed)
	10256 - remote_point_evaluation/vector_tools_evaluate_at_points_02.mpirun=8.debug (Failed)
	10257 - remote_point_evaluation/vector_tools_evaluate_at_points_02.mpirun=8.release (Failed)
	11094 - trilinos/mg_transfer_prebuilt_01.mpirun=1.debug (Failed)
	11095 - trilinos/mg_transfer_prebuilt_01.mpirun=1.release (Failed)
-- Running CTEST_SUBMIT()
	Add file: /home/build/revision.log
	Add file: /home/build/summary.log
	Add file: /home/build/detailed.log
	Add file: /home/build/include/deal.II/base/config.h
Submit files
   Send to group: Continuous
   SubmitURL: https://cdash.43-1.org/submit.php?project=deal.II
   Uploaded: /home/build/Testing/20210901-0459/Update.xml
   Uploaded: /home/build/Testing/20210901-0459/Configure.xml
   Uploaded: /home/build/Testing/20210901-0459/Build.xml
   Error when uploading file: /home/build/Testing/20210901-0459/Test.xml
   Error message was: Operation too slow. Less than 1 bytes/sec transferred the last 120 seconds
   Problems when submitting via HTTP
mv: error writing '/var/jenkins/workspace/deal.II-CUDA11.0/build/tests/hp/solution_transfer_09.debug/solution_transfer_09.debug': No space left on device
mv: cannot create regular file '/var/jenkins/workspace/deal.II-CUDA11.0/build/tests/hp/solution_transfer_09.debug/stdout': No space left on device
mv: cannot create regular file '/var/jenkins/workspace/deal.II-CUDA11.0/build/tests/hp/solution_transfer_09.debug/diff': No space left on device
mv: cannot create regular file '/var/jenkins/workspace/deal.II-CUDA11.0/build/tests/hp/solution_transfer_09.debug/output': No space left on device
mv: setting attribute 'security.selinux' for 'security.selinux': No space left on device
mv: cannot create directory '/var/jenkins/workspace/deal.II-CUDA11.0/build/tests/hp/hp_fe_values_copy.release': No space left on device
mv: cannot create directory '/var/jenkins/workspace/deal.II-CUDA11.0/build/tests/hp/identity_constraints_01.release': No space left on device
mv: cannot create directory '/var/jenkins/workspace/deal.II-CUDA11.0/build/tests/hp/matrices_hp.release': No space left on device
mv: cannot create directory '/var/jenkins/workspace/deal.II-CUDA11.0/build/tests/hp/solution_transfer_09.release': No space left on device
mv: cannot create directory '/var/jenkins/workspace/deal.II-CUDA11.0/build/tests/hp/step-3b.release': No space left on device
mv: cannot create directory '/var/jenkins/workspace/deal.II-CUDA11.0/build/tests/hp/crash_13.debug': No space left on device
mv: cannot create directory '/var/jenkins/workspace/deal.II-CUDA11.0/build/tests/hp/create_mass_matrix_02.release': No space left on device
mv: cannot create directory '/var/jenkins/workspace/deal.II-CUDA11.0/build/tests/hp/hp_line_dof_identities_rt_nodal.debug': No space left on device
mv: cannot create directory '/var/jenkins/workspace/deal.II-CUDA11.0/build/tests/hp/hp_quad_dof_identities_q_system_multiway.release': No space left on device
mv: cannot create directory '/var/jenkins/workspace/deal.II-CUDA11.0/build/tests/hp/refinement_01.release': No space left on device
mv: cannot create directory '/var/jenkins/workspace/deal.II-CUDA11.0/build/tests/hp/create_mass_matrix_02b.debug': No space left on device
mv: cannot create directory '/var/jenkins/workspace/deal.II-CUDA11.0/build/tests/hp/fe_collection_01.release': No space left on device
mv: cannot create directory '/var/jenkins/workspace/deal.II-CUDA11.0/build/tests/hp/crash_13.release': No space left on device
mv: cannot create directory '/var/jenkins/workspace/deal.II-CUDA11.0/build/tests/hp/create_mass_matrix_02b.release': No space left on device
mv: cannot create directory '/var/jenkins/workspace/deal.II-CUDA11.0/build/tests/hp/fe_nothing_21.debug': No space left on device
mv: cannot create directory '/var/jenkins/workspace/deal.II-CUDA11.0/build/tests/hp/hp_hanging_nodes_01.debug': No space left on device
mv: cannot create directory '/var/jenkins/workspace/deal.II-CUDA11.0/build/tests/hp/hp_quad_dof_identities_rt_nodal.debug': No space left on device
mv: cannot create directory '/var/jenkins/workspace/deal.II-CUDA11.0/build/tests/hp/identity_constraints_02.debug': No space left on device
mv: cannot create directory '/var/jenkins/workspace/deal.II-CUDA11.0/build/tests/hp/n_active_fe_indices.debug': No space left on device
mv: cannot create directory '/var/jenkins/workspace/deal.II-CUDA11.0/build/tests/hp/renumber_block_wise_01.debug': No space left on device
mv: cannot create directory '/var/jenkins/workspace/deal.II-CUDA11.0/build/tests/hp/step-3c.debug': No space left on device
mv: cannot create directory '/var/jenkins/workspace/deal.II-CUDA11.0/build/tests/hp/vertex_dof_index.debug': No space left on device
mv: cannot create directory '/var/jenkins/workspace/deal.II-CUDA11.0/build/tests/hp/create_mass_matrix_03.debug': No space left on device
mv: cannot create directory '/var/jenkins/workspace/deal.II-CUDA11.0/build/tests/hp/fe_collection_02.debug': No space left on device
mv: cannot create directory '/var/jenkins/workspace/deal.II-CUDA11.0/build/tests/hp/hp_line_dof_identities_rt_nodal.release': No space left on device
mv: cannot create directory '/var/jenkins/workspace/deal.II-CUDA11.0/build/tests/hp/identity_constraints_02.release': No space left on device
mv: cannot create directory '/var/jenkins/workspace/deal.II-CUDA11.0/build/tests/hp/n_active_fe_indices.release': No space left on device
mv: cannot create directory '/var/jenkins/workspace/deal.II-CUDA11.0/build/tests/hp/hp_quad_dof_identities_rt_nodal.release': No space left on device
mv: cannot create directory '/var/jenkins/workspace/deal.II-CUDA11.0/build/tests/hp/create_mass_matrix_03.release': No space left on device
mv: cannot create directory '/var/jenkins/workspace/deal.II-CUDA11.0/build/tests/hp/fe_collection_02.release': No space left on device
mv: cannot create directory '/var/jenkins/workspace/deal.II-CUDA11.0/build/tests/hp/hp_hanging_nodes_01.release': No space left on device
mv: cannot create directory '/var/jenkins/workspace/deal.II-CUDA11.0/build/tests/hp/hp_q_hierarchical_constraints.debug': No space left on device
mv: cannot create directory '/var/jenkins/workspace/deal.II-CUDA11.0/build/tests/hp/step-3c.release': No space left on device
mv: cannot create directory '/var/jenkins/workspace/deal.II-CUDA11.0/build/tests/hp/renumber_block_wise_01.release': No space left on device
mv: cannot create directory '/var/jenkins/workspace/deal.II-CUDA11.0/build/tests/hp/renumber_block_wise_01a.debug': No space left on device
mv: cannot create directory '/var/jenkins/workspace/deal.II-CUDA11.0/build/tests/hp/solution_transfer_10.debug': No space left on device
mv: cannot create directory '/var/jenkins/workspace/deal.II-CUDA11.0/build/tests/hp/crash_14.debug': No space left on device
mv: cannot create directory '/var/jenkins/workspace/deal.II-CUDA11.0/build/tests/hp/create_mass_matrix_03b.debug': No space left on device
mv: cannot create directory '/var/jenkins/workspace/deal.II-CUDA11.0/build/tests/hp/fe_collection_03.debug': No space left on device
mv: cannot create directory '/var/jenkins/workspace/deal.II-CUDA11.0/build/tests/hp/integrate_difference.debug': No space left on device
mv: cannot create directory '/var/jenkins/workspace/deal.II-CUDA11.0/build/tests/hp/n_boundary_dofs.debug': No space left on device
mv: cannot create directory '/var/jenkins/workspace/deal.II-CUDA11.0/build/tests/hp/step-4.debug': No space left on device
mv: cannot create directory '/var/jenkins/workspace/deal.II-CUDA11.0/build/tests/hp/vertex_dof_index.release': No space left on device
mv: cannot create directory '/var/jenkins/workspace/deal.II-CUDA11.0/build/tests/hp/fe_nothing_21.release': No space left on device
mv: cannot create directory '/var/jenkins/workspace/deal.II-CUDA11.0/build/tests/hp/hp_hanging_nodes_02.debug': No space left on device
mv: cannot create directory '/var/jenkins/workspace/deal.II-CUDA11.0/build/tests/hp/hp_vertex_dof_identities_dgp.debug': No space left on device
mv: cannot create directory '/var/jenkins/workspace/deal.II-CUDA11.0/build/tests/hp/crash_14.release': No space left on device
mv: cannot create directory '/var/jenkins/workspace/deal.II-CUDA11.0/build/tests/hp/hp_q_hierarchical_constraints.release': No space left on device
mv: cannot create directory '/var/jenkins/workspace/deal.II-CUDA11.0/build/tests/hp/integrate_difference.release': No space left on device
mv: cannot create directory '/var/jenkins/workspace/deal.II-CUDA11.0/build/tests/hp/n_boundary_dofs.release': No space left on device
mv: cannot create directory '/var/jenkins/workspace/deal.II-CUDA11.0/build/tests/hp/renumber_block_wise_01a.release': No space left on device
mv: cannot create directory '/var/jenkins/workspace/deal.II-CUDA11.0/build/tests/hp/step-4.release': No space left on device
mv: cannot create directory '/var/jenkins/workspace/deal.II-CUDA11.0/build/tests/hp/crash_15.debug': No space left on device
mv: cannot create directory '/var/jenkins/workspace/deal.II-CUDA11.0/build/tests/hp/create_mass_matrix_03b.release': No space left on device
mv: cannot create directory '/var/jenkins/workspace/deal.II-CUDA11.0/build/tests/hp/fe_collection_03.release': No space left on device
mv: cannot create directory '/var/jenkins/workspace/deal.II-CUDA11.0/build/tests/hp/integrate_difference_02.debug': No space left on device
mv: cannot create directory '/var/jenkins/workspace/deal.II-CUDA11.0/build/tests/hp/n_boundary_dofs_01.debug': No space left on device
mv: cannot create directory '/var/jenkins/workspace/deal.II-CUDA11.0/build/tests/hp/fe_nothing_22.debug': No space left on device
mv: cannot create directory '/var/jenkins/workspace/deal.II-CUDA11.0/build/tests/hp/solution_transfer_10.release': No space left on device
mv: cannot create directory '/var/jenkins/workspace/deal.II-CUDA11.0/build/tests/hp/fe_collection_04.debug': No space left on device
mv: cannot create directory '/var/jenkins/workspace/deal.II-CUDA11.0/build/tests/hp/fe_nothing_22.release': No space left on device
mv: cannot create directory '/var/jenkins/workspace/deal.II-CUDA11.0/build/tests/hp/hp_quad_dof_identities_dgp.debug': No space left on device
mv: cannot create directory '/var/jenkins/workspace/deal.II-CUDA11.0/build/tests/hp/hp_vertex_dof_identities_dgp.release': No space left on device
mv: cannot create directory '/var/jenkins/workspace/deal.II-CUDA11.0/build/tests/hp/integrate_difference_02.release': No space left on device
mv: cannot create directory '/var/jenkins/workspace/deal.II-CUDA11.0/build/tests/hp/renumber_block_wise_01b.debug': No space left on device
mv: cannot create directory '/var/jenkins/workspace/deal.II-CUDA11.0/build/tests/hp/crash_15.release': No space left on device
mv: cannot create directory '/var/jenkins/workspace/deal.II-CUDA11.0/build/tests/hp/create_mass_matrix_04.debug': No space left on device
mv: cannot create directory '/var/jenkins/workspace/deal.II-CUDA11.0/build/tests/hp/fe_collection_05.debug': No space left on device
mv: cannot create directory '/var/jenkins/workspace/deal.II-CUDA11.0/build/tests/hp/fe_nothing_dominates_01.debug': No space left on device
mv: cannot create directory '/var/jenkins/workspace/deal.II-CUDA11.0/build/tests/hp/hp_hanging_nodes_02.release': No space left on device
mv: cannot create directory '/var/jenkins/workspace/deal.II-CUDA11.0/build/tests/hp/n_boundary_dofs_01.release': No space left on device
mv: cannot create directory '/var/jenkins/workspace/deal.II-CUDA11.0/build/tests/hp/renumber_block_wise_01b.release': No space left on device
mv: cannot create directory '/var/jenkins/workspace/deal.II-CUDA11.0/build/tests/hp/fe_collection_05.release': No space left on device
mv: cannot create directory '/var/jenkins/workspace/deal.II-CUDA11.0/build/tests/hp/fe_nothing_dominates_01.release': No space left on device
mv: cannot create directory '/var/jenkins/workspace/deal.II-CUDA11.0/build/tests/hp/step-5.debug': No space left on device
mv: cannot create directory '/var/jenkins/workspace/deal.II-CUDA11.0/build/tests/hp/crash_16.debug': No space left on device
mv: cannot create directory '/var/jenkins/workspace/deal.II-CUDA11.0/build/tests/hp/create_mass_matrix_04.release': No space left on device
mv: cannot create directory '/var/jenkins/workspace/deal.II-CUDA11.0/build/tests/hp/fe_collection_06.debug': No space left on device
mv: cannot create directory '/var/jenkins/workspace/deal.II-CUDA11.0/build/tests/hp/fe_nothing_dominates_02.debug': No space left on device
mv: cannot create directory '/var/jenkins/workspace/deal.II-CUDA11.0/build/tests/hp/hp_quad_dof_identities_dgp.release': No space left on device
mv: cannot create directory '/var/jenkins/workspace/deal.II-CUDA11.0/build/tests/hp/hp_vertex_dof_identities_dgp_monomial.debug': No space left on device
mv: cannot create directory '/var/jenkins/workspace/deal.II-CUDA11.0/build/tests/hp/integrate_difference_03.debug': No space left on device
mv: cannot create directory '/var/jenkins/workspace/deal.II-CUDA11.0/build/tests/hp/accessor_0.debug': No space left on device
mv: cannot create directory '/var/jenkins/workspace/deal.II-CUDA11.0/build/tests/hp/crash_16.release': No space left on device
mv: cannot create directory '/var/jenkins/workspace/deal.II-CUDA11.0/build/tests/hp/fe_collection_06.release': No space left on device
mv: cannot create directory '/var/jenkins/workspace/deal.II-CUDA11.0/build/tests/hp/fe_nothing_dominates_02.release': No space left on device
mv: cannot create directory '/var/jenkins/workspace/deal.II-CUDA11.0/build/tests/hp/hp_line_dof_identities_dgp.debug': No space left on device
mv: cannot create directory '/var/jenkins/workspace/deal.II-CUDA11.0/build/tests/hp/renumber_block_wise_02.debug': No space left on device
mv: cannot create directory '/var/jenkins/workspace/deal.II-CUDA11.0/build/tests/hp/step-5.release': No space left on device
mv: cannot create directory '/var/jenkins/workspace/deal.II-CUDA11.0/build/tests/hp/accessor_0.release': No space left on device
mv: cannot create directory '/var/jenkins/workspace/deal.II-CUDA11.0/build/tests/hp/fe_face_values_reinit_01.debug': No space left on device
mv: cannot create directory '/var/jenkins/workspace/deal.II-CUDA11.0/build/tests/hp/hp_quad_dof_identities_dgp_monomial.debug': No space left on device
mv: cannot create directory '/var/jenkins/workspace/deal.II-CUDA11.0/build/tests/hp/hp_vertex_dof_identities_dgp_monomial.release': No space left on device
mv: cannot create directory '/var/jenkins/workspace/deal.II-CUDA11.0/build/tests/hp/solution_transfer_11.debug': No space left on device
mv: cannot create directory '/var/jenkins/workspace/deal.II-CUDA11.0/build/tests/hp/boundary_matrices.debug': No space left on device
mv: cannot create directory '/var/jenkins/workspace/deal.II-CUDA11.0/build/tests/hp/crash_17.debug': No space left on device
mv: cannot create directory '/var/jenkins/workspace/deal.II-CUDA11.0/build/tests/hp/create_mass_matrix_04b.debug': No space left on device
mv: cannot create directory '/var/jenkins/workspace/deal.II-CUDA11.0/build/tests/hp/fe_nothing_dominates_03.debug': No space left on device
mv: cannot create directory '/var/jenkins/workspace/deal.II-CUDA11.0/build/tests/hp/hp_line_dof_identities_dgp.release': No space left on device
mv: cannot create directory '/var/jenkins/workspace/deal.II-CUDA11.0/build/tests/hp/step-6.debug': No space left on device
mv: cannot create directory '/var/jenkins/workspace/deal.II-CUDA11.0/build/tests/hp/boundary_matrices.release': No space left on device
mv: cannot create directory '/var/jenkins/workspace/deal.II-CUDA11.0/build/tests/hp/fe_face_values_reinit_01.release': No space left on device
mv: cannot create directory '/var/jenkins/workspace/deal.II-CUDA11.0/build/tests/hp/fe_nothing_dominates_03.release': No space left on device
mv: cannot create directory '/var/jenkins/workspace/deal.II-CUDA11.0/build/tests/hp/hp_quad_dof_identities_dgp_monomial.release': No space left on device
mv: cannot create directory '/var/jenkins/workspace/deal.II-CUDA11.0/build/tests/hp/integrate_difference_03.release': No space left on device
mv: cannot create directory '/var/jenkins/workspace/deal.II-CUDA11.0/build/tests/hp/crash_17.release': No space left on device
mv: cannot create directory '/var/jenkins/workspace/deal.II-CUDA11.0/build/tests/hp/create_mass_matrix_04b.release': No space left on device
mv: cannot create directory '/var/jenkins/workspace/deal.II-CUDA11.0/build/tests/hp/fe_hierarchy.debug': No space left on device
mv: cannot create directory '/var/jenkins/workspace/deal.II-CUDA11.0/build/tests/hp/hp_line_dof_identities_dgp_monomial.debug': No space left on device
mv: cannot create directory '/var/jenkins/workspace/deal.II-CUDA11.0/build/tests/hp/hp_vertex_dof_identities_dgp_monomial_system_01.debug': No space left on device
mv: cannot create directory '/var/jenkins/workspace/deal.II-CUDA11.0/build/tests/hp/boundary_matrices_hp.debug': No space left on device
mv: cannot create directory '/var/jenkins/workspace/deal.II-CUDA11.0/build/tests/hp/fe_hierarchy.release': No space left on device
mv: cannot create directory '/var/jenkins/workspace/deal.II-CUDA11.0/build/tests/hp/hp_line_dof_identities_dgp_monomial.release': No space left on device
mv: cannot create directory '/var/jenkins/workspace/deal.II-CUDA11.0/build/tests/hp/hp_vertex_dof_identities_dgp_monomial_system_01.release': No space left on device
mv: cannot create directory '/var/jenkins/workspace/deal.II-CUDA11.0/build/tests/hp/interpolate_dgq_01.debug': No space left on device
mv: cannot create directory '/var/jenkins/workspace/deal.II-CUDA11.0/build/tests/hp/n_boundary_dofs_02.debug': No space left on device
mv: cannot create directory '/var/jenkins/workspace/deal.II-CUDA11.0/build/tests/hp/solution_transfer_11.release': No space left on device
mv: cannot create directory '/var/jenkins/workspace/deal.II-CUDA11.0/build/tests/hp/step-6.release': No space left on device
mv: cannot create directory '/var/jenkins/workspace/deal.II-CUDA11.0/build/tests/hp/fe_hierarchy_sequence.debug': No space left on device
mv: cannot create directory '/var/jenkins/workspace/deal.II-CUDA11.0/build/tests/hp/fe_values_01.debug': No space left on device
mv: cannot create directory '/var/jenkins/workspace/deal.II-CUDA11.0/build/tests/hp/hp_line_dof_identities_dgp_monomial_system_01.debug': No space left on device
mv: cannot create directory '/var/jenkins/workspace/deal.II-CUDA11.0/build/tests/hp/hp_quad_dof_identities_dgp_monomial_system_01.debug': No space left on device
mv: cannot create directory '/var/jenkins/workspace/deal.II-CUDA11.0/build/tests/hp/hp_vertex_dof_identities_dgp_monomial_system_02.debug': No space left on device
mv: cannot create directory '/var/jenkins/workspace/deal.II-CUDA11.0/build/tests/hp/interpolate_dgq_01.release': No space left on device
mv: cannot create directory '/var/jenkins/workspace/deal.II-CUDA11.0/build/tests/hp/n_boundary_dofs_02.release': No space left on device
mv: cannot create directory '/var/jenkins/workspace/deal.II-CUDA11.0/build/tests/hp/renumber_block_wise_02.release': No space left on device
mv: cannot create directory '/var/jenkins/workspace/deal.II-CUDA11.0/build/tests/hp/crash_18.debug': No space left on device
mv: cannot create directory '/var/jenkins/workspace/deal.II-CUDA11.0/build/tests/hp/fe_hierarchy_sequence.release': No space left on device
mv: cannot create directory '/var/jenkins/workspace/deal.II-CUDA11.0/build/tests/hp/fe_values_01.release': No space left on device
mv: cannot create directory '/var/jenkins/workspace/deal.II-CUDA11.0/build/tests/hp/hp_line_dof_identities_dgp_monomial_system_01.release': No space left on device
mv: cannot create directory '/var/jenkins/workspace/deal.II-CUDA11.0/build/tests/hp/hp_vertex_dof_identities_dgp_monomial_system_02.release': No space left on device
mv: cannot create directory '/var/jenkins/workspace/deal.II-CUDA11.0/build/tests/hp/interpolate_dgq_02.debug': No space left on device
mv: cannot create directory '/var/jenkins/workspace/deal.II-CUDA11.0/build/tests/hp/n_boundary_dofs_03.debug': No space left on device
mv: cannot create directory '/var/jenkins/workspace/deal.II-CUDA11.0/build/tests/hp/hp_quad_dof_identities_dgp_monomial_system_01.release': No space left on device
mv: cannot create directory '/var/jenkins/workspace/deal.II-CUDA11.0/build/tests/hp/interpolate_dgq_02.release': No space left on device
mv: cannot create directory '/var/jenkins/workspace/deal.II-CUDA11.0/build/tests/hp/boundary_matrices_hp.release': No space left on device
mv: cannot create directory '/var/jenkins/workspace/deal.II-CUDA11.0/build/tests/hp/crash_18.release': No space left on device
mv: cannot create directory '/var/jenkins/workspace/deal.II-CUDA11.0/build/tests/hp/create_mass_matrix_05.debug': No space left on device
mv: cannot create directory '/var/jenkins/workspace/deal.II-CUDA11.0/build/tests/hp/flux_sparsity.debug': No space left on device
mv: cannot create directory '/var/jenkins/workspace/deal.II-CUDA11.0/build/tests/hp/hp_line_dof_identities_dgp_monomial_system_02.debug': No space left on device
mv: cannot create directory '/var/jenkins/workspace/deal.II-CUDA11.0/build/tests/hp/n_boundary_dofs_03.release': No space left on device
mv: cannot create directory '/var/jenkins/workspace/deal.II-CUDA11.0/build/tests/hp/crash_19.debug': No space left on device
mv: cannot create directory '/var/jenkins/workspace/deal.II-CUDA11.0/build/tests/hp/flux_sparsity.release': No space left on device
mv: cannot create directory '/var/jenkins/workspace/deal.II-CUDA11.0/build/tests/hp/hp_line_dof_identities_dgp_monomial_system_02.release': No space left on device
mv: cannot create directory '/var/jenkins/workspace/deal.II-CUDA11.0/build/tests/hp/hp_vertex_dof_identities_dgp_nonparametric.debug': No space left on device
mv: cannot create directory '/var/jenkins/workspace/deal.II-CUDA11.0/build/tests/hp/compare_hp_vs_nonhp_01.debug': No space left on device
mv: cannot create directory '/var/jenkins/workspace/deal.II-CUDA11.0/build/tests/hp/crash_19.release': No space left on device
mv: cannot create directory '/var/jenkins/workspace/deal.II-CUDA11.0/build/tests/hp/flux_sparsity_02.debug': No space left on device
mv: cannot create directory '/var/jenkins/workspace/deal.II-CUDA11.0/build/tests/hp/n_dofs.debug': No space left on device
mv: cannot create directory '/var/jenkins/workspace/deal.II-CUDA11.0/build/tests/hp/solution_transfer_12.debug': No space left on device
mv: cannot create directory '/var/jenkins/workspace/deal.II-CUDA11.0/build/tests/hp/step-7.debug': No space left on device
mv: cannot create directory '/var/jenkins/workspace/deal.II-CUDA11.0/build/tests/hp/create_mass_matrix_05.release': No space left on device
mv: cannot create directory '/var/jenkins/workspace/deal.II-CUDA11.0/build/tests/hp/flux_sparsity_02.release': No space left on device
mv: cannot create directory '/var/jenkins/workspace/deal.II-CUDA11.0/build/tests/hp/hp_line_dof_identities_dgp_nonparametric.debug': No space left on device
mv: cannot create directory '/var/jenkins/workspace/deal.II-CUDA11.0/build/tests/hp/hp_quad_dof_identities_dgp_monomial_system_02.debug': No space left on device
mv: cannot create directory '/var/jenkins/workspace/deal.II-CUDA11.0/build/tests/hp/interpolate_nothing_01.debug': No space left on device
mv: cannot create directory '/var/jenkins/workspace/deal.II-CUDA11.0/build/tests/hp/renumber_component_wise.debug': No space left on device
mv: cannot create directory '/var/jenkins/workspace/deal.II-CUDA11.0/build/tests/hp/compare_hp_vs_nonhp_01.release': No space left on device
mv: cannot create directory '/var/jenkins/workspace/deal.II-CUDA11.0/build/tests/hp/crash_20.debug': No space left on device
mv: cannot create directory '/var/jenkins/workspace/deal.II-CUDA11.0/build/tests/hp/fe_nothing_01.debug': No space left on device
mv: cannot create directory '/var/jenkins/workspace/deal.II-CUDA11.0/build/tests/hp/n_dofs.release': No space left on device
mv: cannot create directory '/var/jenkins/workspace/deal.II-CUDA11.0/build/tests/hp/solution_transfer_12.release': No space left on device
mv: cannot create directory '/var/jenkins/workspace/deal.II-CUDA11.0/build/tests/hp/continuous_1d_01.debug': No space left on device
mv: cannot create directory '/var/jenkins/workspace/deal.II-CUDA11.0/build/tests/hp/future_fe_indices.debug': No space left on device
mv: cannot create directory '/var/jenkins/workspace/deal.II-CUDA11.0/build/tests/hp/hp_line_dof_identities_dgp_nonparametric.release': No space left on device
mv: cannot create directory '/var/jenkins/workspace/deal.II-CUDA11.0/build/tests/hp/p_adaptivity_absolute_threshold.debug': No space left on device
mv: cannot create directory '/var/jenkins/workspace/deal.II-CUDA11.0/build/tests/hp/continuous_1d_01.release': No space left on device
mv: cannot create directory '/var/jenkins/workspace/deal.II-CUDA11.0/build/tests/hp/create_mass_matrix_constraints_02.debug': No space left on device
mv: cannot create directory '/var/jenkins/workspace/deal.II-CUDA11.0/build/tests/hp/hp_quad_dof_identities_dgp_monomial_system_02.release': No space left on device
mv: cannot create directory '/var/jenkins/workspace/deal.II-CUDA11.0/build/tests/hp/hp_vertex_dof_identities_dgp_nonparametric.release': No space left on device
mv: cannot create directory '/var/jenkins/workspace/deal.II-CUDA11.0/build/tests/hp/p_adaptivity_absolute_threshold.release': No space left on device
mv: cannot create directory '/var/jenkins/workspace/deal.II-CUDA11.0/build/tests/hp/step-7.release': No space left on device
mv: cannot create directory '/var/jenkins/workspace/deal.II-CUDA11.0/build/tests/hp/crash_20.release': No space left on device
mv: cannot create directory '/var/jenkins/workspace/deal.II-CUDA11.0/build/tests/hp/create_mass_matrix_constraints_02.release': No space left on device
mv: cannot create directory '/var/jenkins/workspace/deal.II-CUDA11.0/build/tests/hp/hp_quad_dof_identities_dgp_nonparametric.debug': No space left on device
mv: cannot create directory '/var/jenkins/workspace/deal.II-CUDA11.0/build/tests/hp/interpolate_nothing_01.release': No space left on device
mv: cannot create directory '/var/jenkins/workspace/deal.II-CUDA11.0/build/tests/hp/p_adaptivity_fixed_number.debug': No space left on device
mv: cannot create directory '/var/jenkins/workspace/deal.II-CUDA11.0/build/tests/hp/solution_transfer_13.debug': No space left on device
mv: cannot create directory '/var/jenkins/workspace/deal.II-CUDA11.0/build/tests/hp/future_fe_indices.release': No space left on device
mv: cannot create directory '/var/jenkins/workspace/deal.II-CUDA11.0/build/tests/hp/create_mass_matrix_constraints_02b.debug': No space left on device
mv: cannot create directory '/var/jenkins/workspace/deal.II-CUDA11.0/build/tests/hp/hp_quad_dof_identities_dgp_nonparametric.release': No space left on device
mv: cannot create directory '/var/jenkins/workspace/deal.II-CUDA11.0/build/tests/hp/hp_vertex_dof_identities_dgp_nonparametric_system_01.debug': No space left on device
mv: cannot create directory '/var/jenkins/workspace/deal.II-CUDA11.0/build/tests/hp/p_adaptivity_fixed_number.release': No space left on device
mv: cannot create directory '/var/jenkins/workspace/deal.II-CUDA11.0/build/tests/hp/continuous_2d_01.debug': No space left on device
mv: cannot create directory '/var/jenkins/workspace/deal.II-CUDA11.0/build/tests/hp/create_mass_matrix_constraints_02b.release': No space left on device
mv: cannot create directory '/var/jenkins/workspace/deal.II-CUDA11.0/build/tests/hp/fe_nothing_01.release': No space left on device
mv: cannot create directory '/var/jenkins/workspace/deal.II-CUDA11.0/build/tests/hp/hp_line_dof_identities_dgp_nonparametric_system_01.debug': No space left on device
mv: cannot create directory '/var/jenkins/workspace/deal.II-CUDA11.0/build/tests/hp/hp_quad_dof_identities_dgp_nonparametric_system_01.debug': No space left on device
mv: cannot create directory '/var/jenkins/workspace/deal.II-CUDA11.0/build/tests/hp/interpolate_nothing_02.debug': No space left on device
mv: cannot create directory '/var/jenkins/workspace/deal.II-CUDA11.0/build/tests/hp/p_adaptivity_flags.debug': No space left on device
mv: cannot create directory '/var/jenkins/workspace/deal.II-CUDA11.0/build/tests/hp/renumber_component_wise.release': No space left on device
mv: cannot create directory '/var/jenkins/workspace/deal.II-CUDA11.0/build/tests/hp/step-8.debug': No space left on device
mv: cannot create directory '/var/jenkins/workspace/deal.II-CUDA11.0/build/tests/hp/continuous_2d_01.release': No space left on device
mv: cannot create directory '/var/jenkins/workspace/deal.II-CUDA11.0/build/tests/hp/hp_quad_dof_identities_dgp_nonparametric_system_01.release': No space left on device
mv: cannot create directory '/var/jenkins/workspace/deal.II-CUDA11.0/build/tests/hp/hp_vertex_dof_identities_dgp_nonparametric_system_01.release': No space left on device
mv: cannot create directory '/var/jenkins/workspace/deal.II-CUDA11.0/build/tests/hp/interpolate_nothing_02.release': No space left on device
mv: cannot create directory '/var/jenkins/workspace/deal.II-CUDA11.0/build/tests/hp/solution_transfer_13.release': No space left on device
mv: cannot create directory '/var/jenkins/workspace/deal.II-CUDA11.0/build/tests/hp/get_active_fe_indices.debug': No space left on device
mv: cannot create directory '/var/jenkins/workspace/deal.II-CUDA11.0/build/tests/hp/hp_vertex_dof_identities_dgp_nonparametric_system_02.debug': No space left on device
mv: cannot create directory '/var/jenkins/workspace/deal.II-CUDA11.0/build/tests/hp/p_adaptivity_flags.release': No space left on device
mv: cannot create directory '/var/jenkins/workspace/deal.II-CUDA11.0/build/tests/hp/continuous_3d_01.debug': No space left on device
mv: cannot create directory '/var/jenkins/workspace/deal.II-CUDA11.0/build/tests/hp/create_rhs_01.debug': No space left on device
mv: cannot create directory '/var/jenkins/workspace/deal.II-CUDA11.0/build/tests/hp/hp_quad_dof_identities_dgp_nonparametric_system_02.debug': No space left on device
mv: cannot create directory '/var/jenkins/workspace/deal.II-CUDA11.0/build/tests/hp/hp_vertex_dof_identities_dgp_nonparametric_system_02.release': No space left on device
mv: cannot create directory '/var/jenkins/workspace/deal.II-CUDA11.0/build/tests/hp/interpolate_nothing_03.debug': No space left on device
mv: cannot create directory '/var/jenkins/workspace/deal.II-CUDA11.0/build/tests/hp/step-8.release': No space left on device
mv: cannot create directory '/var/jenkins/workspace/deal.II-CUDA11.0/build/tests/hp/crash_21.debug': No space left on device
mv: cannot create directory '/var/jenkins/workspace/deal.II-CUDA11.0/build/tests/hp/fe_nothing_02.debug': No space left on device
mv: cannot create directory '/var/jenkins/workspace/deal.II-CUDA11.0/build/tests/hp/hp_line_dof_identities_dgp_nonparametric_system_01.release': No space left on device
mv: cannot create directory '/var/jenkins/workspace/deal.II-CUDA11.0/build/tests/hp/hp_vertex_dof_identities_dgp_system_01.debug': No space left on device
mv: cannot create directory '/var/jenkins/workspace/deal.II-CUDA11.0/build/tests/hp/p_adaptivity_full.debug': No space left on device
mv: cannot create directory '/var/jenkins/workspace/deal.II-CUDA11.0/build/tests/hp/set_dof_values_by_interpolation_01.debug': No space left on device
mv: cannot create directory '/var/jenkins/workspace/deal.II-CUDA11.0/build/tests/hp/create_rhs_01.release': No space left on device
mv: cannot create directory '/var/jenkins/workspace/deal.II-CUDA11.0/build/tests/hp/fe_nothing_02.release': No space left on device
mv: cannot create directory '/var/jenkins/workspace/deal.II-CUDA11.0/build/tests/hp/hp_vertex_dof_identities_dgp_system_01.release': No space left on device
mv: cannot create directory '/var/jenkins/workspace/deal.II-CUDA11.0/build/tests/hp/interpolate_nothing_03.release': No space left on device
mv: cannot create directory '/var/jenkins/workspace/deal.II-CUDA11.0/build/tests/hp/solution_transfer_16.debug': No space left on device
mv: cannot create directory '/var/jenkins/workspace/deal.II-CUDA11.0/build/tests/hp/crash_21.release': No space left on device
mv: cannot create directory '/var/jenkins/workspace/deal.II-CUDA11.0/build/tests/hp/distribute_dofs_linear_time.debug': No space left on device
mv: cannot create directory '/var/jenkins/workspace/deal.II-CUDA11.0/build/tests/hp/fe_nothing_03.debug': No space left on device
mv: cannot create directory '/var/jenkins/workspace/deal.II-CUDA11.0/build/tests/hp/hp_quad_dof_identities_dgp_nonparametric_system_02.release': No space left on device
mv: cannot create directory '/var/jenkins/workspace/deal.II-CUDA11.0/build/tests/hp/p_adaptivity_full.release': No space left on device
mv: cannot create directory '/var/jenkins/workspace/deal.II-CUDA11.0/build/tests/hp/vectors_boundary_rhs_01.debug': No space left on device
mv: cannot create directory '/var/jenkins/workspace/deal.II-CUDA11.0/build/tests/hp/continuous_3d_01.release': No space left on device
mv: cannot create directory '/var/jenkins/workspace/deal.II-CUDA11.0/build/tests/hp/distribute_dofs_linear_time.release': No space left on device
mv: cannot create directory '/var/jenkins/workspace/deal.II-CUDA11.0/build/tests/hp/get_active_fe_indices.release': No space left on device
mv: cannot create directory '/var/jenkins/workspace/deal.II-CUDA11.0/build/tests/hp/solution_transfer_16.release': No space left on device
mv: cannot create directory '/var/jenkins/workspace/deal.II-CUDA11.0/build/tests/hp/interpolate_q_01.debug': No space left on device
mv: cannot create directory '/var/jenkins/workspace/deal.II-CUDA11.0/build/tests/hp/crash_22.debug': No space left on device
mv: cannot create directory '/var/jenkins/workspace/deal.II-CUDA11.0/build/tests/hp/hp_quad_dof_identities_dgp_system_01.debug': No space left on device
mv: cannot create directory '/var/jenkins/workspace/deal.II-CUDA11.0/build/tests/hp/p_adaptivity_reference.debug': No space left on device
mv: cannot create directory '/var/jenkins/workspace/deal.II-CUDA11.0/build/tests/hp/vectors_boundary_rhs_01.release': No space left on device
mv: cannot create directory '/var/jenkins/workspace/deal.II-CUDA11.0/build/tests/hp/hp_line_dof_identities_dgp_nonparametric_system_02.debug': No space left on device
mv: cannot create directory '/var/jenkins/workspace/deal.II-CUDA11.0/build/tests/hp/set_dof_values_by_interpolation_02.debug': No space left on device
mv: cannot create directory '/var/jenkins/workspace/deal.II-CUDA11.0/build/tests/hp/do_function_derivatives_01.debug': No space left on device
mv: cannot create directory '/var/jenkins/workspace/deal.II-CUDA11.0/build/tests/hp/fe_nothing_03.release': No space left on device
mv: cannot create directory '/var/jenkins/workspace/deal.II-CUDA11.0/build/tests/hp/crash_22.release': No space left on device
mv: cannot create directory '/var/jenkins/workspace/deal.II-CUDA11.0/build/tests/hp/do_function_derivatives_01.release': No space left on device
mv: cannot create directory '/var/jenkins/workspace/deal.II-CUDA11.0/build/tests/hp/hp_quad_dof_identities_dgp_system_01.release': No space left on device
mv: cannot create directory '/var/jenkins/workspace/deal.II-CUDA11.0/build/tests/hp/hp_vertex_dof_identities_dgp_system_02.debug': No space left on device
mv: cannot create directory '/var/jenkins/workspace/deal.II-CUDA11.0/build/tests/hp/interpolate_q_01.release': No space left on device
mv: cannot create directory '/var/jenkins/workspace/deal.II-CUDA11.0/build/tests/hp/copy_tria_bug.debug': No space left on device
mv: cannot create directory '/var/jenkins/workspace/deal.II-CUDA11.0/build/tests/hp/do_function_hessians_01.debug': No space left on device
mv: cannot create directory '/var/jenkins/workspace/deal.II-CUDA11.0/build/tests/hp/fe_nothing_05.debug': No space left on device
mv: cannot create directory '/var/jenkins/workspace/deal.II-CUDA11.0/build/tests/hp/hp_quad_dof_identities_dgp_system_02.debug': No space left on device
mv: cannot create directory '/var/jenkins/workspace/deal.II-CUDA11.0/build/tests/hp/hp_vertex_dof_identities_dgp_system_02.release': No space left on device
mv: cannot create directory '/var/jenkins/workspace/deal.II-CUDA11.0/build/tests/hp/interpolate_q_02.debug': No space left on device
mv: cannot create directory '/var/jenkins/workspace/deal.II-CUDA11.0/build/tests/hp/step-10.debug': No space left on device
mv: cannot create directory '/var/jenkins/workspace/deal.II-CUDA11.0/build/tests/hp/vectors_boundary_rhs_02.debug': No space left on device
mv: cannot create directory '/var/jenkins/workspace/deal.II-CUDA11.0/build/tests/hp/do_function_hessians_01.release': No space left on device
mv: cannot create directory '/var/jenkins/workspace/deal.II-CUDA11.0/build/tests/hp/fe_nothing_05.release': No space left on device
mv: cannot create directory '/var/jenkins/workspace/deal.II-CUDA11.0/build/tests/hp/get_interpolated_dof_values_01.debug': No space left on device
mv: cannot create directory '/var/jenkins/workspace/deal.II-CUDA11.0/build/tests/hp/hp_line_dof_identities_dgp_nonparametric_system_02.release': No space left on device
mv: cannot create directory '/var/jenkins/workspace/deal.II-CUDA11.0/build/tests/hp/hp_vertex_dof_identities_dgq.debug': No space left on device
mv: cannot create directory '/var/jenkins/workspace/deal.II-CUDA11.0/build/tests/hp/p_adaptivity_reference.release': No space left on device
mv: cannot create directory '/var/jenkins/workspace/deal.II-CUDA11.0/build/tests/hp/interpolate_q_02.release': No space left on device
mv: cannot create directory '/var/jenkins/workspace/deal.II-CUDA11.0/build/tests/hp/set_dof_values_by_interpolation_02.release': No space left on device
mv: cannot create directory '/var/jenkins/workspace/deal.II-CUDA11.0/build/tests/hp/create_laplace_matrix_01.debug': No space left on device
mv: cannot create directory '/var/jenkins/workspace/deal.II-CUDA11.0/build/tests/hp/fe_nothing_06.debug': No space left on device
mv: cannot create directory '/var/jenkins/workspace/deal.II-CUDA11.0/build/tests/hp/hp_line_dof_identities_dgp_system_01.debug': No space left on device
mv: cannot create directory '/var/jenkins/workspace/deal.II-CUDA11.0/build/tests/hp/interpolate_q_system_01.debug': No space left on device
mv: cannot create directory '/var/jenkins/workspace/deal.II-CUDA11.0/build/tests/hp/vectors_boundary_rhs_02.release': No space left on device
mv: cannot create directory '/var/jenkins/workspace/deal.II-CUDA11.0/build/tests/hp/copy_tria_bug.release': No space left on device
mv: cannot create directory '/var/jenkins/workspace/deal.II-CUDA11.0/build/tests/hp/create_laplace_matrix_01.release': No space left on device
mv: cannot create directory '/var/jenkins/workspace/deal.II-CUDA11.0/build/tests/hp/do_function_laplacians_01.debug': No space left on device
mv: cannot create directory '/var/jenkins/workspace/deal.II-CUDA11.0/build/tests/hp/fe_nothing_06.release': No space left on device
mv: cannot create directory '/var/jenkins/workspace/deal.II-CUDA11.0/build/tests/hp/get_interpolated_dof_values_02.debug': No space left on device
mv: cannot create directory '/var/jenkins/workspace/deal.II-CUDA11.0/build/tests/hp/hp_quad_dof_identities_dgp_system_02.release': No space left on device
mv: cannot create directory '/var/jenkins/workspace/deal.II-CUDA11.0/build/tests/hp/hp_vertex_dof_identities_dgq.release': No space left on device
mv: cannot create directory '/var/jenkins/workspace/deal.II-CUDA11.0/build/tests/hp/step-10.release': No space left on device
mv: cannot create directory '/var/jenkins/workspace/deal.II-CUDA11.0/build/tests/hp/create_laplace_matrix_01b.debug': No space left on device
mv: cannot create directory '/var/jenkins/workspace/deal.II-CUDA11.0/build/tests/hp/fe_nothing_07.debug': No space left on device
mv: cannot create directory '/var/jenkins/workspace/deal.II-CUDA11.0/build/tests/hp/get_interpolated_dof_values_02.release': No space left on device
mv: cannot create directory '/var/jenkins/workspace/deal.II-CUDA11.0/build/tests/hp/hp_line_dof_identities_dgp_system_01.release': No space left on device
mv: cannot create directory '/var/jenkins/workspace/deal.II-CUDA11.0/build/tests/hp/hp_quad_dof_identities_dgq.debug': No space left on device
mv: cannot create directory '/var/jenkins/workspace/deal.II-CUDA11.0/build/tests/hp/interpolate_q_system_01.release': No space left on device
mv: cannot create directory '/var/jenkins/workspace/deal.II-CUDA11.0/build/tests/hp/set_dof_values_by_interpolation_03.debug': No space left on device
mv: cannot create directory '/var/jenkins/workspace/deal.II-CUDA11.0/build/tests/hp/get_interpolated_dof_values_03.debug': No space left on device
mv: cannot create directory '/var/jenkins/workspace/deal.II-CUDA11.0/build/tests/hp/fe_nothing_07.release': No space left on device
mv: cannot create directory '/var/jenkins/workspace/deal.II-CUDA11.0/build/tests/hp/p_adaptivity_regularity.debug': No space left on device
mv: cannot create directory '/var/jenkins/workspace/deal.II-CUDA11.0/build/tests/hp/do_function_laplacians_01.release': No space left on device
mv: cannot create directory '/var/jenkins/workspace/deal.II-CUDA11.0/build/tests/hp/get_interpolated_dof_values_03.release': No space left on device
mv: cannot create directory '/var/jenkins/workspace/deal.II-CUDA11.0/build/tests/hp/hp_quad_dof_identities_dgq.release': No space left on device
mv: cannot create directory '/var/jenkins/workspace/deal.II-CUDA11.0/build/tests/hp/hp_vertex_dof_identities_dgq_system_01.debug': No space left on device
mv: cannot create directory '/var/jenkins/workspace/deal.II-CUDA11.0/build/tests/hp/interpolate_q_system_02.debug': No space left on device
mv: cannot create directory '/var/jenkins/workspace/deal.II-CUDA11.0/build/tests/hp/set_dof_values_by_interpolation_03.release': No space left on device
mv: cannot create directory '/var/jenkins/workspace/deal.II-CUDA11.0/build/tests/hp/create_laplace_matrix_01b.release': No space left on device
mv: cannot create directory '/var/jenkins/workspace/deal.II-CUDA11.0/build/tests/hp/fe_nothing_08.debug': No space left on device
mv: cannot create directory '/var/jenkins/workspace/deal.II-CUDA11.0/build/tests/hp/hp_line_dof_identities_dgp_system_02.debug': No space left on device
mv: cannot create directory '/var/jenkins/workspace/deal.II-CUDA11.0/build/tests/hp/p_adaptivity_regularity.release': No space left on device
mv: cannot create directory '/var/jenkins/workspace/deal.II-CUDA11.0/build/tests/hp/count_dofs_per_block_01.debug': No space left on device
mv: cannot create directory '/var/jenkins/workspace/deal.II-CUDA11.0/build/tests/hp/hp_coarsening.debug': No space left on device
mv: cannot create directory '/var/jenkins/workspace/deal.II-CUDA11.0/build/tests/hp/hp_quad_dof_identities_dgq_system_01.debug': No space left on device
mv: cannot create directory '/var/jenkins/workspace/deal.II-CUDA11.0/build/tests/hp/solution_transfer.debug': No space left on device
mv: cannot create directory '/var/jenkins/workspace/deal.II-CUDA11.0/build/tests/hp/step-11.debug': No space left on device
mv: cannot create directory '/var/jenkins/workspace/deal.II-CUDA11.0/build/tests/hp/vectors_boundary_rhs_03.debug': No space left on device
mv: cannot create directory '/var/jenkins/workspace/deal.II-CUDA11.0/build/tests/hp/interpolate_q_system_02.release': No space left on device
mv: cannot create directory '/var/jenkins/workspace/deal.II-CUDA11.0/build/tests/hp/create_laplace_matrix_02.debug': No space left on device
mv: cannot create directory '/var/jenkins/workspace/deal.II-CUDA11.0/build/tests/hp/dof_handler_number_cache.debug': No space left on device
mv: cannot create directory '/var/jenkins/workspace/deal.II-CUDA11.0/build/tests/hp/fe_nothing_08.release': No space left on device
mv: cannot create directory '/var/jenkins/workspace/deal.II-CUDA11.0/build/tests/hp/hp_line_dof_identities_dgp_system_02.release': No space left on device
mv: cannot create directory '/var/jenkins/workspace/deal.II-CUDA11.0/build/tests/hp/hp_quad_dof_identities_dgq_system_01.release': No space left on device
mv: cannot create directory '/var/jenkins/workspace/deal.II-CUDA11.0/build/tests/hp/solution_transfer.release': No space left on device
mv: cannot create directory '/var/jenkins/workspace/deal.II-CUDA11.0/build/tests/hp/create_laplace_matrix_02.release': No space left on device
mv: cannot create directory '/var/jenkins/workspace/deal.II-CUDA11.0/build/tests/hp/fe_nothing_09.debug': No space left on device
mv: cannot create directory '/var/jenkins/workspace/deal.II-CUDA11.0/build/tests/hp/hp_coarsening.release': No space left on device
mv: cannot create directory '/var/jenkins/workspace/deal.II-CUDA11.0/build/tests/hp/hp_quad_dof_identities_dgq_system_02.debug': No space left on device
mv: cannot create directory '/var/jenkins/workspace/deal.II-CUDA11.0/build/tests/hp/hp_vertex_dof_identities_dgq_system_01.release': No space left on device
mv: cannot create directory '/var/jenkins/workspace/deal.II-CUDA11.0/build/tests/hp/laplace_mitchell2014_04_peak.debug': No space left on device
mv: cannot create directory '/var/jenkins/workspace/deal.II-CUDA11.0/build/tests/hp/count_dofs_per_block_01.release': No space left on device
mv: cannot create directory '/var/jenkins/workspace/deal.II-CUDA11.0/build/tests/hp/hp_constraints_b.debug': No space left on device
mv: cannot create directory '/var/jenkins/workspace/deal.II-CUDA11.0/build/tests/hp/solution_transfer_02.debug': No space left on device
mv: cannot create directory '/var/jenkins/workspace/deal.II-CUDA11.0/build/tests/hp/step-11.release': No space left on device
mv: cannot create directory '/var/jenkins/workspace/deal.II-CUDA11.0/build/tests/hp/laplace_mitchell2014_04_peak.release': No space left on device
mv: cannot create directory '/var/jenkins/workspace/deal.II-CUDA11.0/build/tests/hp/p_adaptivity_relative_threshold.debug': No space left on device
mv: cannot create directory '/var/jenkins/workspace/deal.II-CUDA11.0/build/tests/hp/vectors_boundary_rhs_03.release': No space left on device
mv: cannot create directory '/var/jenkins/workspace/deal.II-CUDA11.0/build/tests/hp/count_dofs_per_block_02.debug': No space left on device
mv: cannot create directory '/var/jenkins/workspace/deal.II-CUDA11.0/build/tests/hp/dof_handler_number_cache.release': No space left on device
mv: cannot create directory '/var/jenkins/workspace/deal.II-CUDA11.0/build/tests/hp/fe_nothing_09.release': No space left on device
mv: cannot create directory '/var/jenkins/workspace/deal.II-CUDA11.0/build/tests/hp/hp_constraints_b.release': No space left on device
mv: cannot create directory '/var/jenkins/workspace/deal.II-CUDA11.0/build/tests/hp/hp_line_dof_identities_dgq.debug': No space left on device
mv: cannot create directory '/var/jenkins/workspace/deal.II-CUDA11.0/build/tests/hp/hp_quad_dof_identities_dgq_system_02.release': No space left on device
mv: cannot create directory '/var/jenkins/workspace/deal.II-CUDA11.0/build/tests/hp/solution_transfer_02.release': No space left on device
mv: cannot create directory '/var/jenkins/workspace/deal.II-CUDA11.0/build/tests/hp/count_dofs_per_block_02.release': No space left on device
mv: cannot create directory '/var/jenkins/workspace/deal.II-CUDA11.0/build/tests/hp/create_laplace_matrix_02b.debug': No space left on device
mv: cannot create directory '/var/jenkins/workspace/deal.II-CUDA11.0/build/tests/hp/hp_constraints_dgp.debug': No space left on device
mv: cannot create directory '/var/jenkins/workspace/deal.II-CUDA11.0/build/tests/hp/hp_quad_dof_identities_faceq.debug': No space left on device
mv: cannot create directory '/var/jenkins/workspace/deal.II-CUDA11.0/build/tests/hp/hp_vertex_dof_identities_dgq_system_02.debug': No space left on device
mv: cannot create directory '/var/jenkins/workspace/deal.II-CUDA11.0/build/tests/hp/limit_p_level_difference_01.debug': No space left on device
mv: cannot create directory '/var/jenkins/workspace/deal.II-CUDA11.0/build/tests/hp/step-12.debug': No space left on device
mv: cannot create directory '/var/jenkins/workspace/deal.II-CUDA11.0/build/tests/hp/crash_01.debug': No space left on device
mv: cannot create directory '/var/jenkins/workspace/deal.II-CUDA11.0/build/tests/hp/fe_nothing_10.debug': No space left on device
mv: cannot create directory '/var/jenkins/workspace/deal.II-CUDA11.0/build/tests/hp/hp_constraints_dgp.release': No space left on device
mv: cannot create directory '/var/jenkins/workspace/deal.II-CUDA11.0/build/tests/hp/hp_line_dof_identities_dgq.release': No space left on device
mv: cannot create directory '/var/jenkins/workspace/deal.II-CUDA11.0/build/tests/hp/p_adaptivity_relative_threshold.release': No space left on device
mv: cannot create directory '/var/jenkins/workspace/deal.II-CUDA11.0/build/tests/hp/vectors_boundary_rhs_hp_01.debug': No space left on device
mv: cannot create directory '/var/jenkins/workspace/deal.II-CUDA11.0/build/tests/hp/fe_nothing_10.release': No space left on device
mv: cannot create directory '/var/jenkins/workspace/deal.II-CUDA11.0/build/tests/hp/hp_constraints_dgp_monomial.debug': No space left on device
mv: cannot create directory '/var/jenkins/workspace/deal.II-CUDA11.0/build/tests/hp/hp_line_dof_identities_dgq_system_01.debug': No space left on device
mv: cannot create directory '/var/jenkins/workspace/deal.II-CUDA11.0/build/tests/hp/hp_quad_dof_identities_faceq.release': No space left on device
mv: cannot create directory '/var/jenkins/workspace/deal.II-CUDA11.0/build/tests/hp/hp_vertex_dof_identities_dgq_system_02.release': No space left on device
mv: cannot create directory '/var/jenkins/workspace/deal.II-CUDA11.0/build/tests/hp/solution_transfer_03.debug': No space left on device
mv: cannot create directory '/var/jenkins/workspace/deal.II-CUDA11.0/build/tests/hp/step-12.release': No space left on device
mv: cannot create directory '/var/jenkins/workspace/deal.II-CUDA11.0/build/tests/hp/create_laplace_matrix_02b.release': No space left on device
mv: cannot create directory '/var/jenkins/workspace/deal.II-CUDA11.0/build/tests/hp/dof_renumbering_04.debug': No space left on device
mv: cannot create directory '/var/jenkins/workspace/deal.II-CUDA11.0/build/tests/hp/hp_constraints_dgp_monomial.release': No space left on device
mv: cannot create directory '/var/jenkins/workspace/deal.II-CUDA11.0/build/tests/hp/hp_line_dof_identities_dgq_system_01.release': No space left on device
mv: cannot create directory '/var/jenkins/workspace/deal.II-CUDA11.0/build/tests/hp/limit_p_level_difference_01.release': No space left on device
mv: cannot create directory '/var/jenkins/workspace/deal.II-CUDA11.0/build/tests/hp/p_refinement_and_coarsening.debug': No space left on device
mv: cannot create directory '/var/jenkins/workspace/deal.II-CUDA11.0/build/tests/hp/vectors_boundary_rhs_hp_01.release': No space left on device
mv: cannot create directory '/var/jenkins/workspace/deal.II-CUDA11.0/build/tests/hp/crash_01.release': No space left on device
mv: cannot create directory '/var/jenkins/workspace/deal.II-CUDA11.0/build/tests/hp/hp_line_dof_identities_dgq_system_02.debug': No space left on device
mv: cannot create directory '/var/jenkins/workspace/deal.II-CUDA11.0/build/tests/hp/hp_quad_dof_identities_mixed_multiway.debug': No space left on device
mv: cannot create directory '/var/jenkins/workspace/deal.II-CUDA11.0/build/tests/hp/step-13.debug': No space left on device
mv: cannot create regular file '/var/jenkins/workspace/deal.II-CUDA11.0/build/tests/hp/CMakeCache.txt': No space left on device
mv: cannot create regular file '/var/jenkins/workspace/deal.II-CUDA11.0/build/tests/hp/Makefile': No space left on device
mv: cannot create regular file '/var/jenkins/workspace/deal.II-CUDA11.0/build/tests/hp/cmake_install.cmake': No space left on device
mv: cannot create regular file '/var/jenkins/workspace/deal.II-CUDA11.0/build/tests/hp/CTestTestfile.cmake': No space left on device
mv: cannot create directory '/var/jenkins/workspace/deal.II-CUDA11.0/build/tests/hp/create_laplace_matrix_03.debug': No space left on device
mv: cannot create directory '/var/jenkins/workspace/deal.II-CUDA11.0/build/tests/hp/hp_constraints_dgp_nonparametric.debug': No space left on device
mv: cannot create directory '/var/jenkins/workspace/deal.II-CUDA11.0/build/tests/hp/hp_line_dof_identities_dgq_system_02.release': No space left on device
mv: cannot create directory '/var/jenkins/workspace/deal.II-CUDA11.0/build/tests/hp/limit_p_level_difference_02.debug': No space left on device
mv: cannot create directory '/var/jenkins/workspace/deal.II-CUDA11.0/build/tests/hp/p_refinement_and_coarsening.release': No space left on device
mv: cannot create directory '/var/jenkins/workspace/deal.II-CUDA11.0/build/tests/hp/solution_transfer_03.release': No space left on device
mv: cannot create directory '/var/jenkins/workspace/deal.II-CUDA11.0/build/tests/hp/hp_vertex_dof_identities_faceq.debug': No space left on device
mv: cannot create directory '/var/jenkins/workspace/deal.II-CUDA11.0/build/tests/hp/crash_02.debug': No space left on device
mv: cannot create directory '/var/jenkins/workspace/deal.II-CUDA11.0/build/tests/hp/dof_renumbering_04.release': No space left on device
mv: cannot create directory '/var/jenkins/workspace/deal.II-CUDA11.0/build/tests/hp/hp_line_dof_identities_faceq.debug': No space left on device
mv: cannot create directory '/var/jenkins/workspace/deal.II-CUDA11.0/build/tests/hp/hp_quad_dof_identities_mixed_multiway.release': No space left on device
mv: cannot create directory '/var/jenkins/workspace/deal.II-CUDA11.0/build/tests/hp/limit_p_level_difference_02.release': No space left on device
mv: cannot create directory '/var/jenkins/workspace/deal.II-CUDA11.0/build/tests/hp/step-13.release': No space left on device
mv: cannot create directory '/var/jenkins/workspace/deal.II-CUDA11.0/build/tests/hp/crash_02.release': No space left on device
mv: cannot create directory '/var/jenkins/workspace/deal.II-CUDA11.0/build/tests/hp/fe_nothing_11.debug': No space left on device
mv: cannot create directory '/var/jenkins/workspace/deal.II-CUDA11.0/build/tests/hp/hp_constraints_dgp_nonparametric.release': No space left on device
mv: cannot create directory '/var/jenkins/workspace/deal.II-CUDA11.0/build/tests/hp/project_01.debug': No space left on device
mv: cannot create directory '/var/jenkins/workspace/deal.II-CUDA11.0/build/tests/hp/solution_transfer_04.debug': No space left on device
mv: cannot create directory '/var/jenkins/workspace/deal.II-CUDA11.0/build/tests/hp/vectors_boundary_rhs_hp_03.debug': No space left on device
mv: setting attribute 'security.selinux' for 'security.selinux': No space left on device
mv: cannot create directory '/var/jenkins/workspace/deal.II-CUDA11.0/build/tests/integrators': No space left on device
mv: cannot create directory '/var/jenkins/workspace/deal.II-CUDA11.0/build/tests/lac': No space left on device
mv: cannot create directory '/var/jenkins/workspace/deal.II-CUDA11.0/build/tests/lapack': No space left on device
mv: setting attribute 'security.selinux' for 'security.selinux': No space left on device
mv: cannot create directory '/var/jenkins/workspace/deal.II-CUDA11.0/build/doc': No space left on device
mv: cannot create directory '/var/jenkins/workspace/deal.II-CUDA11.0/build/bundled': No space left on device
mv: cannot create regular file '/var/jenkins/workspace/deal.II-CUDA11.0/build/revision.log': No space left on device
mv: cannot create regular file '/var/jenkins/workspace/deal.II-CUDA11.0/build/detailed.log': No space left on device
mv: cannot create regular file '/var/jenkins/workspace/deal.II-CUDA11.0/build/summary.log': No space left on device
mv: cannot create regular file '/var/jenkins/workspace/deal.II-CUDA11.0/build/CTestTestfile.cmake': No space left on device
mv: cannot create regular file '/var/jenkins/workspace/deal.II-CUDA11.0/build/Makefile': No space left on device
mv: cannot create regular file '/var/jenkins/workspace/deal.II-CUDA11.0/build/cmake_install.cmake': No space left on device
mv: cannot create regular file '/var/jenkins/workspace/deal.II-CUDA11.0/build/CMakeCache.txt': No space left on device
mv: cannot create directory '/var/jenkins/workspace/deal.II-CUDA11.0/build/CMakeFiles': No space left on device
mv: setting attribute 'security.selinux' for 'security.selinux': No space left on device
+ docker rm -f cuda11_deal_ci
cuda11_deal_ci
Build step 'Execute shell' marked build as failure
INFO: Processing CTest-Version 3.x (default)
INFO: [CTest-Version 3.x (default)] - 1 test report file(s) were found with the pattern 'build/Testing/**/Test.xml' relative to '/var/jenkins/workspace/deal.II-CUDA11.0' for the testing framework 'CTest-Version 3.x (default)'.
INFO: Check 'Failed Tests' threshold.
INFO: The total number of tests for the threshold 'Failed Tests' exceeds the specified "failure threshold" value.
INFO: Setting the build status to FAILURE
Finished: FAILURE