Console Output

Skipping 2,182 KB.. Full Log
            Start  7840: mpi/collective_max.mpirun=10.debug
11024/11561 Test  #7835: mpi/collective_logical_or_vector_in_place.mpirun=10.release ............................   Passed    3.25 sec
            Start  7841: mpi/collective_max.mpirun=10.release
11025/11561 Test  #7796: mpi/collective_02_vector_in_place.mpirun=4.debug .......................................   Passed    3.16 sec
            Start  7797: mpi/collective_02_vector_in_place.mpirun=4.release
11026/11561 Test  #7840: mpi/collective_max.mpirun=10.debug .....................................................   Passed    3.58 sec
            Start  7846: mpi/collective_max_array.mpirun=10.debug
11027/11561 Test  #7841: mpi/collective_max.mpirun=10.release ...................................................   Passed    3.13 sec
            Start  7847: mpi/collective_max_array.mpirun=10.release
11028/11561 Test  #7797: mpi/collective_02_vector_in_place.mpirun=4.release .....................................   Passed    3.04 sec
            Start  7802: mpi/collective_full_matrix.mpirun=3.debug
            Start  7803: mpi/collective_full_matrix.mpirun=3.release
11029/11561 Test  #7847: mpi/collective_max_array.mpirun=10.release .............................................   Passed    3.28 sec
            Start  7852: mpi/collective_max_array_in_place.mpirun=10.debug
11030/11561 Test  #7846: mpi/collective_max_array.mpirun=10.debug ...............................................   Passed    3.38 sec
            Start  7853: mpi/collective_max_array_in_place.mpirun=10.release
11031/11561 Test  #7803: mpi/collective_full_matrix.mpirun=3.release ............................................   Passed    3.18 sec
11032/11561 Test  #7802: mpi/collective_full_matrix.mpirun=3.debug ..............................................   Passed    3.25 sec
            Start  7812: mpi/collective_logical_or.mpirun=4.debug
11033/11561 Test  #7853: mpi/collective_max_array_in_place.mpirun=10.release ....................................   Passed    3.20 sec
            Start  7858: mpi/collective_max_vector.mpirun=10.debug
11034/11561 Test  #7852: mpi/collective_max_array_in_place.mpirun=10.debug ......................................   Passed    3.44 sec
            Start  7859: mpi/collective_max_vector.mpirun=10.release
11035/11561 Test  #7812: mpi/collective_logical_or.mpirun=4.debug ...............................................   Passed    3.22 sec
            Start  7813: mpi/collective_logical_or.mpirun=4.release
11036/11561 Test  #7858: mpi/collective_max_vector.mpirun=10.debug ..............................................   Passed    3.26 sec
            Start  7864: mpi/collective_max_vector_in_place.mpirun=10.debug
11037/11561 Test  #7859: mpi/collective_max_vector.mpirun=10.release ............................................   Passed    3.22 sec
            Start  7865: mpi/collective_max_vector_in_place.mpirun=10.release
11038/11561 Test  #7813: mpi/collective_logical_or.mpirun=4.release .............................................   Passed    3.10 sec
            Start  7818: mpi/collective_logical_or_array.mpirun=4.debug
11039/11561 Test  #7865: mpi/collective_max_vector_in_place.mpirun=10.release ...................................   Passed    3.19 sec
            Start  7872: mpi/collective_min.mpirun=10.debug
11040/11561 Test  #7864: mpi/collective_max_vector_in_place.mpirun=10.debug .....................................   Passed    3.36 sec
            Start  7873: mpi/collective_min.mpirun=10.release
11041/11561 Test  #7818: mpi/collective_logical_or_array.mpirun=4.debug .........................................   Passed    3.11 sec
            Start  7819: mpi/collective_logical_or_array.mpirun=4.release
11042/11561 Test  #7873: mpi/collective_min.mpirun=10.release ...................................................   Passed    3.09 sec
            Start  7878: mpi/collective_min_array.mpirun=10.debug
11043/11561 Test  #7872: mpi/collective_min.mpirun=10.debug .....................................................   Passed    3.17 sec
            Start  7879: mpi/collective_min_array.mpirun=10.release
11044/11561 Test  #7819: mpi/collective_logical_or_array.mpirun=4.release .......................................   Passed    3.05 sec
            Start  7824: mpi/collective_logical_or_array_in_place.mpirun=4.debug
11045/11561 Test  #7878: mpi/collective_min_array.mpirun=10.debug ...............................................   Passed    3.33 sec
            Start  7884: mpi/collective_min_array_in_place.mpirun=10.debug
11046/11561 Test  #7879: mpi/collective_min_array.mpirun=10.release .............................................   Passed    3.34 sec
            Start  7885: mpi/collective_min_array_in_place.mpirun=10.release
11047/11561 Test  #7824: mpi/collective_logical_or_array_in_place.mpirun=4.debug ................................   Passed    3.13 sec
            Start  7825: mpi/collective_logical_or_array_in_place.mpirun=4.release
11048/11561 Test  #7884: mpi/collective_min_array_in_place.mpirun=10.debug ......................................   Passed    3.28 sec
            Start  7890: mpi/collective_min_vector.mpirun=10.debug
11049/11561 Test  #7825: mpi/collective_logical_or_array_in_place.mpirun=4.release ..............................   Passed    3.08 sec
            Start  7830: mpi/collective_logical_or_vector.mpirun=4.debug
11050/11561 Test  #7885: mpi/collective_min_array_in_place.mpirun=10.release ....................................   Passed    3.30 sec
            Start  7891: mpi/collective_min_vector.mpirun=10.release
11051/11561 Test  #7890: mpi/collective_min_vector.mpirun=10.debug ..............................................   Passed    3.40 sec
            Start  7896: mpi/collective_min_vector_in_place.mpirun=10.debug
11052/11561 Test  #7830: mpi/collective_logical_or_vector.mpirun=4.debug ........................................   Passed    3.37 sec
            Start  7831: mpi/collective_logical_or_vector.mpirun=4.release
11053/11561 Test  #7891: mpi/collective_min_vector.mpirun=10.release ............................................   Passed    3.40 sec
            Start  7897: mpi/collective_min_vector_in_place.mpirun=10.release
11054/11561 Test  #7831: mpi/collective_logical_or_vector.mpirun=4.release ......................................   Passed    3.26 sec
            Start  7836: mpi/collective_logical_or_vector_in_place.mpirun=4.debug
11055/11561 Test  #7897: mpi/collective_min_vector_in_place.mpirun=10.release ...................................   Passed    3.45 sec
            Start  7906: mpi/collective_tensor.mpirun=10.debug
11056/11561 Test  #7896: mpi/collective_min_vector_in_place.mpirun=10.debug .....................................   Passed    3.55 sec
            Start  7907: mpi/collective_tensor.mpirun=10.release
11057/11561 Test  #7836: mpi/collective_logical_or_vector_in_place.mpirun=4.debug ...............................   Passed    3.21 sec
            Start  7837: mpi/collective_logical_or_vector_in_place.mpirun=4.release
11058/11561 Test  #7907: mpi/collective_tensor.mpirun=10.release ................................................   Passed    3.11 sec
            Start  7932: mpi/compute_mean_value.mpirun=10.debug
11059/11561 Test  #7906: mpi/collective_tensor.mpirun=10.debug ..................................................   Passed    3.36 sec
            Start  7933: mpi/compute_mean_value.mpirun=10.release
11060/11561 Test  #7837: mpi/collective_logical_or_vector_in_place.mpirun=4.release .............................   Passed    3.09 sec
            Start  7842: mpi/collective_max.mpirun=4.debug
11061/11561 Test  #7842: mpi/collective_max.mpirun=4.debug ......................................................   Passed    3.08 sec
            Start  7843: mpi/collective_max.mpirun=4.release
11062/11561 Test  #7843: mpi/collective_max.mpirun=4.release ....................................................   Passed    2.92 sec
            Start  7848: mpi/collective_max_array.mpirun=4.debug
11063/11561 Test  #7848: mpi/collective_max_array.mpirun=4.debug ................................................   Passed    2.85 sec
            Start  7849: mpi/collective_max_array.mpirun=4.release
11064/11561 Test  #7849: mpi/collective_max_array.mpirun=4.release ..............................................   Passed    3.18 sec
            Start  7854: mpi/collective_max_array_in_place.mpirun=4.debug
11065/11561 Test  #7854: mpi/collective_max_array_in_place.mpirun=4.debug .......................................   Passed    3.18 sec
            Start  7855: mpi/collective_max_array_in_place.mpirun=4.release
11066/11561 Test  #7855: mpi/collective_max_array_in_place.mpirun=4.release .....................................   Passed    3.01 sec
            Start  7860: mpi/collective_max_vector.mpirun=4.debug
11067/11561 Test  #7860: mpi/collective_max_vector.mpirun=4.debug ...............................................   Passed    3.05 sec
            Start  7861: mpi/collective_max_vector.mpirun=4.release
11068/11561 Test  #7933: mpi/compute_mean_value.mpirun=10.release ...............................................   Passed   24.85 sec
            Start  7942: mpi/constraint_matrix_trilinos_bug.mpirun=10.debug
11069/11561 Test  #7932: mpi/compute_mean_value.mpirun=10.debug .................................................   Passed   26.49 sec
            Start  7948: mpi/count_dofs_per_block_01.mpirun=10.debug
11070/11561 Test  #7861: mpi/collective_max_vector.mpirun=4.release .............................................   Passed    3.10 sec
            Start  7866: mpi/collective_max_vector_in_place.mpirun=4.debug
11071/11561 Test  #7866: mpi/collective_max_vector_in_place.mpirun=4.debug ......................................   Passed    2.99 sec
            Start  7867: mpi/collective_max_vector_in_place.mpirun=4.release
11072/11561 Test  #7867: mpi/collective_max_vector_in_place.mpirun=4.release ....................................   Passed    3.20 sec
            Start  7874: mpi/collective_min.mpirun=4.debug
11073/11561 Test  #7874: mpi/collective_min.mpirun=4.debug ......................................................   Passed    3.02 sec
            Start  7875: mpi/collective_min.mpirun=4.release
11074/11561 Test  #7875: mpi/collective_min.mpirun=4.release ....................................................   Passed    3.08 sec
            Start  7880: mpi/collective_min_array.mpirun=4.debug
11075/11561 Test  #7880: mpi/collective_min_array.mpirun=4.debug ................................................   Passed    2.97 sec
            Start  7881: mpi/collective_min_array.mpirun=4.release
11076/11561 Test  #7881: mpi/collective_min_array.mpirun=4.release ..............................................   Passed    3.10 sec
            Start  7886: mpi/collective_min_array_in_place.mpirun=4.debug
11077/11561 Test  #7886: mpi/collective_min_array_in_place.mpirun=4.debug .......................................   Passed    3.29 sec
            Start  7887: mpi/collective_min_array_in_place.mpirun=4.release
11078/11561 Test  #7948: mpi/count_dofs_per_block_01.mpirun=10.debug ............................................   Passed   26.74 sec
            Start  7949: mpi/count_dofs_per_block_01.mpirun=10.release
11079/11561 Test  #7942: mpi/constraint_matrix_trilinos_bug.mpirun=10.debug .....................................   Passed   28.16 sec
            Start  7952: mpi/count_dofs_per_block_02.mpirun=10.debug
11080/11561 Test  #7887: mpi/collective_min_array_in_place.mpirun=4.release .....................................   Passed    4.48 sec
            Start  7892: mpi/collective_min_vector.mpirun=4.debug
11081/11561 Test  #7892: mpi/collective_min_vector.mpirun=4.debug ...............................................   Passed    3.04 sec
            Start  7893: mpi/collective_min_vector.mpirun=4.release
11082/11561 Test  #7893: mpi/collective_min_vector.mpirun=4.release .............................................   Passed    2.96 sec
            Start  7898: mpi/collective_min_vector_in_place.mpirun=4.debug
11083/11561 Test  #7898: mpi/collective_min_vector_in_place.mpirun=4.debug ......................................   Passed    2.94 sec
            Start  7899: mpi/collective_min_vector_in_place.mpirun=4.release
11084/11561 Test  #7899: mpi/collective_min_vector_in_place.mpirun=4.release ....................................   Passed    3.02 sec
            Start  7908: mpi/collective_tensor.mpirun=4.debug
11085/11561 Test  #7908: mpi/collective_tensor.mpirun=4.debug ...................................................   Passed    3.01 sec
            Start  7909: mpi/collective_tensor.mpirun=4.release
11086/11561 Test  #7909: mpi/collective_tensor.mpirun=4.release .................................................   Passed    2.98 sec
            Start  7934: mpi/compute_mean_value.mpirun=4.debug
11087/11561 Test  #7949: mpi/count_dofs_per_block_01.mpirun=10.release ..........................................   Passed   20.13 sec
            Start  7953: mpi/count_dofs_per_block_02.mpirun=10.release
11088/11561 Test  #7934: mpi/compute_mean_value.mpirun=4.debug ..................................................   Passed    4.28 sec
            Start  7935: mpi/compute_mean_value.mpirun=4.release
11089/11561 Test  #7952: mpi/count_dofs_per_block_02.mpirun=10.debug ............................................   Passed   23.44 sec
            Start  7956: mpi/count_dofs_per_component_01.mpirun=10.debug
11090/11561 Test  #7935: mpi/compute_mean_value.mpirun=4.release ................................................   Passed    3.14 sec
            Start  7943: mpi/constraint_matrix_trilinos_bug.mpirun=4.debug
11091/11561 Test  #7943: mpi/constraint_matrix_trilinos_bug.mpirun=4.debug ......................................   Passed    3.28 sec
            Start  7950: mpi/count_dofs_per_block_01.mpirun=4.debug
11092/11561 Test  #7950: mpi/count_dofs_per_block_01.mpirun=4.debug .............................................   Passed    5.59 sec
            Start  7951: mpi/count_dofs_per_block_01.mpirun=4.release
11093/11561 Test  #7951: mpi/count_dofs_per_block_01.mpirun=4.release ...........................................   Passed    3.04 sec
            Start  7954: mpi/count_dofs_per_block_02.mpirun=4.debug
11094/11561 Test  #7953: mpi/count_dofs_per_block_02.mpirun=10.release ..........................................   Passed   20.35 sec
            Start  7957: mpi/count_dofs_per_component_01.mpirun=10.release
11095/11561 Test  #7954: mpi/count_dofs_per_block_02.mpirun=4.debug .............................................   Passed    4.08 sec
            Start  7955: mpi/count_dofs_per_block_02.mpirun=4.release
11096/11561 Test  #7955: mpi/count_dofs_per_block_02.mpirun=4.release ...........................................   Passed    3.19 sec
11097/11561 Test  #7956: mpi/count_dofs_per_component_01.mpirun=10.debug ........................................   Passed   22.02 sec
            Start  7960: mpi/crash_01.mpirun=10.debug
            Start  7958: mpi/count_dofs_per_component_01.mpirun=4.debug
11098/11561 Test  #7958: mpi/count_dofs_per_component_01.mpirun=4.debug .........................................   Passed    3.12 sec
11099/11561 Test  #7957: mpi/count_dofs_per_component_01.mpirun=10.release ......................................   Passed   20.53 sec
            Start  7961: mpi/crash_01.mpirun=10.release
            Start  7959: mpi/count_dofs_per_component_01.mpirun=4.release
11100/11561 Test  #7959: mpi/count_dofs_per_component_01.mpirun=4.release .......................................   Passed    2.97 sec
11101/11561 Test  #7960: mpi/crash_01.mpirun=10.debug ...........................................................   Passed   20.57 sec
            Start  7966: mpi/crash_03.mpirun=10.debug
            Start  7962: mpi/crash_01.mpirun=4.debug
11102/11561 Test  #7962: mpi/crash_01.mpirun=4.debug ............................................................   Passed    3.24 sec
11103/11561 Test  #7961: mpi/crash_01.mpirun=10.release .........................................................   Passed   17.87 sec
            Start  7967: mpi/crash_03.mpirun=10.release
            Start  7963: mpi/crash_01.mpirun=4.release
11104/11561 Test  #7963: mpi/crash_01.mpirun=4.release ..........................................................   Passed    3.05 sec
11105/11561 Test  #7966: mpi/crash_03.mpirun=10.debug ...........................................................   Passed   18.89 sec
            Start  8007: mpi/distribute_sp_01.mpirun=10.debug
            Start  7968: mpi/crash_03.mpirun=4.debug
11106/11561 Test  #7968: mpi/crash_03.mpirun=4.debug ............................................................   Passed    3.18 sec
11107/11561 Test  #7967: mpi/crash_03.mpirun=10.release .........................................................   Passed   16.34 sec
            Start  8008: mpi/distribute_sp_01.mpirun=10.release
            Start  7969: mpi/crash_03.mpirun=4.release
11108/11561 Test  #7969: mpi/crash_03.mpirun=4.release ..........................................................   Passed    3.08 sec
11109/11561 Test  #8007: mpi/distribute_sp_01.mpirun=10.debug ...................................................   Passed   14.71 sec
            Start  8011: mpi/distribute_sp_02.mpirun=10.debug
            Start  8009: mpi/distribute_sp_01.mpirun=4.debug
11110/11561 Test  #8009: mpi/distribute_sp_01.mpirun=4.debug ....................................................   Passed    3.15 sec
11111/11561 Test  #8008: mpi/distribute_sp_01.mpirun=10.release .................................................   Passed   12.86 sec
            Start  8012: mpi/distribute_sp_02.mpirun=10.release
            Start  8010: mpi/distribute_sp_01.mpirun=4.release
11112/11561 Test  #8010: mpi/distribute_sp_01.mpirun=4.release ..................................................   Passed    3.00 sec
11113/11561 Test  #8011: mpi/distribute_sp_02.mpirun=10.debug ...................................................   Passed   14.52 sec
            Start  8015: mpi/dof_handler_number_cache.mpirun=10.debug
            Start  8013: mpi/distribute_sp_02.mpirun=4.debug
11114/11561 Test  #8013: mpi/distribute_sp_02.mpirun=4.debug ....................................................   Passed    3.14 sec
11115/11561 Test  #8012: mpi/distribute_sp_02.mpirun=10.release .................................................   Passed   13.29 sec
            Start  8016: mpi/dof_handler_number_cache.mpirun=10.release
            Start  8014: mpi/distribute_sp_02.mpirun=4.release
11116/11561 Test  #8014: mpi/distribute_sp_02.mpirun=4.release ..................................................   Passed    3.08 sec
11117/11561 Test  #8015: mpi/dof_handler_number_cache.mpirun=10.debug ...........................................   Passed   28.56 sec
            Start  8027: mpi/extract_boundary_dofs.mpirun=10.debug
            Start  8017: mpi/dof_handler_number_cache.mpirun=4.debug
11118/11561 Test  #8017: mpi/dof_handler_number_cache.mpirun=4.debug ............................................   Passed    4.35 sec
11119/11561 Test  #8016: mpi/dof_handler_number_cache.mpirun=10.release .........................................   Passed   26.45 sec
            Start  8028: mpi/extract_boundary_dofs.mpirun=10.release
            Start  8018: mpi/dof_handler_number_cache.mpirun=4.release
11120/11561 Test  #8018: mpi/dof_handler_number_cache.mpirun=4.release ..........................................   Passed    3.08 sec
11121/11561 Test  #8027: mpi/extract_boundary_dofs.mpirun=10.debug ..............................................   Passed   22.65 sec
            Start  8031: mpi/extract_constant_modes_01.mpirun=10.debug
            Start  8029: mpi/extract_boundary_dofs.mpirun=4.debug
11122/11561 Test  #8028: mpi/extract_boundary_dofs.mpirun=10.release ............................................   Passed   20.14 sec
            Start  8032: mpi/extract_constant_modes_01.mpirun=10.release
11123/11561 Test  #8029: mpi/extract_boundary_dofs.mpirun=4.debug ...............................................   Passed    3.81 sec
            Start  8030: mpi/extract_boundary_dofs.mpirun=4.release
11124/11561 Test  #8030: mpi/extract_boundary_dofs.mpirun=4.release .............................................   Passed    2.95 sec
11125/11561 Test  #8032: mpi/extract_constant_modes_01.mpirun=10.release ........................................   Passed   18.32 sec
            Start  8037: mpi/extract_locally_active_dofs.mpirun=10.debug
            Start  8034: mpi/extract_constant_modes_01.mpirun=4.release
11126/11561 Test  #8031: mpi/extract_constant_modes_01.mpirun=10.debug ..........................................   Passed   21.01 sec
            Start  8038: mpi/extract_locally_active_dofs.mpirun=10.release
11127/11561 Test  #8034: mpi/extract_constant_modes_01.mpirun=4.release .........................................   Passed    2.82 sec
            Start  8033: mpi/extract_constant_modes_01.mpirun=4.debug
11128/11561 Test  #8033: mpi/extract_constant_modes_01.mpirun=4.debug ...........................................   Passed    3.06 sec
11129/11561 Test  #8038: mpi/extract_locally_active_dofs.mpirun=10.release ......................................   Passed   19.16 sec
            Start  8041: mpi/extract_locally_active_level_dofs.mpirun=10.debug
            Start  8040: mpi/extract_locally_active_dofs.mpirun=4.release
11130/11561 Test  #8040: mpi/extract_locally_active_dofs.mpirun=4.release .......................................   Passed    3.42 sec
11131/11561 Test  #8037: mpi/extract_locally_active_dofs.mpirun=10.debug ........................................   Passed   23.30 sec
            Start  8042: mpi/extract_locally_active_level_dofs.mpirun=10.release
            Start  8039: mpi/extract_locally_active_dofs.mpirun=4.debug
11132/11561 Test  #8039: mpi/extract_locally_active_dofs.mpirun=4.debug .........................................   Passed    3.65 sec
11133/11561 Test  #8041: mpi/extract_locally_active_level_dofs.mpirun=10.debug ..................................   Passed   22.75 sec
            Start  8045: mpi/fe_field_function_01.mpirun=10.debug
            Start  8043: mpi/extract_locally_active_level_dofs.mpirun=4.debug
11134/11561 Test  #8042: mpi/extract_locally_active_level_dofs.mpirun=10.release ................................   Passed   19.77 sec
            Start  8046: mpi/fe_field_function_01.mpirun=10.release
11135/11561 Test  #8043: mpi/extract_locally_active_level_dofs.mpirun=4.debug ...................................   Passed    4.06 sec
            Start  8044: mpi/extract_locally_active_level_dofs.mpirun=4.release
11136/11561 Test  #8044: mpi/extract_locally_active_level_dofs.mpirun=4.release .................................   Passed    3.11 sec
11137/11561 Test  #8046: mpi/fe_field_function_01.mpirun=10.release .............................................   Passed   24.76 sec
            Start  8059: mpi/fe_tools_extrapolate_03.mpirun=10.debug
            Start  8048: mpi/fe_field_function_01.mpirun=4.release
11138/11561 Test  #8048: mpi/fe_field_function_01.mpirun=4.release ..............................................   Passed    7.75 sec
11139/11561 Test  #8045: mpi/fe_field_function_01.mpirun=10.debug ...............................................   Passed   56.23 sec
            Start  8060: mpi/fe_tools_extrapolate_03.mpirun=10.release
            Start  8047: mpi/fe_field_function_01.mpirun=4.debug
11140/11561 Test  #8059: mpi/fe_tools_extrapolate_03.mpirun=10.debug ............................................   Passed   32.81 sec
            Start  8121: mpi/hp_integrate_difference.mpirun=10.debug
11141/11561 Test  #8060: mpi/fe_tools_extrapolate_03.mpirun=10.release ..........................................   Passed    4.06 sec
            Start  8122: mpi/hp_integrate_difference.mpirun=10.release
11142/11561 Test  #8047: mpi/fe_field_function_01.mpirun=4.debug ................................................   Passed   18.65 sec
            Start  8061: mpi/fe_tools_extrapolate_03.mpirun=3.debug
            Start  8062: mpi/fe_tools_extrapolate_03.mpirun=3.release
11143/11561 Test  #8062: mpi/fe_tools_extrapolate_03.mpirun=3.release ...........................................***Failed    3.12 sec
11144/11561 Test  #8061: mpi/fe_tools_extrapolate_03.mpirun=3.debug .............................................***Failed    3.42 sec
11145/11561 Test  #8122: mpi/hp_integrate_difference.mpirun=10.release ..........................................   Passed   25.02 sec
            Start  8183: mpi/integrate_difference.mpirun=10.debug
            Start  8124: mpi/hp_integrate_difference.mpirun=4.release
11146/11561 Test  #8124: mpi/hp_integrate_difference.mpirun=4.release ...........................................   Passed    3.37 sec
11147/11561 Test  #8121: mpi/hp_integrate_difference.mpirun=10.debug ............................................   Passed   30.22 sec
            Start  8184: mpi/integrate_difference.mpirun=10.release
            Start  8123: mpi/hp_integrate_difference.mpirun=4.debug
11148/11561 Test  #8123: mpi/hp_integrate_difference.mpirun=4.debug .............................................   Passed    4.49 sec
11149/11561 Test  #8183: mpi/integrate_difference.mpirun=10.debug ...............................................   Passed   28.17 sec
            Start  8187: mpi/interpolate_01.mpirun=10.debug
            Start  8185: mpi/integrate_difference.mpirun=4.debug
11150/11561 Test  #8184: mpi/integrate_difference.mpirun=10.release .............................................   Passed   24.70 sec
            Start  8188: mpi/interpolate_01.mpirun=10.release
11151/11561 Test  #8185: mpi/integrate_difference.mpirun=4.debug ................................................   Passed    3.64 sec
            Start  8186: mpi/integrate_difference.mpirun=4.release
11152/11561 Test  #8186: mpi/integrate_difference.mpirun=4.release ..............................................   Passed    3.05 sec
11153/11561 Test  #8188: mpi/interpolate_01.mpirun=10.release ...................................................   Passed   24.70 sec
            Start  8191: mpi/interpolate_03.mpirun=10.debug
            Start  8190: mpi/interpolate_01.mpirun=4.release
11154/11561 Test  #8187: mpi/interpolate_01.mpirun=10.debug .....................................................   Passed   27.97 sec
            Start  8192: mpi/interpolate_03.mpirun=10.release
11155/11561 Test  #8190: mpi/interpolate_01.mpirun=4.release ....................................................   Passed    3.31 sec
            Start  8189: mpi/interpolate_01.mpirun=4.debug
11156/11561 Test  #8189: mpi/interpolate_01.mpirun=4.debug ......................................................   Passed    3.15 sec
11157/11561 Test  #8192: mpi/interpolate_03.mpirun=10.release ...................................................   Passed   20.93 sec
            Start  8201: mpi/is_locally_owned.mpirun=10.debug
            Start  8194: mpi/interpolate_03.mpirun=4.release
11158/11561 Test  #8191: mpi/interpolate_03.mpirun=10.debug .....................................................   Passed   24.65 sec
            Start  8202: mpi/is_locally_owned.mpirun=10.release
11159/11561 Test  #8194: mpi/interpolate_03.mpirun=4.release ....................................................   Passed    3.26 sec
            Start  8193: mpi/interpolate_03.mpirun=4.debug
11160/11561 Test  #8193: mpi/interpolate_03.mpirun=4.debug ......................................................   Passed    3.10 sec
11161/11561 Test  #8202: mpi/is_locally_owned.mpirun=10.release .................................................   Passed   18.49 sec
            Start  8227: mpi/make_zero_boundary_values.mpirun=10.debug
            Start  8204: mpi/is_locally_owned.mpirun=4.release
11162/11561 Test  #8201: mpi/is_locally_owned.mpirun=10.debug ...................................................   Passed   21.91 sec
            Start  8228: mpi/make_zero_boundary_values.mpirun=10.release
11163/11561 Test  #8204: mpi/is_locally_owned.mpirun=4.release ..................................................   Passed    3.18 sec
            Start  8203: mpi/is_locally_owned.mpirun=4.debug
11164/11561 Test  #8203: mpi/is_locally_owned.mpirun=4.debug ....................................................   Passed    3.22 sec
11165/11561 Test  #8227: mpi/make_zero_boundary_values.mpirun=10.debug ..........................................   Passed   22.97 sec
            Start  8231: mpi/map_dofs_to_support_points.mpirun=10.debug
            Start  8229: mpi/make_zero_boundary_values.mpirun=4.debug
11166/11561 Test  #8228: mpi/make_zero_boundary_values.mpirun=10.release ........................................   Passed   21.03 sec
            Start  8232: mpi/map_dofs_to_support_points.mpirun=10.release
11167/11561 Test  #8229: mpi/make_zero_boundary_values.mpirun=4.debug ...........................................   Passed    3.74 sec
            Start  8230: mpi/make_zero_boundary_values.mpirun=4.release
11168/11561 Test  #8230: mpi/make_zero_boundary_values.mpirun=4.release .........................................   Passed    2.99 sec
11169/11561 Test  #8232: mpi/map_dofs_to_support_points.mpirun=10.release .......................................   Passed   20.68 sec
            Start  8253: mpi/mg_01.mpirun=10.debug
            Start  8234: mpi/map_dofs_to_support_points.mpirun=4.release
11170/11561 Test  #8231: mpi/map_dofs_to_support_points.mpirun=10.debug .........................................   Passed   22.62 sec
            Start  8254: mpi/mg_01.mpirun=10.release
11171/11561 Test  #8234: mpi/map_dofs_to_support_points.mpirun=4.release ........................................   Passed    3.17 sec
            Start  8233: mpi/map_dofs_to_support_points.mpirun=4.debug
11172/11561 Test  #8233: mpi/map_dofs_to_support_points.mpirun=4.debug ..........................................   Passed    3.32 sec
11173/11561 Test  #8254: mpi/mg_01.mpirun=10.release ............................................................   Passed   16.06 sec
            Start  8257: mpi/mg_02.mpirun=10.debug
            Start  8256: mpi/mg_01.mpirun=4.release
11174/11561 Test  #8253: mpi/mg_01.mpirun=10.debug ..............................................................   Passed   18.79 sec
            Start  8258: mpi/mg_02.mpirun=10.release
11175/11561 Test  #8256: mpi/mg_01.mpirun=4.release .............................................................   Passed    3.18 sec
            Start  8255: mpi/mg_01.mpirun=4.debug
11176/11561 Test  #8255: mpi/mg_01.mpirun=4.debug ...............................................................   Passed    2.98 sec
11177/11561 Test  #8258: mpi/mg_02.mpirun=10.release ............................................................   Passed   24.50 sec
            Start  8263: mpi/mg_03.mpirun=10.debug
            Start  8260: mpi/mg_02.mpirun=4.release
11178/11561 Test  #8257: mpi/mg_02.mpirun=10.debug ..............................................................   Passed   26.44 sec
            Start  8264: mpi/mg_03.mpirun=10.release
11179/11561 Test  #8260: mpi/mg_02.mpirun=4.release .............................................................   Passed    4.12 sec
            Start  8259: mpi/mg_02.mpirun=4.debug
11180/11561 Test  #8264: mpi/mg_03.mpirun=10.release ............................................................   Passed    7.11 sec
            Start  8333: mpi/p4est_2d_coarse_01.mpirun=10.debug
11181/11561 Test  #8263: mpi/mg_03.mpirun=10.debug ..............................................................   Passed    7.29 sec
            Start  8334: mpi/p4est_2d_coarse_01.mpirun=10.release
11182/11561 Test  #8259: mpi/mg_02.mpirun=4.debug ...............................................................   Passed    4.82 sec
            Start  8265: mpi/mg_03.mpirun=4.debug
11183/11561 Test  #8265: mpi/mg_03.mpirun=4.debug ...............................................................   Passed    3.10 sec
            Start  8266: mpi/mg_03.mpirun=4.release
11184/11561 Test  #8266: mpi/mg_03.mpirun=4.release .............................................................   Passed    2.99 sec
11185/11561 Test  #8334: mpi/p4est_2d_coarse_01.mpirun=10.release ...............................................   Passed   19.01 sec
            Start  8337: mpi/p4est_2d_constraintmatrix_01.mpirun=10.debug
            Start  8336: mpi/p4est_2d_coarse_01.mpirun=4.release
11186/11561 Test  #8336: mpi/p4est_2d_coarse_01.mpirun=4.release ................................................   Passed    3.90 sec
11187/11561 Test  #8333: mpi/p4est_2d_coarse_01.mpirun=10.debug .................................................   Passed   34.85 sec
            Start  8338: mpi/p4est_2d_constraintmatrix_01.mpirun=10.release
            Start  8335: mpi/p4est_2d_coarse_01.mpirun=4.debug
11188/11561 Test  #8337: mpi/p4est_2d_constraintmatrix_01.mpirun=10.debug .......................................   Passed   22.75 sec
            Start  8341: mpi/p4est_2d_constraintmatrix_02.mpirun=10.debug
11189/11561 Test  #8335: mpi/p4est_2d_coarse_01.mpirun=4.debug ..................................................   Passed   14.10 sec
            Start  8339: mpi/p4est_2d_constraintmatrix_01.mpirun=4.debug
11190/11561 Test  #8339: mpi/p4est_2d_constraintmatrix_01.mpirun=4.debug ........................................   Passed    3.00 sec
11191/11561 Test  #8338: mpi/p4est_2d_constraintmatrix_01.mpirun=10.release .....................................   Passed   19.30 sec
            Start  8342: mpi/p4est_2d_constraintmatrix_02.mpirun=10.release
            Start  8340: mpi/p4est_2d_constraintmatrix_01.mpirun=4.release
11192/11561 Test  #8340: mpi/p4est_2d_constraintmatrix_01.mpirun=4.release ......................................   Passed    3.07 sec
11193/11561 Test  #8341: mpi/p4est_2d_constraintmatrix_02.mpirun=10.debug .......................................   Passed   21.33 sec
            Start  8345: mpi/p4est_2d_constraintmatrix_03.mpirun=10.debug
            Start  8343: mpi/p4est_2d_constraintmatrix_02.mpirun=4.debug
11194/11561 Test  #8343: mpi/p4est_2d_constraintmatrix_02.mpirun=4.debug ........................................   Passed    3.33 sec
11195/11561 Test  #8342: mpi/p4est_2d_constraintmatrix_02.mpirun=10.release .....................................   Passed   18.44 sec
            Start  8346: mpi/p4est_2d_constraintmatrix_03.mpirun=10.release
            Start  8344: mpi/p4est_2d_constraintmatrix_02.mpirun=4.release
11196/11561 Test  #8344: mpi/p4est_2d_constraintmatrix_02.mpirun=4.release ......................................   Passed    3.15 sec
11197/11561 Test  #8345: mpi/p4est_2d_constraintmatrix_03.mpirun=10.debug .......................................   Passed   26.75 sec
            Start  8349: mpi/p4est_2d_constraintmatrix_04.mpirun=10.debug
            Start  8347: mpi/p4est_2d_constraintmatrix_03.mpirun=4.debug
11198/11561 Test  #8347: mpi/p4est_2d_constraintmatrix_03.mpirun=4.debug ........................................   Passed    3.88 sec
11199/11561 Test  #8346: mpi/p4est_2d_constraintmatrix_03.mpirun=10.release .....................................   Passed   23.33 sec
            Start  8350: mpi/p4est_2d_constraintmatrix_04.mpirun=10.release
            Start  8348: mpi/p4est_2d_constraintmatrix_03.mpirun=4.release
11200/11561 Test  #8348: mpi/p4est_2d_constraintmatrix_03.mpirun=4.release ......................................   Passed    3.13 sec
11201/11561 Test  #8349: mpi/p4est_2d_constraintmatrix_04.mpirun=10.debug .......................................   Passed   27.08 sec
            Start  8355: mpi/p4est_2d_dofhandler_01.mpirun=10.debug
            Start  8351: mpi/p4est_2d_constraintmatrix_04.mpirun=4.debug
11202/11561 Test  #8350: mpi/p4est_2d_constraintmatrix_04.mpirun=10.release .....................................   Passed   23.65 sec
            Start  8356: mpi/p4est_2d_dofhandler_01.mpirun=10.release
11203/11561 Test  #8351: mpi/p4est_2d_constraintmatrix_04.mpirun=4.debug ........................................   Passed    4.93 sec
            Start  8352: mpi/p4est_2d_constraintmatrix_04.mpirun=4.release
11204/11561 Test  #8352: mpi/p4est_2d_constraintmatrix_04.mpirun=4.release ......................................   Passed    3.20 sec
11205/11561 Test  #8356: mpi/p4est_2d_dofhandler_01.mpirun=10.release ...........................................   Passed   18.78 sec
            Start  8359: mpi/p4est_2d_dofhandler_02.mpirun=10.debug
            Start  8358: mpi/p4est_2d_dofhandler_01.mpirun=4.release
11206/11561 Test  #8355: mpi/p4est_2d_dofhandler_01.mpirun=10.debug .............................................   Passed   23.77 sec
            Start  8360: mpi/p4est_2d_dofhandler_02.mpirun=10.release
11207/11561 Test  #8358: mpi/p4est_2d_dofhandler_01.mpirun=4.release ............................................   Passed    3.09 sec
            Start  8357: mpi/p4est_2d_dofhandler_01.mpirun=4.debug
11208/11561 Test  #8357: mpi/p4est_2d_dofhandler_01.mpirun=4.debug ..............................................   Passed    3.08 sec
11209/11561 Test  #8360: mpi/p4est_2d_dofhandler_02.mpirun=10.release ...........................................   Passed   19.64 sec
            Start  8363: mpi/p4est_2d_dofhandler_03.mpirun=10.debug
            Start  8362: mpi/p4est_2d_dofhandler_02.mpirun=4.release
11210/11561 Test  #8362: mpi/p4est_2d_dofhandler_02.mpirun=4.release ............................................   Passed    3.40 sec
11211/11561 Test  #8359: mpi/p4est_2d_dofhandler_02.mpirun=10.debug .............................................   Passed   28.93 sec
            Start  8364: mpi/p4est_2d_dofhandler_03.mpirun=10.release
            Start  8361: mpi/p4est_2d_dofhandler_02.mpirun=4.debug
11212/11561 Test  #8361: mpi/p4est_2d_dofhandler_02.mpirun=4.debug ..............................................   Passed    5.32 sec
11213/11561 Test  #8363: mpi/p4est_2d_dofhandler_03.mpirun=10.debug .............................................   Passed   32.03 sec
            Start  8367: mpi/p4est_2d_dofhandler_04.mpirun=10.debug
            Start  8365: mpi/p4est_2d_dofhandler_03.mpirun=4.debug
11214/11561 Test  #8364: mpi/p4est_2d_dofhandler_03.mpirun=10.release ...........................................   Passed   25.20 sec
            Start  8368: mpi/p4est_2d_dofhandler_04.mpirun=10.release
11215/11561 Test  #8365: mpi/p4est_2d_dofhandler_03.mpirun=4.debug ..............................................   Passed    5.23 sec
            Start  8366: mpi/p4est_2d_dofhandler_03.mpirun=4.release
11216/11561 Test  #8366: mpi/p4est_2d_dofhandler_03.mpirun=4.release ............................................   Passed    3.10 sec
11217/11561 Test  #8368: mpi/p4est_2d_dofhandler_04.mpirun=10.release ...........................................   Passed   18.99 sec
            Start  8371: mpi/p4est_2d_dofhandler_05.mpirun=10.debug
            Start  8370: mpi/p4est_2d_dofhandler_04.mpirun=4.release
11218/11561 Test  #8370: mpi/p4est_2d_dofhandler_04.mpirun=4.release ............................................   Passed    3.09 sec
11219/11561 Test  #8367: mpi/p4est_2d_dofhandler_04.mpirun=10.debug .............................................   Passed   27.86 sec
            Start  8372: mpi/p4est_2d_dofhandler_05.mpirun=10.release
            Start  8369: mpi/p4est_2d_dofhandler_04.mpirun=4.debug
11220/11561 Test  #8369: mpi/p4est_2d_dofhandler_04.mpirun=4.debug ..............................................   Passed    5.35 sec
11221/11561 Test  #8371: mpi/p4est_2d_dofhandler_05.mpirun=10.debug .............................................   Passed   21.49 sec
            Start  8375: mpi/p4est_2d_ghost_01.mpirun=10.debug
            Start  8373: mpi/p4est_2d_dofhandler_05.mpirun=4.debug
11222/11561 Test  #8373: mpi/p4est_2d_dofhandler_05.mpirun=4.debug ..............................................   Passed    3.14 sec
11223/11561 Test  #8372: mpi/p4est_2d_dofhandler_05.mpirun=10.release ...........................................   Passed   18.07 sec
            Start  8376: mpi/p4est_2d_ghost_01.mpirun=10.release
            Start  8374: mpi/p4est_2d_dofhandler_05.mpirun=4.release
11224/11561 Test  #8374: mpi/p4est_2d_dofhandler_05.mpirun=4.release ............................................   Passed    2.96 sec
11225/11561 Test  #8375: mpi/p4est_2d_ghost_01.mpirun=10.debug ..................................................   Passed   22.04 sec
            Start  8379: mpi/p4est_2d_ghost_02.mpirun=10.debug
            Start  8377: mpi/p4est_2d_ghost_01.mpirun=4.debug
11226/11561 Test  #8376: mpi/p4est_2d_ghost_01.mpirun=10.release ................................................   Passed   19.59 sec
            Start  8380: mpi/p4est_2d_ghost_02.mpirun=10.release
11227/11561 Test  #8377: mpi/p4est_2d_ghost_01.mpirun=4.debug ...................................................   Passed    3.25 sec
            Start  8378: mpi/p4est_2d_ghost_01.mpirun=4.release
11228/11561 Test  #8378: mpi/p4est_2d_ghost_01.mpirun=4.release .................................................   Passed    3.06 sec
11229/11561 Test  #8380: mpi/p4est_2d_ghost_02.mpirun=10.release ................................................   Passed   19.22 sec
            Start  8383: mpi/p4est_2d_refine_01.mpirun=10.debug
            Start  8382: mpi/p4est_2d_ghost_02.mpirun=4.release
11230/11561 Test  #8379: mpi/p4est_2d_ghost_02.mpirun=10.debug ..................................................   Passed   23.38 sec
            Start  8384: mpi/p4est_2d_refine_01.mpirun=10.release
11231/11561 Test  #8382: mpi/p4est_2d_ghost_02.mpirun=4.release .................................................   Passed    3.17 sec
            Start  8381: mpi/p4est_2d_ghost_02.mpirun=4.debug
11232/11561 Test  #8381: mpi/p4est_2d_ghost_02.mpirun=4.debug ...................................................   Passed    3.36 sec
11233/11561 Test  #8384: mpi/p4est_2d_refine_01.mpirun=10.release ...............................................   Passed   18.79 sec
            Start  8387: mpi/p4est_2d_refine_02.mpirun=10.debug
            Start  8386: mpi/p4est_2d_refine_01.mpirun=4.release
11234/11561 Test  #8383: mpi/p4est_2d_refine_01.mpirun=10.debug .................................................   Passed   22.35 sec
            Start  8388: mpi/p4est_2d_refine_02.mpirun=10.release
11235/11561 Test  #8386: mpi/p4est_2d_refine_01.mpirun=4.release ................................................   Passed    3.17 sec
            Start  8385: mpi/p4est_2d_refine_01.mpirun=4.debug
11236/11561 Test  #8385: mpi/p4est_2d_refine_01.mpirun=4.debug ..................................................   Passed    3.28 sec
11237/11561 Test  #8388: mpi/p4est_2d_refine_02.mpirun=10.release ...............................................   Passed   18.83 sec
            Start  8391: mpi/p4est_2d_refine_03.mpirun=10.debug
            Start  8390: mpi/p4est_2d_refine_02.mpirun=4.release
11238/11561 Test  #8387: mpi/p4est_2d_refine_02.mpirun=10.debug .................................................   Passed   23.03 sec
            Start  8392: mpi/p4est_2d_refine_03.mpirun=10.release
11239/11561 Test  #8390: mpi/p4est_2d_refine_02.mpirun=4.release ................................................   Passed    3.23 sec
            Start  8389: mpi/p4est_2d_refine_02.mpirun=4.debug
11240/11561 Test  #8389: mpi/p4est_2d_refine_02.mpirun=4.debug ..................................................   Passed    3.24 sec
11241/11561 Test  #8392: mpi/p4est_2d_refine_03.mpirun=10.release ...............................................   Passed   19.02 sec
            Start  8395: mpi/p4est_2d_renumber_01.mpirun=10.debug
            Start  8394: mpi/p4est_2d_refine_03.mpirun=4.release
11242/11561 Test  #8391: mpi/p4est_2d_refine_03.mpirun=10.debug .................................................   Passed   23.06 sec
            Start  8396: mpi/p4est_2d_renumber_01.mpirun=10.release
11243/11561 Test  #8394: mpi/p4est_2d_refine_03.mpirun=4.release ................................................   Passed    3.30 sec
            Start  8393: mpi/p4est_2d_refine_03.mpirun=4.debug
11244/11561 Test  #8393: mpi/p4est_2d_refine_03.mpirun=4.debug ..................................................   Passed    4.79 sec
11245/11561 Test  #8395: mpi/p4est_2d_renumber_01.mpirun=10.debug ...............................................   Passed   23.31 sec
            Start  8399: mpi/p4est_2d_renumber_02.mpirun=10.debug
            Start  8397: mpi/p4est_2d_renumber_01.mpirun=4.debug
11246/11561 Test  #8396: mpi/p4est_2d_renumber_01.mpirun=10.release .............................................   Passed   21.19 sec
            Start  8400: mpi/p4est_2d_renumber_02.mpirun=10.release
11247/11561 Test  #8397: mpi/p4est_2d_renumber_01.mpirun=4.debug ................................................   Passed    3.36 sec
            Start  8398: mpi/p4est_2d_renumber_01.mpirun=4.release
11248/11561 Test  #8398: mpi/p4est_2d_renumber_01.mpirun=4.release ..............................................   Passed    2.96 sec
11249/11561 Test  #8400: mpi/p4est_2d_renumber_02.mpirun=10.release .............................................   Passed   23.18 sec
            Start  8403: mpi/p4est_2d_simple.mpirun=10.debug
            Start  8402: mpi/p4est_2d_renumber_02.mpirun=4.release
11250/11561 Test  #8399: mpi/p4est_2d_renumber_02.mpirun=10.debug ...............................................   Passed   24.24 sec
            Start  8404: mpi/p4est_2d_simple.mpirun=10.release
11251/11561 Test  #8402: mpi/p4est_2d_renumber_02.mpirun=4.release ..............................................   Passed    3.06 sec
            Start  8401: mpi/p4est_2d_renumber_02.mpirun=4.debug
11252/11561 Test  #8401: mpi/p4est_2d_renumber_02.mpirun=4.debug ................................................   Passed    3.08 sec
11253/11561 Test  #8404: mpi/p4est_2d_simple.mpirun=10.release ..................................................   Passed   14.20 sec
            Start  8407: mpi/p4est_3d_constraintmatrix_01.mpirun=10.debug
            Start  8406: mpi/p4est_2d_simple.mpirun=4.release
11254/11561 Test  #8403: mpi/p4est_2d_simple.mpirun=10.debug ....................................................   Passed   17.00 sec
            Start  8408: mpi/p4est_3d_constraintmatrix_01.mpirun=10.release
11255/11561 Test  #8406: mpi/p4est_2d_simple.mpirun=4.release ...................................................   Passed    3.12 sec
            Start  8405: mpi/p4est_2d_simple.mpirun=4.debug
11256/11561 Test  #8405: mpi/p4est_2d_simple.mpirun=4.debug .....................................................   Passed    3.16 sec
11257/11561 Test  #8408: mpi/p4est_3d_constraintmatrix_01.mpirun=10.release .....................................   Passed   18.63 sec
            Start  8411: mpi/p4est_3d_constraintmatrix_02.mpirun=10.debug
            Start  8410: mpi/p4est_3d_constraintmatrix_01.mpirun=4.release
11258/11561 Test  #8407: mpi/p4est_3d_constraintmatrix_01.mpirun=10.debug .......................................   Passed   23.32 sec
            Start  8412: mpi/p4est_3d_constraintmatrix_02.mpirun=10.release
11259/11561 Test  #8410: mpi/p4est_3d_constraintmatrix_01.mpirun=4.release ......................................   Passed    3.35 sec
            Start  8409: mpi/p4est_3d_constraintmatrix_01.mpirun=4.debug
11260/11561 Test  #8409: mpi/p4est_3d_constraintmatrix_01.mpirun=4.debug ........................................   Passed    4.83 sec
11261/11561 Test  #8411: mpi/p4est_3d_constraintmatrix_02.mpirun=10.debug .......................................   Passed   21.62 sec
            Start  8415: mpi/p4est_3d_constraintmatrix_03.mpirun=10.debug
            Start  8413: mpi/p4est_3d_constraintmatrix_02.mpirun=4.debug
11262/11561 Test  #8412: mpi/p4est_3d_constraintmatrix_02.mpirun=10.release .....................................   Passed   18.76 sec
            Start  8416: mpi/p4est_3d_constraintmatrix_03.mpirun=10.release
11263/11561 Test  #8413: mpi/p4est_3d_constraintmatrix_02.mpirun=4.debug ........................................   Passed    3.39 sec
            Start  8414: mpi/p4est_3d_constraintmatrix_02.mpirun=4.release
11264/11561 Test  #8414: mpi/p4est_3d_constraintmatrix_02.mpirun=4.release ......................................   Passed    2.92 sec
11265/11561 Test  #8416: mpi/p4est_3d_constraintmatrix_03.mpirun=10.release .....................................   Passed   23.85 sec
            Start  8421: mpi/p4est_3d_ghost_01.mpirun=10.debug
            Start  8418: mpi/p4est_3d_constraintmatrix_03.mpirun=4.release
11266/11561 Test  #8418: mpi/p4est_3d_constraintmatrix_03.mpirun=4.release ......................................   Passed    5.05 sec
11267/11561 Test  #8415: mpi/p4est_3d_constraintmatrix_03.mpirun=10.debug .......................................   Passed   52.32 sec
            Start  8422: mpi/p4est_3d_ghost_01.mpirun=10.release
            Start  8417: mpi/p4est_3d_constraintmatrix_03.mpirun=4.debug
11268/11561 Test  #8421: mpi/p4est_3d_ghost_01.mpirun=10.debug ..................................................   Passed   28.63 sec
            Start  8425: mpi/p4est_3d_refine_01.mpirun=10.debug
11269/11561 Test  #8422: mpi/p4est_3d_ghost_01.mpirun=10.release ................................................   Passed   19.02 sec
            Start  8426: mpi/p4est_3d_refine_01.mpirun=10.release
11270/11561 Test  #8425: mpi/p4est_3d_refine_01.mpirun=10.debug .................................................   Passed   39.38 sec
            Start  8429: mpi/p4est_3d_refine_02.mpirun=10.debug
11271/11561 Test  #8417: mpi/p4est_3d_constraintmatrix_03.mpirun=4.debug ........................................   Passed   42.24 sec
            Start  8423: mpi/p4est_3d_ghost_01.mpirun=4.debug
11272/11561 Test  #8426: mpi/p4est_3d_refine_01.mpirun=10.release ...............................................   Passed   23.94 sec
            Start  8430: mpi/p4est_3d_refine_02.mpirun=10.release
11273/11561 Test  #8423: mpi/p4est_3d_ghost_01.mpirun=4.debug ...................................................   Passed    3.44 sec
            Start  8424: mpi/p4est_3d_ghost_01.mpirun=4.release
11274/11561 Test  #8424: mpi/p4est_3d_ghost_01.mpirun=4.release .................................................   Passed    3.08 sec
            Start  8427: mpi/p4est_3d_refine_01.mpirun=4.debug
11275/11561 Test  #8427: mpi/p4est_3d_refine_01.mpirun=4.debug ..................................................   Passed   11.32 sec
            Start  8428: mpi/p4est_3d_refine_01.mpirun=4.release
11276/11561 Test  #8430: mpi/p4est_3d_refine_02.mpirun=10.release ...............................................   Passed   18.47 sec
            Start  8433: mpi/p4est_3d_refine_03.mpirun=10.debug
11277/11561 Test  #8429: mpi/p4est_3d_refine_02.mpirun=10.debug .................................................   Passed   22.72 sec
            Start  8434: mpi/p4est_3d_refine_03.mpirun=10.release
11278/11561 Test  #8428: mpi/p4est_3d_refine_01.mpirun=4.release ................................................   Passed    3.38 sec
            Start  8431: mpi/p4est_3d_refine_02.mpirun=4.debug
11279/11561 Test  #8431: mpi/p4est_3d_refine_02.mpirun=4.debug ..................................................   Passed    3.05 sec
            Start  8432: mpi/p4est_3d_refine_02.mpirun=4.release
11280/11561 Test  #8432: mpi/p4est_3d_refine_02.mpirun=4.release ................................................   Passed    2.96 sec
11281/11561 Test  #8434: mpi/p4est_3d_refine_03.mpirun=10.release ...............................................   Passed   19.01 sec
            Start  8446: mpi/p4est_data_out_01.mpirun=10.debug
            Start  8436: mpi/p4est_3d_refine_03.mpirun=4.release
11282/11561 Test  #8433: mpi/p4est_3d_refine_03.mpirun=10.debug .................................................   Passed   22.44 sec
            Start  8447: mpi/p4est_data_out_01.mpirun=10.release
11283/11561 Test  #8436: mpi/p4est_3d_refine_03.mpirun=4.release ................................................   Passed    3.19 sec
            Start  8435: mpi/p4est_3d_refine_03.mpirun=4.debug
11284/11561 Test  #8435: mpi/p4est_3d_refine_03.mpirun=4.debug ..................................................   Passed    3.31 sec
11285/11561 Test  #8447: mpi/p4est_data_out_01.mpirun=10.release ................................................   Passed   20.15 sec
            Start  8450: mpi/p4est_get_subdomain_association.mpirun=10.debug
            Start  8449: mpi/p4est_data_out_01.mpirun=4.release
11286/11561 Test  #8446: mpi/p4est_data_out_01.mpirun=10.debug ..................................................   Passed   25.15 sec
            Start  8451: mpi/p4est_get_subdomain_association.mpirun=10.release
11287/11561 Test  #8449: mpi/p4est_data_out_01.mpirun=4.release .................................................   Passed    3.10 sec
            Start  8448: mpi/p4est_data_out_01.mpirun=4.debug
11288/11561 Test  #8448: mpi/p4est_data_out_01.mpirun=4.debug ...................................................   Passed    3.09 sec
11289/11561 Test  #8451: mpi/p4est_get_subdomain_association.mpirun=10.release ..................................   Passed   18.37 sec
            Start  8458: mpi/p4est_save_01.mpirun=10.debug
            Start  8453: mpi/p4est_get_subdomain_association.mpirun=4.release
11290/11561 Test  #8450: mpi/p4est_get_subdomain_association.mpirun=10.debug ....................................   Passed   23.26 sec
            Start  8459: mpi/p4est_save_01.mpirun=10.release
11291/11561 Test  #8453: mpi/p4est_get_subdomain_association.mpirun=4.release ...................................   Passed    3.13 sec
            Start  8452: mpi/p4est_get_subdomain_association.mpirun=4.debug
11292/11561 Test  #8452: mpi/p4est_get_subdomain_association.mpirun=4.debug .....................................   Passed    3.10 sec
11293/11561 Test  #8459: mpi/p4est_save_01.mpirun=10.release ....................................................   Passed   19.16 sec
            Start  8482: mpi/parallel_block_vector_01.mpirun=10.debug
            Start  8461: mpi/p4est_save_01.mpirun=4.release
11294/11561 Test  #8458: mpi/p4est_save_01.mpirun=10.debug ......................................................   Passed   22.13 sec
            Start  8483: mpi/parallel_block_vector_01.mpirun=10.release
11295/11561 Test  #8461: mpi/p4est_save_01.mpirun=4.release .....................................................   Passed    3.14 sec
            Start  8460: mpi/p4est_save_01.mpirun=4.debug
11296/11561 Test  #8482: mpi/parallel_block_vector_01.mpirun=10.debug ...........................................   Passed    3.44 sec
            Start  8488: mpi/parallel_block_vector_02.mpirun=10.debug
11297/11561 Test  #8483: mpi/parallel_block_vector_01.mpirun=10.release .........................................   Passed    3.18 sec
            Start  8489: mpi/parallel_block_vector_02.mpirun=10.release
11298/11561 Test  #8460: mpi/p4est_save_01.mpirun=4.debug .......................................................   Passed    3.46 sec
            Start  8484: mpi/parallel_block_vector_01.mpirun=4.debug
11299/11561 Test  #8488: mpi/parallel_block_vector_02.mpirun=10.debug ...........................................   Passed    3.25 sec
            Start  8494: mpi/parallel_block_vector_04.mpirun=10.debug
11300/11561 Test  #8489: mpi/parallel_block_vector_02.mpirun=10.release .........................................   Passed    3.16 sec
            Start  8495: mpi/parallel_block_vector_04.mpirun=10.release
11301/11561 Test  #8484: mpi/parallel_block_vector_01.mpirun=4.debug ............................................   Passed    3.14 sec
            Start  8485: mpi/parallel_block_vector_01.mpirun=4.release
11302/11561 Test  #8494: mpi/parallel_block_vector_04.mpirun=10.debug ...........................................   Passed    3.26 sec
            Start  8526: mpi/parallel_partitioner_01.mpirun=10.debug
11303/11561 Test  #8495: mpi/parallel_block_vector_04.mpirun=10.release .........................................   Passed    3.27 sec
            Start  8527: mpi/parallel_partitioner_01.mpirun=10.release
11304/11561 Test  #8485: mpi/parallel_block_vector_01.mpirun=4.release ..........................................   Passed    3.05 sec
            Start  8490: mpi/parallel_block_vector_02.mpirun=4.debug
11305/11561 Test  #8490: mpi/parallel_block_vector_02.mpirun=4.debug ............................................   Passed    2.93 sec
            Start  8491: mpi/parallel_block_vector_02.mpirun=4.release
11306/11561 Test  #8491: mpi/parallel_block_vector_02.mpirun=4.release ..........................................   Passed    2.93 sec
            Start  8496: mpi/parallel_block_vector_04.mpirun=4.debug
11307/11561 Test  #8496: mpi/parallel_block_vector_04.mpirun=4.debug ............................................   Passed    3.04 sec
            Start  8497: mpi/parallel_block_vector_04.mpirun=4.release
11308/11561 Test  #8527: mpi/parallel_partitioner_01.mpirun=10.release ..........................................   Passed   12.64 sec
            Start  8530: mpi/parallel_partitioner_02.mpirun=10.debug
11309/11561 Test  #8526: mpi/parallel_partitioner_01.mpirun=10.debug ............................................   Passed   13.90 sec
            Start  8531: mpi/parallel_partitioner_02.mpirun=10.release
11310/11561 Test  #8497: mpi/parallel_block_vector_04.mpirun=4.release ..........................................   Passed    3.08 sec
            Start  8528: mpi/parallel_partitioner_01.mpirun=4.debug
11311/11561 Test  #8528: mpi/parallel_partitioner_01.mpirun=4.debug .............................................   Passed    3.07 sec
            Start  8529: mpi/parallel_partitioner_01.mpirun=4.release
11312/11561 Test  #8529: mpi/parallel_partitioner_01.mpirun=4.release ...........................................   Passed    2.98 sec
11313/11561 Test  #8531: mpi/parallel_partitioner_02.mpirun=10.release ..........................................   Passed   12.52 sec
            Start  8534: mpi/parallel_partitioner_03.mpirun=10.debug
            Start  8533: mpi/parallel_partitioner_02.mpirun=4.release
11314/11561 Test  #8530: mpi/parallel_partitioner_02.mpirun=10.debug ............................................   Passed   14.15 sec
            Start  8535: mpi/parallel_partitioner_03.mpirun=10.release
11315/11561 Test  #8533: mpi/parallel_partitioner_02.mpirun=4.release ...........................................   Passed    3.05 sec
            Start  8532: mpi/parallel_partitioner_02.mpirun=4.debug
11316/11561 Test  #8532: mpi/parallel_partitioner_02.mpirun=4.debug .............................................   Passed    2.93 sec
11317/11561 Test  #8535: mpi/parallel_partitioner_03.mpirun=10.release ..........................................   Passed   12.72 sec
            Start  8540: mpi/parallel_partitioner_04.mpirun=10.debug
            Start  8537: mpi/parallel_partitioner_03.mpirun=4.release
11318/11561 Test  #8534: mpi/parallel_partitioner_03.mpirun=10.debug ............................................   Passed   13.76 sec
            Start  8541: mpi/parallel_partitioner_04.mpirun=10.release
11319/11561 Test  #8537: mpi/parallel_partitioner_03.mpirun=4.release ...........................................   Passed    3.14 sec
            Start  8536: mpi/parallel_partitioner_03.mpirun=4.debug
11320/11561 Test  #8536: mpi/parallel_partitioner_03.mpirun=4.debug .............................................   Passed    3.07 sec
11321/11561 Test  #8541: mpi/parallel_partitioner_04.mpirun=10.release ..........................................   Passed   13.00 sec
            Start  8554: mpi/parallel_vector_01.mpirun=10.debug
            Start  8543: mpi/parallel_partitioner_04.mpirun=4.release
11322/11561 Test  #8540: mpi/parallel_partitioner_04.mpirun=10.debug ............................................   Passed   14.34 sec
            Start  8555: mpi/parallel_vector_01.mpirun=10.release
11323/11561 Test  #8543: mpi/parallel_partitioner_04.mpirun=4.release ...........................................   Passed    3.08 sec
            Start  8542: mpi/parallel_partitioner_04.mpirun=4.debug
11324/11561 Test  #8542: mpi/parallel_partitioner_04.mpirun=4.debug .............................................   Passed    3.14 sec
11325/11561 Test  #8555: mpi/parallel_vector_01.mpirun=10.release ...............................................   Passed   12.94 sec
            Start  8558: mpi/parallel_vector_02.mpirun=10.debug
            Start  8557: mpi/parallel_vector_01.mpirun=4.release
11326/11561 Test  #8554: mpi/parallel_vector_01.mpirun=10.debug .................................................   Passed   14.63 sec
            Start  8559: mpi/parallel_vector_02.mpirun=10.release
11327/11561 Test  #8557: mpi/parallel_vector_01.mpirun=4.release ................................................   Passed    3.05 sec
            Start  8556: mpi/parallel_vector_01.mpirun=4.debug
11328/11561 Test  #8556: mpi/parallel_vector_01.mpirun=4.debug ..................................................   Passed    3.13 sec
11329/11561 Test  #8559: mpi/parallel_vector_02.mpirun=10.release ...............................................   Passed   13.11 sec
            Start  8562: mpi/parallel_vector_03.mpirun=10.debug
            Start  8561: mpi/parallel_vector_02.mpirun=4.release
11330/11561 Test  #8558: mpi/parallel_vector_02.mpirun=10.debug .................................................   Passed   14.13 sec
            Start  8563: mpi/parallel_vector_03.mpirun=10.release
11331/11561 Test  #8561: mpi/parallel_vector_02.mpirun=4.release ................................................   Passed    3.09 sec
            Start  8560: mpi/parallel_vector_02.mpirun=4.debug
11332/11561 Test  #8560: mpi/parallel_vector_02.mpirun=4.debug ..................................................   Passed    3.09 sec
11333/11561 Test  #8563: mpi/parallel_vector_03.mpirun=10.release ...............................................   Passed   12.99 sec
            Start  8568: mpi/parallel_vector_04.mpirun=10.debug
            Start  8565: mpi/parallel_vector_03.mpirun=4.release
11334/11561 Test  #8562: mpi/parallel_vector_03.mpirun=10.debug .................................................   Passed   14.25 sec
            Start  8569: mpi/parallel_vector_04.mpirun=10.release
11335/11561 Test  #8565: mpi/parallel_vector_03.mpirun=4.release ................................................   Passed    3.11 sec
            Start  8564: mpi/parallel_vector_03.mpirun=4.debug
11336/11561 Test  #8564: mpi/parallel_vector_03.mpirun=4.debug ..................................................   Passed    3.07 sec
11337/11561 Test  #8569: mpi/parallel_vector_04.mpirun=10.release ...............................................   Passed   13.51 sec
            Start  8572: mpi/parallel_vector_05.mpirun=10.debug
            Start  8571: mpi/parallel_vector_04.mpirun=4.release
11338/11561 Test  #8568: mpi/parallel_vector_04.mpirun=10.debug .................................................   Passed   14.63 sec
            Start  8573: mpi/parallel_vector_05.mpirun=10.release
11339/11561 Test  #8571: mpi/parallel_vector_04.mpirun=4.release ................................................   Passed    2.97 sec
            Start  8570: mpi/parallel_vector_04.mpirun=4.debug
11340/11561 Test  #8570: mpi/parallel_vector_04.mpirun=4.debug ..................................................   Passed    3.15 sec
11341/11561 Test  #8573: mpi/parallel_vector_05.mpirun=10.release ...............................................   Passed   12.58 sec
            Start  8578: mpi/parallel_vector_06.mpirun=10.debug
            Start  8575: mpi/parallel_vector_05.mpirun=4.release
11342/11561 Test  #8572: mpi/parallel_vector_05.mpirun=10.debug .................................................   Passed   14.07 sec
            Start  8579: mpi/parallel_vector_06.mpirun=10.release
11343/11561 Test  #8575: mpi/parallel_vector_05.mpirun=4.release ................................................   Passed    3.22 sec
            Start  8574: mpi/parallel_vector_05.mpirun=4.debug
11344/11561 Test  #8578: mpi/parallel_vector_06.mpirun=10.debug .................................................   Passed    3.44 sec
            Start  8582: mpi/parallel_vector_07.mpirun=10.debug
11345/11561 Test  #8579: mpi/parallel_vector_06.mpirun=10.release ...............................................   Passed    3.25 sec
            Start  8583: mpi/parallel_vector_07.mpirun=10.release
11346/11561 Test  #8574: mpi/parallel_vector_05.mpirun=4.debug ..................................................   Passed    3.16 sec
            Start  8580: mpi/parallel_vector_06.mpirun=4.debug
11347/11561 Test  #8580: mpi/parallel_vector_06.mpirun=4.debug ..................................................   Passed    3.15 sec
            Start  8581: mpi/parallel_vector_06.mpirun=4.release
11348/11561 Test  #8581: mpi/parallel_vector_06.mpirun=4.release ................................................   Passed    2.98 sec
11349/11561 Test  #8582: mpi/parallel_vector_07.mpirun=10.debug .................................................   Passed   13.81 sec
            Start  8586: mpi/parallel_vector_08.mpirun=10.debug
            Start  8584: mpi/parallel_vector_07.mpirun=4.debug
11350/11561 Test  #8583: mpi/parallel_vector_07.mpirun=10.release ...............................................   Passed   12.88 sec
            Start  8587: mpi/parallel_vector_08.mpirun=10.release
11351/11561 Test  #8584: mpi/parallel_vector_07.mpirun=4.debug ..................................................   Passed    3.15 sec
            Start  8585: mpi/parallel_vector_07.mpirun=4.release
11352/11561 Test  #8585: mpi/parallel_vector_07.mpirun=4.release ................................................   Passed    3.05 sec
11353/11561 Test  #8587: mpi/parallel_vector_08.mpirun=10.release ...............................................   Passed   13.05 sec
            Start  8590: mpi/parallel_vector_09.mpirun=10.debug
            Start  8589: mpi/parallel_vector_08.mpirun=4.release
11354/11561 Test  #8586: mpi/parallel_vector_08.mpirun=10.debug .................................................   Passed   14.32 sec
            Start  8591: mpi/parallel_vector_09.mpirun=10.release
11355/11561 Test  #8589: mpi/parallel_vector_08.mpirun=4.release ................................................   Passed    3.07 sec
            Start  8588: mpi/parallel_vector_08.mpirun=4.debug
11356/11561 Test  #8588: mpi/parallel_vector_08.mpirun=4.debug ..................................................   Passed    3.08 sec
11357/11561 Test  #8591: mpi/parallel_vector_09.mpirun=10.release ...............................................   Passed   12.46 sec
            Start  8594: mpi/parallel_vector_10.mpirun=10.debug
            Start  8593: mpi/parallel_vector_09.mpirun=4.release
11358/11561 Test  #8590: mpi/parallel_vector_09.mpirun=10.debug .................................................   Passed   14.17 sec
            Start  8595: mpi/parallel_vector_10.mpirun=10.release
11359/11561 Test  #8593: mpi/parallel_vector_09.mpirun=4.release ................................................   Passed    3.12 sec
            Start  8592: mpi/parallel_vector_09.mpirun=4.debug
11360/11561 Test  #8592: mpi/parallel_vector_09.mpirun=4.debug ..................................................   Passed    3.10 sec
11361/11561 Test  #8595: mpi/parallel_vector_10.mpirun=10.release ...............................................   Passed   13.01 sec
            Start  8598: mpi/parallel_vector_11.mpirun=10.debug
            Start  8597: mpi/parallel_vector_10.mpirun=4.release
11362/11561 Test  #8594: mpi/parallel_vector_10.mpirun=10.debug .................................................   Passed   13.92 sec
            Start  8599: mpi/parallel_vector_11.mpirun=10.release
11363/11561 Test  #8597: mpi/parallel_vector_10.mpirun=4.release ................................................   Passed    2.99 sec
            Start  8596: mpi/parallel_vector_10.mpirun=4.debug
11364/11561 Test  #8596: mpi/parallel_vector_10.mpirun=4.debug ..................................................   Passed    3.10 sec
11365/11561 Test  #8599: mpi/parallel_vector_11.mpirun=10.release ...............................................   Passed   12.47 sec
            Start  8604: mpi/parallel_vector_12.mpirun=10.debug
            Start  8601: mpi/parallel_vector_11.mpirun=4.release
11366/11561 Test  #8598: mpi/parallel_vector_11.mpirun=10.debug .................................................   Passed   13.73 sec
            Start  8605: mpi/parallel_vector_12.mpirun=10.release
11367/11561 Test  #8601: mpi/parallel_vector_11.mpirun=4.release ................................................   Passed    3.12 sec
            Start  8600: mpi/parallel_vector_11.mpirun=4.debug
11368/11561 Test  #8604: mpi/parallel_vector_12.mpirun=10.debug .................................................   Passed    3.36 sec
            Start  8610: mpi/parallel_vector_12a.mpirun=10.debug
11369/11561 Test  #8605: mpi/parallel_vector_12.mpirun=10.release ...............................................   Passed    3.10 sec
            Start  8611: mpi/parallel_vector_12a.mpirun=10.release
11370/11561 Test  #8600: mpi/parallel_vector_11.mpirun=4.debug ..................................................   Passed    3.16 sec
            Start  8606: mpi/parallel_vector_12.mpirun=4.debug
11371/11561 Test  #8610: mpi/parallel_vector_12a.mpirun=10.debug ................................................   Passed    3.28 sec
            Start  8614: mpi/parallel_vector_13.mpirun=10.debug
11372/11561 Test  #8611: mpi/parallel_vector_12a.mpirun=10.release ..............................................   Passed    3.07 sec
            Start  8615: mpi/parallel_vector_13.mpirun=10.release
11373/11561 Test  #8606: mpi/parallel_vector_12.mpirun=4.debug ..................................................   Passed    3.16 sec
            Start  8607: mpi/parallel_vector_12.mpirun=4.release
11374/11561 Test  #8607: mpi/parallel_vector_12.mpirun=4.release ................................................   Passed    2.84 sec
            Start  8612: mpi/parallel_vector_12a.mpirun=4.debug
11375/11561 Test  #8612: mpi/parallel_vector_12a.mpirun=4.debug .................................................   Passed    2.99 sec
            Start  8613: mpi/parallel_vector_12a.mpirun=4.release
11376/11561 Test  #8613: mpi/parallel_vector_12a.mpirun=4.release ...............................................   Passed    3.05 sec
11377/11561 Test  #8615: mpi/parallel_vector_13.mpirun=10.release ...............................................   Passed   12.34 sec
            Start  8630: mpi/parallel_vector_18.mpirun=10.debug
            Start  8617: mpi/parallel_vector_13.mpirun=4.release
11378/11561 Test  #8614: mpi/parallel_vector_13.mpirun=10.debug .................................................   Passed   14.24 sec
            Start  8631: mpi/parallel_vector_18.mpirun=10.release
11379/11561 Test  #8617: mpi/parallel_vector_13.mpirun=4.release ................................................   Passed    3.27 sec
            Start  8616: mpi/parallel_vector_13.mpirun=4.debug
11380/11561 Test  #8630: mpi/parallel_vector_18.mpirun=10.debug .................................................   Passed    3.38 sec
            Start  8636: mpi/parallel_vector_19.mpirun=10.debug
11381/11561 Test  #8631: mpi/parallel_vector_18.mpirun=10.release ...............................................   Passed    3.28 sec
            Start  8637: mpi/parallel_vector_19.mpirun=10.release
11382/11561 Test  #8616: mpi/parallel_vector_13.mpirun=4.debug ..................................................   Passed    3.28 sec
            Start  8632: mpi/parallel_vector_18.mpirun=4.debug
11383/11561 Test  #8636: mpi/parallel_vector_19.mpirun=10.debug .................................................   Passed    3.25 sec
            Start  8644: mpi/parallel_vector_22.mpirun=10.debug
11384/11561 Test  #8637: mpi/parallel_vector_19.mpirun=10.release ...............................................   Passed    3.08 sec
            Start  8645: mpi/parallel_vector_22.mpirun=10.release
11385/11561 Test  #8632: mpi/parallel_vector_18.mpirun=4.debug ..................................................   Passed    3.04 sec
            Start  8633: mpi/parallel_vector_18.mpirun=4.release
11386/11561 Test  #8633: mpi/parallel_vector_18.mpirun=4.release ................................................   Passed    2.99 sec
            Start  8638: mpi/parallel_vector_19.mpirun=4.debug
11387/11561 Test  #8638: mpi/parallel_vector_19.mpirun=4.debug ..................................................   Passed    3.08 sec
            Start  8639: mpi/parallel_vector_19.mpirun=4.release
11388/11561 Test  #8639: mpi/parallel_vector_19.mpirun=4.release ................................................   Passed    3.03 sec
11389/11561 Test  #8645: mpi/parallel_vector_22.mpirun=10.release ...............................................   Passed   12.55 sec
            Start  8706: mpi/refine_and_coarsen_fixed_fraction_01.mpirun=10.debug
            Start  8647: mpi/parallel_vector_22.mpirun=4.release
11390/11561 Test  #8644: mpi/parallel_vector_22.mpirun=10.debug .................................................   Passed   13.84 sec
            Start  8707: mpi/refine_and_coarsen_fixed_fraction_01.mpirun=10.release
11391/11561 Test  #8647: mpi/parallel_vector_22.mpirun=4.release ................................................   Passed    3.02 sec
            Start  8646: mpi/parallel_vector_22.mpirun=4.debug
11392/11561 Test  #8646: mpi/parallel_vector_22.mpirun=4.debug ..................................................   Passed    2.92 sec
11393/11561 Test  #8707: mpi/refine_and_coarsen_fixed_fraction_01.mpirun=10.release .............................   Passed   19.43 sec
            Start  8710: mpi/refine_and_coarsen_fixed_fraction_02.mpirun=10.debug
            Start  8709: mpi/refine_and_coarsen_fixed_fraction_01.mpirun=4.release
11394/11561 Test  #8706: mpi/refine_and_coarsen_fixed_fraction_01.mpirun=10.debug ...............................   Passed   22.64 sec
            Start  8711: mpi/refine_and_coarsen_fixed_fraction_02.mpirun=10.release
11395/11561 Test  #8709: mpi/refine_and_coarsen_fixed_fraction_01.mpirun=4.release ..............................   Passed    3.24 sec
            Start  8708: mpi/refine_and_coarsen_fixed_fraction_01.mpirun=4.debug
11396/11561 Test  #8708: mpi/refine_and_coarsen_fixed_fraction_01.mpirun=4.debug ................................   Passed    3.30 sec
11397/11561 Test  #8711: mpi/refine_and_coarsen_fixed_fraction_02.mpirun=10.release .............................   Passed   19.25 sec
            Start  8714: mpi/refine_and_coarsen_fixed_fraction_03.mpirun=10.debug
            Start  8713: mpi/refine_and_coarsen_fixed_fraction_02.mpirun=4.release
11398/11561 Test  #8710: mpi/refine_and_coarsen_fixed_fraction_02.mpirun=10.debug ...............................   Passed   22.55 sec
            Start  8715: mpi/refine_and_coarsen_fixed_fraction_03.mpirun=10.release
11399/11561 Test  #8713: mpi/refine_and_coarsen_fixed_fraction_02.mpirun=4.release ..............................   Passed    3.17 sec
            Start  8712: mpi/refine_and_coarsen_fixed_fraction_02.mpirun=4.debug
11400/11561 Test  #8712: mpi/refine_and_coarsen_fixed_fraction_02.mpirun=4.debug ................................   Passed    3.06 sec
11401/11561 Test  #8715: mpi/refine_and_coarsen_fixed_fraction_03.mpirun=10.release .............................   Passed   19.03 sec
            Start  8734: mpi/refine_and_coarsen_fixed_number_01.mpirun=10.debug
            Start  8717: mpi/refine_and_coarsen_fixed_fraction_03.mpirun=4.release
11402/11561 Test  #8714: mpi/refine_and_coarsen_fixed_fraction_03.mpirun=10.debug ...............................   Passed   22.56 sec
            Start  8735: mpi/refine_and_coarsen_fixed_number_01.mpirun=10.release
11403/11561 Test  #8717: mpi/refine_and_coarsen_fixed_fraction_03.mpirun=4.release ..............................   Passed    3.18 sec
            Start  8716: mpi/refine_and_coarsen_fixed_fraction_03.mpirun=4.debug
11404/11561 Test  #8716: mpi/refine_and_coarsen_fixed_fraction_03.mpirun=4.debug ................................   Passed    3.21 sec
11405/11561 Test  #8735: mpi/refine_and_coarsen_fixed_number_01.mpirun=10.release ...............................   Passed   19.41 sec
            Start  8738: mpi/refine_and_coarsen_fixed_number_02.mpirun=10.debug
            Start  8737: mpi/refine_and_coarsen_fixed_number_01.mpirun=4.release
11406/11561 Test  #8734: mpi/refine_and_coarsen_fixed_number_01.mpirun=10.debug .................................   Passed   23.14 sec
            Start  8739: mpi/refine_and_coarsen_fixed_number_02.mpirun=10.release
11407/11561 Test  #8737: mpi/refine_and_coarsen_fixed_number_01.mpirun=4.release ................................   Passed    3.19 sec
            Start  8736: mpi/refine_and_coarsen_fixed_number_01.mpirun=4.debug
11408/11561 Test  #8736: mpi/refine_and_coarsen_fixed_number_01.mpirun=4.debug ..................................   Passed    3.27 sec
11409/11561 Test  #8739: mpi/refine_and_coarsen_fixed_number_02.mpirun=10.release ...............................   Passed   19.29 sec
            Start  8742: mpi/refine_and_coarsen_fixed_number_03.mpirun=10.debug
            Start  8741: mpi/refine_and_coarsen_fixed_number_02.mpirun=4.release
11410/11561 Test  #8741: mpi/refine_and_coarsen_fixed_number_02.mpirun=4.release ................................   Passed    3.12 sec
11411/11561 Test  #8738: mpi/refine_and_coarsen_fixed_number_02.mpirun=10.debug .................................   Passed   23.80 sec
            Start  8743: mpi/refine_and_coarsen_fixed_number_03.mpirun=10.release
            Start  8740: mpi/refine_and_coarsen_fixed_number_02.mpirun=4.debug
11412/11561 Test  #8740: mpi/refine_and_coarsen_fixed_number_02.mpirun=4.debug ..................................   Passed    3.16 sec
11413/11561 Test  #8742: mpi/refine_and_coarsen_fixed_number_03.mpirun=10.debug .................................   Passed   22.23 sec
            Start  8752: mpi/refine_and_coarsen_fixed_number_06.mpirun=10.debug
            Start  8744: mpi/refine_and_coarsen_fixed_number_03.mpirun=4.debug
11414/11561 Test  #8743: mpi/refine_and_coarsen_fixed_number_03.mpirun=10.release ...............................   Passed   18.91 sec
            Start  8753: mpi/refine_and_coarsen_fixed_number_06.mpirun=10.release
11415/11561 Test  #8744: mpi/refine_and_coarsen_fixed_number_03.mpirun=4.debug ..................................   Passed    3.40 sec
            Start  8745: mpi/refine_and_coarsen_fixed_number_03.mpirun=4.release
11416/11561 Test  #8752: mpi/refine_and_coarsen_fixed_number_06.mpirun=10.debug .................................   Passed    3.46 sec
            Start  8758: mpi/refine_and_coarsen_fixed_number_07.mpirun=10.debug
11417/11561 Test  #8753: mpi/refine_and_coarsen_fixed_number_06.mpirun=10.release ...............................   Passed    3.15 sec
            Start  8759: mpi/refine_and_coarsen_fixed_number_07.mpirun=10.release
11418/11561 Test  #8745: mpi/refine_and_coarsen_fixed_number_03.mpirun=4.release ................................   Passed    3.30 sec
            Start  8754: mpi/refine_and_coarsen_fixed_number_06.mpirun=4.debug
11419/11561 Test  #8759: mpi/refine_and_coarsen_fixed_number_07.mpirun=10.release ...............................   Passed    6.29 sec
            Start  8788: mpi/renumber_z_order_01.mpirun=10.debug
11420/11561 Test  #8754: mpi/refine_and_coarsen_fixed_number_06.mpirun=4.debug ..................................   Passed    3.86 sec
            Start  8755: mpi/refine_and_coarsen_fixed_number_06.mpirun=4.release
11421/11561 Test  #8758: mpi/refine_and_coarsen_fixed_number_07.mpirun=10.debug .................................   Passed    7.15 sec
            Start  8789: mpi/renumber_z_order_01.mpirun=10.release
11422/11561 Test  #8788: mpi/renumber_z_order_01.mpirun=10.debug ................................................   Passed    3.46 sec
            Start  8794: mpi/renumber_z_order_02.mpirun=10.debug
11423/11561 Test  #8755: mpi/refine_and_coarsen_fixed_number_06.mpirun=4.release ................................   Passed    3.13 sec
            Start  8760: mpi/refine_and_coarsen_fixed_number_07.mpirun=4.debug
11424/11561 Test  #8789: mpi/renumber_z_order_01.mpirun=10.release ..............................................   Passed    3.13 sec
            Start  8795: mpi/renumber_z_order_02.mpirun=10.release
11425/11561 Test  #8795: mpi/renumber_z_order_02.mpirun=10.release ..............................................   Passed    6.10 sec
            Start  8870: mpi/tria_ghost_owners_02.mpirun=11.debug
11426/11561 Test  #8794: mpi/renumber_z_order_02.mpirun=10.debug ................................................   Passed    6.39 sec
            Start  8871: mpi/tria_ghost_owners_02.mpirun=11.release
11427/11561 Test  #8760: mpi/refine_and_coarsen_fixed_number_07.mpirun=4.debug ..................................   Passed    6.65 sec
            Start  8761: mpi/refine_and_coarsen_fixed_number_07.mpirun=4.release
11428/11561 Test  #8761: mpi/refine_and_coarsen_fixed_number_07.mpirun=4.release ................................   Passed    3.05 sec
            Start  8790: mpi/renumber_z_order_01.mpirun=4.debug
11429/11561 Test  #8790: mpi/renumber_z_order_01.mpirun=4.debug .................................................   Passed    3.25 sec
            Start  8791: mpi/renumber_z_order_01.mpirun=4.release
11430/11561 Test  #8791: mpi/renumber_z_order_01.mpirun=4.release ...............................................   Passed    2.91 sec
            Start  8796: mpi/renumber_z_order_02.mpirun=4.debug
11431/11561 Test  #8796: mpi/renumber_z_order_02.mpirun=4.debug .................................................   Passed    3.16 sec
            Start  8797: mpi/renumber_z_order_02.mpirun=4.release
11432/11561 Test  #8797: mpi/renumber_z_order_02.mpirun=4.release ...............................................   Passed    3.03 sec
11433/11561 Test  #8871: mpi/tria_ghost_owners_02.mpirun=11.release .............................................   Passed   19.35 sec
            Start  8876: mpi/tria_signals_01.mpirun=11.debug
            Start  8873: mpi/tria_ghost_owners_02.mpirun=5.release
11434/11561 Test  #8876: mpi/tria_signals_01.mpirun=11.debug ....................................................   Passed    3.62 sec
            Start  8877: mpi/tria_signals_01.mpirun=11.release
11435/11561 Test  #8873: mpi/tria_ghost_owners_02.mpirun=5.release ..............................................   Passed    3.67 sec
            Start  8878: mpi/tria_signals_01.mpirun=4.debug
11436/11561 Test  #8878: mpi/tria_signals_01.mpirun=4.debug .....................................................   Passed    4.73 sec
11437/11561 Test  #8870: mpi/tria_ghost_owners_02.mpirun=11.debug ...............................................   Passed   37.04 sec
            Start  8882: mpi/tria_signals_02.mpirun=11.debug
            Start  8872: mpi/tria_ghost_owners_02.mpirun=5.debug
11438/11561 Test  #8877: mpi/tria_signals_01.mpirun=11.release ..................................................   Passed   14.00 sec
            Start  8883: mpi/tria_signals_02.mpirun=11.release
11439/11561 Test  #8883: mpi/tria_signals_02.mpirun=11.release ..................................................   Passed   14.39 sec
            Start  8888: mpi/tria_signals_03.mpirun=11.debug
11440/11561 Test  #8882: mpi/tria_signals_02.mpirun=11.debug ....................................................   Passed   14.47 sec
            Start  8889: mpi/tria_signals_03.mpirun=11.release
11441/11561 Test  #8872: mpi/tria_ghost_owners_02.mpirun=5.debug ................................................   Passed   22.98 sec
            Start  8879: mpi/tria_signals_01.mpirun=4.release
11442/11561 Test  #8879: mpi/tria_signals_01.mpirun=4.release ...................................................   Passed    7.22 sec
            Start  8884: mpi/tria_signals_02.mpirun=4.debug
11443/11561 Test  #8884: mpi/tria_signals_02.mpirun=4.debug .....................................................   Passed    9.58 sec
            Start  8885: mpi/tria_signals_02.mpirun=4.release
11444/11561 Test  #8889: mpi/tria_signals_03.mpirun=11.release ..................................................   Passed   30.82 sec
            Start  8894: mpi/tria_signals_04.mpirun=11.debug
11445/11561 Test  #8885: mpi/tria_signals_02.mpirun=4.release ...................................................   Passed    5.63 sec
            Start  8891: mpi/tria_signals_03.mpirun=4.release
11446/11561 Test  #8891: mpi/tria_signals_03.mpirun=4.release ...................................................   Passed    8.88 sec
11447/11561 Test  #8888: mpi/tria_signals_03.mpirun=11.debug ....................................................   Passed   93.21 sec
            Start  8895: mpi/tria_signals_04.mpirun=11.release
            Start  8890: mpi/tria_signals_03.mpirun=4.debug
11448/11561 Test  #8895: mpi/tria_signals_04.mpirun=11.release ..................................................   Passed   39.86 sec
            Start  8900: mpi/tria_signals_05.mpirun=11.debug
11449/11561 Test  #8894: mpi/tria_signals_04.mpirun=11.debug ....................................................   Passed  102.35 sec
            Start  8901: mpi/tria_signals_05.mpirun=11.release
11450/11561 Test  #8900: mpi/tria_signals_05.mpirun=11.debug ....................................................   Passed    7.95 sec
            Start  8906: mpi/trilinos_01.mpirun=10.debug
11451/11561 Test  #8901: mpi/tria_signals_05.mpirun=11.release ..................................................   Passed    7.81 sec
            Start  8907: mpi/trilinos_01.mpirun=10.release
11452/11561 Test  #8907: mpi/trilinos_01.mpirun=10.release ......................................................   Passed   15.11 sec
            Start  8910: mpi/trilinos_02.mpirun=10.debug
11453/11561 Test  #8906: mpi/trilinos_01.mpirun=10.debug ........................................................   Passed   18.18 sec
            Start  8911: mpi/trilinos_02.mpirun=10.release
11454/11561 Test  #8910: mpi/trilinos_02.mpirun=10.debug ........................................................   Passed   14.13 sec
            Start  8950: mpi/trilinos_ghost_01.mpirun=10.debug
11455/11561 Test  #8911: mpi/trilinos_02.mpirun=10.release ......................................................   Passed   13.19 sec
            Start  8951: mpi/trilinos_ghost_01.mpirun=10.release
11456/11561 Test  #8890: mpi/tria_signals_03.mpirun=4.debug .....................................................   Passed   81.97 sec
            Start  8896: mpi/tria_signals_04.mpirun=4.debug
11457/11561 Test  #8950: mpi/trilinos_ghost_01.mpirun=10.debug ..................................................   Passed   14.23 sec
            Start  8954: mpi/trilinos_ghost_02.mpirun=10.debug
11458/11561 Test  #8951: mpi/trilinos_ghost_01.mpirun=10.release ................................................   Passed   12.30 sec
            Start  8955: mpi/trilinos_ghost_02.mpirun=10.release
11459/11561 Test  #8955: mpi/trilinos_ghost_02.mpirun=10.release ................................................   Passed   12.77 sec
            Start  8958: mpi/trilinos_ghost_03.mpirun=10.debug
11460/11561 Test  #8954: mpi/trilinos_ghost_02.mpirun=10.debug ..................................................   Passed   14.51 sec
            Start  8960: mpi/trilinos_ghost_03_linfty.mpirun=10.debug
11461/11561 Test  #8958: mpi/trilinos_ghost_03.mpirun=10.debug ..................................................   Passed   14.98 sec
            Start  8962: mpi/trilinos_ghost_05.mpirun=10.debug
11462/11561 Test  #8960: mpi/trilinos_ghost_03_linfty.mpirun=10.debug ...........................................   Passed   14.53 sec
            Start  8963: mpi/trilinos_ghost_05.mpirun=10.release
11463/11561 Test  #8963: mpi/trilinos_ghost_05.mpirun=10.release ................................................   Passed   13.03 sec
            Start  9205: multigrid/transfer_matrix_free_06.mpirun=10.debug
11464/11561 Test  #8962: mpi/trilinos_ghost_05.mpirun=10.debug ..................................................   Passed   14.48 sec
            Start  9206: multigrid/transfer_matrix_free_06.mpirun=10.release
11465/11561 Test  #8896: mpi/tria_signals_04.mpirun=4.debug .....................................................   Passed   59.13 sec
            Start  8897: mpi/tria_signals_04.mpirun=4.release
11466/11561 Test  #8897: mpi/tria_signals_04.mpirun=4.release ...................................................   Passed    4.56 sec
            Start  8902: mpi/tria_signals_05.mpirun=4.debug
11467/11561 Test  #8902: mpi/tria_signals_05.mpirun=4.debug .....................................................   Passed    3.43 sec
            Start  8903: mpi/tria_signals_05.mpirun=4.release
11468/11561 Test  #8903: mpi/tria_signals_05.mpirun=4.release ...................................................   Passed    3.08 sec
            Start  8908: mpi/trilinos_01.mpirun=4.debug
11469/11561 Test  #9206: multigrid/transfer_matrix_free_06.mpirun=10.release ....................................   Passed   23.65 sec
            Start  7436: matrix_free/matrix_vector_faces_16.mpirun=11.debug
11470/11561 Test  #8908: mpi/trilinos_01.mpirun=4.debug .........................................................   Passed    6.09 sec
            Start  8909: mpi/trilinos_01.mpirun=4.release
11471/11561 Test  #8909: mpi/trilinos_01.mpirun=4.release .......................................................   Passed    6.25 sec
            Start  8912: mpi/trilinos_02.mpirun=4.debug
11472/11561 Test  #9205: multigrid/transfer_matrix_free_06.mpirun=10.debug ......................................   Passed   31.36 sec
            Start  7437: matrix_free/matrix_vector_faces_16.mpirun=11.release
11473/11561 Test  #8912: mpi/trilinos_02.mpirun=4.debug .........................................................   Passed    3.19 sec
            Start  8913: mpi/trilinos_02.mpirun=4.release
11474/11561 Test  #8913: mpi/trilinos_02.mpirun=4.release .......................................................   Passed    3.05 sec
            Start  8952: mpi/trilinos_ghost_01.mpirun=4.debug
11475/11561 Test  #8952: mpi/trilinos_ghost_01.mpirun=4.debug ...................................................   Passed    3.03 sec
            Start  8953: mpi/trilinos_ghost_01.mpirun=4.release
11476/11561 Test  #8953: mpi/trilinos_ghost_01.mpirun=4.release .................................................   Passed    3.01 sec
            Start  8956: mpi/trilinos_ghost_02.mpirun=4.debug
11477/11561 Test  #8956: mpi/trilinos_ghost_02.mpirun=4.debug ...................................................   Passed    3.06 sec
            Start  8957: mpi/trilinos_ghost_02.mpirun=4.release
11478/11561 Test  #8957: mpi/trilinos_ghost_02.mpirun=4.release .................................................   Passed    3.03 sec
            Start  8959: mpi/trilinos_ghost_03.mpirun=4.debug
11479/11561 Test  #8959: mpi/trilinos_ghost_03.mpirun=4.debug ...................................................   Passed    3.07 sec
            Start  8961: mpi/trilinos_ghost_03_linfty.mpirun=4.debug
11480/11561 Test  #8961: mpi/trilinos_ghost_03_linfty.mpirun=4.debug ............................................   Passed    3.06 sec
            Start  8964: mpi/trilinos_ghost_05.mpirun=4.debug
11481/11561 Test  #8964: mpi/trilinos_ghost_05.mpirun=4.debug ...................................................   Passed    3.29 sec
            Start  8965: mpi/trilinos_ghost_05.mpirun=4.release
11482/11561 Test  #8965: mpi/trilinos_ghost_05.mpirun=4.release .................................................   Passed    3.09 sec
            Start  9207: multigrid/transfer_matrix_free_06.mpirun=5.debug
11483/11561 Test  #7436: matrix_free/matrix_vector_faces_16.mpirun=11.debug .....................................   Passed   40.86 sec
            Start  8069: mpi/fe_tools_extrapolate_06.mpirun=10.debug
11484/11561 Test  #7437: matrix_free/matrix_vector_faces_16.mpirun=11.release ...................................   Passed   37.07 sec
            Start  8070: mpi/fe_tools_extrapolate_06.mpirun=10.release
11485/11561 Test  #9207: multigrid/transfer_matrix_free_06.mpirun=5.debug .......................................   Passed    7.17 sec
            Start  9208: multigrid/transfer_matrix_free_06.mpirun=5.release
11486/11561 Test  #9208: multigrid/transfer_matrix_free_06.mpirun=5.release .....................................   Passed    1.32 sec
11487/11561 Test  #8069: mpi/fe_tools_extrapolate_06.mpirun=10.debug ............................................   Passed   10.24 sec
            Start  8075: mpi/has_active_dofs_01.mpirun=10.debug
11488/11561 Test  #8070: mpi/fe_tools_extrapolate_06.mpirun=10.release ..........................................   Passed    6.84 sec
            Start  8076: mpi/has_active_dofs_01.mpirun=10.release
11489/11561 Test  #8076: mpi/has_active_dofs_01.mpirun=10.release ...............................................   Passed   20.12 sec
            Start  8077: mpi/has_active_dofs_02.mpirun=10.debug
11490/11561 Test  #8075: mpi/has_active_dofs_01.mpirun=10.debug .................................................   Passed   21.90 sec
            Start  8078: mpi/has_active_dofs_02.mpirun=10.release
11491/11561 Test  #8078: mpi/has_active_dofs_02.mpirun=10.release ...............................................   Passed   16.93 sec
            Start  8161: mpi/hp_unify_dof_indices_09.mpirun=10.debug
11492/11561 Test  #8077: mpi/has_active_dofs_02.mpirun=10.debug .................................................   Passed   19.87 sec
            Start  8162: mpi/hp_unify_dof_indices_09.mpirun=10.release
11493/11561 Test  #8162: mpi/hp_unify_dof_indices_09.mpirun=10.release ..........................................   Passed   19.00 sec
            Start  8275: mpi/mg_05.mpirun=10.debug
11494/11561 Test  #8161: mpi/hp_unify_dof_indices_09.mpirun=10.debug ............................................   Passed   22.38 sec
            Start  8276: mpi/mg_05.mpirun=10.release
11495/11561 Test  #8276: mpi/mg_05.mpirun=10.release ............................................................   Passed   17.93 sec
            Start  8321: mpi/no_flux_constraints_02.mpirun=9.debug
            Start  8679: mpi/periodicity_04.mpirun=7.release
11496/11561 Test  #8275: mpi/mg_05.mpirun=10.debug ..............................................................   Passed   22.05 sec
            Start  8322: mpi/no_flux_constraints_02.mpirun=9.release
11497/11561 Test  #8679: mpi/periodicity_04.mpirun=7.release ....................................................   Passed    4.71 sec
            Start  8325: mpi/no_flux_constraints_03.mpirun=9.debug
11498/11561 Test  #8322: mpi/no_flux_constraints_02.mpirun=9.release ............................................   Passed    9.12 sec
            Start  8326: mpi/no_flux_constraints_03.mpirun=9.release
11499/11561 Test  #8321: mpi/no_flux_constraints_02.mpirun=9.debug ..............................................   Passed   15.57 sec
            Start  8327: mpi/normal_flux_constraints.mpirun=9.debug
11500/11561 Test  #8325: mpi/no_flux_constraints_03.mpirun=9.debug ..............................................   Passed   11.16 sec
            Start  8328: mpi/normal_flux_constraints.mpirun=9.release
11501/11561 Test  #8326: mpi/no_flux_constraints_03.mpirun=9.release ............................................   Passed    5.26 sec
            Start  8472: mpi/p_adaptivity_fixed_number.mpirun=8.debug
11502/11561 Test  #8472: mpi/p_adaptivity_fixed_number.mpirun=8.debug ...........................................   Passed    3.39 sec
            Start  8473: mpi/p_adaptivity_fixed_number.mpirun=8.release
11503/11561 Test  #8473: mpi/p_adaptivity_fixed_number.mpirun=8.release .........................................   Passed    3.01 sec
            Start  8478: mpi/p_refinement_and_coarsening.mpirun=8.debug
11504/11561 Test  #8478: mpi/p_refinement_and_coarsening.mpirun=8.debug .........................................   Passed    3.32 sec
            Start  8479: mpi/p_refinement_and_coarsening.mpirun=8.release
11505/11561 Test  #8479: mpi/p_refinement_and_coarsening.mpirun=8.release .......................................   Passed    3.08 sec
            Start  8680: mpi/periodicity_05.mpirun=9.debug
11506/11561 Test  #8328: mpi/normal_flux_constraints.mpirun=9.release ...........................................   Passed   23.38 sec
            Start  8681: mpi/periodicity_05.mpirun=9.release
11507/11561 Test  #8327: mpi/normal_flux_constraints.mpirun=9.debug .............................................   Passed   33.61 sec
            Start  8700: mpi/point_value_01.mpirun=6.debug
11508/11561 Test  #8700: mpi/point_value_01.mpirun=6.debug ......................................................   Passed    3.23 sec
            Start  8701: mpi/point_value_01.mpirun=6.release
11509/11561 Test  #8701: mpi/point_value_01.mpirun=6.release ....................................................   Passed    3.23 sec
            Start  8838: mpi/step-37.mpirun=7.debug
11510/11561 Test  #8680: mpi/periodicity_05.mpirun=9.debug ......................................................   Passed   27.82 sec
            Start  8524: mpi/parallel_block_vector_13.mpirun=10.debug
11511/11561 Test  #8681: mpi/periodicity_05.mpirun=9.release ....................................................   Passed   24.15 sec
            Start  8839: mpi/step-37.mpirun=7.release
11512/11561 Test  #8839: mpi/step-37.mpirun=7.release ...........................................................   Passed    4.34 sec
            Start  8846: mpi/step-39.mpirun=6.debug
11513/11561 Test  #8524: mpi/parallel_block_vector_13.mpirun=10.debug ...........................................   Passed   17.17 sec
            Start  8525: mpi/parallel_block_vector_13.mpirun=10.release
11514/11561 Test  #8846: mpi/step-39.mpirun=6.debug .............................................................   Passed    8.26 sec
            Start  8847: mpi/step-39.mpirun=6.release
11515/11561 Test  #8847: mpi/step-39.mpirun=6.release ...........................................................   Passed    4.94 sec
            Start  8868: mpi/tria_ghost_owners_01.mpirun=7.debug
11516/11561 Test  #8838: mpi/step-37.mpirun=7.debug .............................................................   Passed   31.08 sec
            Start  8869: mpi/tria_ghost_owners_01.mpirun=7.release
11517/11561 Test  #8525: mpi/parallel_block_vector_13.mpirun=10.release .........................................   Passed   14.03 sec
            Start  8684: mpi/periodicity_07.mpirun=13.debug
11518/11561 Test  #8869: mpi/tria_ghost_owners_01.mpirun=7.release ..............................................   Passed   20.86 sec
            Start  9133: multigrid/step-16-50-mpi.mpirun=7.debug
11519/11561 Test  #9133: multigrid/step-16-50-mpi.mpirun=7.debug ................................................   Passed    4.54 sec
            Start  9134: multigrid/step-16-50-mpi.mpirun=7.release
11520/11561 Test  #9134: multigrid/step-16-50-mpi.mpirun=7.release ..............................................   Passed    1.59 sec
            Start  9183: multigrid/transfer_matrix_free_01.mpirun=7.debug
11521/11561 Test  #8684: mpi/periodicity_07.mpirun=13.debug .....................................................   Passed   51.99 sec
            Start  8685: mpi/periodicity_07.mpirun=13.release
11522/11561 Test  #8868: mpi/tria_ghost_owners_01.mpirun=7.debug ................................................   Passed   64.09 sec
            Start  9184: multigrid/transfer_matrix_free_01.mpirun=7.release
11523/11561 Test  #9184: multigrid/transfer_matrix_free_01.mpirun=7.release .....................................   Passed    2.23 sec
            Start  9199: multigrid/transfer_matrix_free_04.mpirun=7.debug
11524/11561 Test  #9183: multigrid/transfer_matrix_free_01.mpirun=7.debug .......................................   Passed   44.33 sec
            Start  9200: multigrid/transfer_matrix_free_04.mpirun=7.release
11525/11561 Test  #9200: multigrid/transfer_matrix_free_04.mpirun=7.release .....................................   Passed    2.18 sec
11526/11561 Test  #8685: mpi/periodicity_07.mpirun=13.release ...................................................   Passed   41.49 sec
            Start  9022: multigrid/constrained_dofs_02.mpirun=8.debug
            Start  9023: multigrid/constrained_dofs_02.mpirun=8.release
11527/11561 Test  #9023: multigrid/constrained_dofs_02.mpirun=8.release .........................................   Passed    2.21 sec
            Start  9153: multigrid/step-50_01.mpirun=8.debug
11528/11561 Test  #9022: multigrid/constrained_dofs_02.mpirun=8.debug ...........................................   Passed    2.44 sec
            Start  9154: multigrid/step-50_01.mpirun=8.release
11529/11561 Test  #9199: multigrid/transfer_matrix_free_04.mpirun=7.debug .......................................   Passed   36.99 sec
            Start 10252: remote_point_evaluation/remote_point_evaluation_03.mpirun=8.debug
11530/11561 Test  #9154: multigrid/step-50_01.mpirun=8.release ..................................................   Passed    1.75 sec
            Start 10253: remote_point_evaluation/remote_point_evaluation_03.mpirun=8.release
11531/11561 Test  #9153: multigrid/step-50_01.mpirun=8.debug ....................................................   Passed    2.46 sec
            Start 10254: remote_point_evaluation/vector_tools_evaluate_at_points_01.mpirun=8.debug
11532/11561 Test #10254: remote_point_evaluation/vector_tools_evaluate_at_points_01.mpirun=8.debug ..............   Passed   32.52 sec
            Start 10255: remote_point_evaluation/vector_tools_evaluate_at_points_01.mpirun=8.release
11533/11561 Test #10253: remote_point_evaluation/remote_point_evaluation_03.mpirun=8.release ....................   Passed   38.24 sec
            Start 10256: remote_point_evaluation/vector_tools_evaluate_at_points_02.mpirun=8.debug
11534/11561 Test #10252: remote_point_evaluation/remote_point_evaluation_03.mpirun=8.debug ......................   Passed   42.90 sec
            Start 10257: remote_point_evaluation/vector_tools_evaluate_at_points_02.mpirun=8.release
11535/11561 Test #10255: remote_point_evaluation/vector_tools_evaluate_at_points_01.mpirun=8.release ............   Passed   29.04 sec
            Start 11100: trilinos/n_nonzeros_02_parallel.mpirun=9.debug
11536/11561 Test #10256: remote_point_evaluation/vector_tools_evaluate_at_points_02.mpirun=8.debug ..............***Failed   43.27 sec
            Start 11101: trilinos/n_nonzeros_02_parallel.mpirun=9.release
11537/11561 Test #10257: remote_point_evaluation/vector_tools_evaluate_at_points_02.mpirun=8.release ............***Failed   40.69 sec
11538/11561 Test #11100: trilinos/n_nonzeros_02_parallel.mpirun=9.debug .........................................   Passed   21.67 sec
11539/11561 Test #11101: trilinos/n_nonzeros_02_parallel.mpirun=9.release .......................................   Passed   16.62 sec
            Start  8289: mpi/mg_ghost_dofs_periodic_05.mpirun=28.debug
11540/11561 Test  #8289: mpi/mg_ghost_dofs_periodic_05.mpirun=28.debug ..........................................   Passed   46.71 sec
            Start  8290: mpi/mg_ghost_dofs_periodic_05.mpirun=28.release
11541/11561 Test  #8290: mpi/mg_ghost_dofs_periodic_05.mpirun=28.release ........................................   Passed   25.59 sec
            Start  8441: mpi/p4est_3d_refine_04.mpirun=24.debug
11542/11561 Test  #8441: mpi/p4est_3d_refine_04.mpirun=24.debug .................................................   Passed    9.78 sec
            Start  8442: mpi/p4est_3d_refine_04.mpirun=24.release
11543/11561 Test  #8442: mpi/p4est_3d_refine_04.mpirun=24.release ...............................................   Passed    3.61 sec
            Start  8768: mpi/refinement_listener_01.mpirun=20.debug
            Start  8443: mpi/p4est_3d_refine_04.mpirun=4.debug
11544/11561 Test  #8768: mpi/refinement_listener_01.mpirun=20.debug .............................................   Passed    4.42 sec
            Start  8769: mpi/refinement_listener_01.mpirun=20.release
11545/11561 Test  #8769: mpi/refinement_listener_01.mpirun=20.release ...........................................   Passed    3.55 sec
            Start  8774: mpi/refinement_listener_02.mpirun=20.debug
11546/11561 Test  #8443: mpi/p4est_3d_refine_04.mpirun=4.debug ..................................................   Passed    9.92 sec
            Start  8444: mpi/p4est_3d_refine_04.mpirun=4.release
11547/11561 Test  #8774: mpi/refinement_listener_02.mpirun=20.debug .............................................   Passed    4.28 sec
            Start  8775: mpi/refinement_listener_02.mpirun=20.release
11548/11561 Test  #8444: mpi/p4est_3d_refine_04.mpirun=4.release ................................................   Passed    3.55 sec
            Start  8770: mpi/refinement_listener_01.mpirun=4.debug
11549/11561 Test  #8775: mpi/refinement_listener_02.mpirun=20.release ...........................................   Passed    3.38 sec
            Start  9039: multigrid/distribute_bug_01.mpirun=20.debug
11550/11561 Test  #8770: mpi/refinement_listener_01.mpirun=4.debug ..............................................   Passed    4.13 sec
            Start  8771: mpi/refinement_listener_01.mpirun=4.release
11551/11561 Test  #8771: mpi/refinement_listener_01.mpirun=4.release ............................................   Passed    4.20 sec
            Start  8776: mpi/refinement_listener_02.mpirun=4.debug
11552/11561 Test  #9039: multigrid/distribute_bug_01.mpirun=20.debug ............................................   Passed    7.17 sec
            Start  9040: multigrid/distribute_bug_01.mpirun=20.release
11553/11561 Test  #9040: multigrid/distribute_bug_01.mpirun=20.release ..........................................   Passed    1.32 sec
            Start  8291: mpi/mg_ghost_dofs_periodic_05.mpirun=6.debug
            Start  8292: mpi/mg_ghost_dofs_periodic_05.mpirun=6.release
            Start  8777: mpi/refinement_listener_02.mpirun=4.release
11554/11561 Test  #8776: mpi/refinement_listener_02.mpirun=4.debug ..............................................   Passed    4.16 sec
            Start  9041: multigrid/distribute_bug_01.mpirun=6.debug
11555/11561 Test  #8777: mpi/refinement_listener_02.mpirun=4.release ............................................   Passed    4.63 sec
            Start  9042: multigrid/distribute_bug_01.mpirun=6.release
11556/11561 Test  #9041: multigrid/distribute_bug_01.mpirun=6.debug .............................................   Passed    4.06 sec
11557/11561 Test  #8292: mpi/mg_ghost_dofs_periodic_05.mpirun=6.release .........................................   Passed    6.13 sec
11558/11561 Test  #9042: multigrid/distribute_bug_01.mpirun=6.release ...........................................   Passed    1.69 sec
11559/11561 Test  #8291: mpi/mg_ghost_dofs_periodic_05.mpirun=6.debug ...........................................   Passed   22.95 sec
            Start  8297: mpi/mg_ghost_dofs_periodic_07.mpirun=43.debug
11560/11561 Test  #8297: mpi/mg_ghost_dofs_periodic_07.mpirun=43.debug ..........................................   Passed    8.45 sec
            Start  8298: mpi/mg_ghost_dofs_periodic_07.mpirun=43.release
11561/11561 Test  #8298: mpi/mg_ghost_dofs_periodic_07.mpirun=43.release ........................................   Passed    4.55 sec

99% tests passed, 30 tests failed out of 11561

Total Test time (real) = 23598.06 sec

The following tests FAILED:
	2811 - cuda/coefficient_eval.debug (Failed)
	2831 - cuda/cuda_vector_05.debug (Failed)
	2832 - cuda/cuda_vector_05.release (Failed)
	2837 - cuda/matrix_free_matrix_vector_01.debug (Failed)
	2839 - cuda/matrix_free_matrix_vector_02.debug (Failed)
	2841 - cuda/matrix_free_matrix_vector_03.debug (Failed)
	2842 - cuda/matrix_free_matrix_vector_03.release (Failed)
	2843 - cuda/matrix_free_matrix_vector_03b.debug (Failed)
	2844 - cuda/matrix_free_matrix_vector_03b.release (Failed)
	2845 - cuda/matrix_free_matrix_vector_04.debug (Failed)
	2847 - cuda/matrix_free_matrix_vector_05.debug (Failed)
	2848 - cuda/matrix_free_matrix_vector_05.release (Failed)
	2919 - cuda/precondition_03.mpirun=2.debug (Failed)
	2936 - cuda/solver_08.release (Failed)
	3173 - distributed_grids/3d_coarse_grid_02.debug (Failed)
	4862 - fullydistributed_grids/repartitioning_05.mpirun=4.debug (Failed)
	4863 - fullydistributed_grids/repartitioning_05.mpirun=4.release (Failed)
	5661 - hp/distribute_dofs_linear_time.debug (Timeout)
	7474 - matrix_free/matrix_vector_hessians_faces.debug (Failed)
	7475 - matrix_free/matrix_vector_hessians_faces.release (Failed)
	8055 - mpi/fe_tools_extrapolate_01.mpirun=3.debug (Failed)
	8056 - mpi/fe_tools_extrapolate_01.mpirun=3.release (Failed)
	8061 - mpi/fe_tools_extrapolate_03.mpirun=3.debug (Failed)
	8062 - mpi/fe_tools_extrapolate_03.mpirun=3.release (Failed)
	8065 - mpi/fe_tools_extrapolate_04.mpirun=3.debug (Failed)
	8066 - mpi/fe_tools_extrapolate_04.mpirun=3.release (Failed)
	10256 - remote_point_evaluation/vector_tools_evaluate_at_points_02.mpirun=8.debug (Failed)
	10257 - remote_point_evaluation/vector_tools_evaluate_at_points_02.mpirun=8.release (Failed)
	11094 - trilinos/mg_transfer_prebuilt_01.mpirun=1.debug (Failed)
	11095 - trilinos/mg_transfer_prebuilt_01.mpirun=1.release (Failed)
-- Running CTEST_SUBMIT()
	Add file: /home/build/revision.log
	Add file: /home/build/summary.log
	Add file: /home/build/detailed.log
	Add file: /home/build/include/deal.II/base/config.h
Submit files
   Send to group: Continuous
   SubmitURL: https://cdash.43-1.org/submit.php?project=deal.II
   Uploaded: /home/build/Testing/20210830-1358/Update.xml
   Uploaded: /home/build/Testing/20210830-1358/Configure.xml
   Uploaded: /home/build/Testing/20210830-1358/Build.xml
   Error when uploading file: /home/build/Testing/20210830-1358/Test.xml
   Error message was: Operation too slow. Less than 1 bytes/sec transferred the last 120 seconds
   Problems when submitting via HTTP
mv: error writing '/var/jenkins/workspace/deal.II-CUDA11.0/build/tests/matrix_free/stokes_computation.debug/stokes_computation.debug': No space left on device
mv: cannot create directory '/var/jenkins/workspace/deal.II-CUDA11.0/build/tests/matrix_free/stokes_computation.debug/mpirun=4': No space left on device
mv: cannot create directory '/var/jenkins/workspace/deal.II-CUDA11.0/build/tests/matrix_free/compute_diagonal_05.release': No space left on device
mv: cannot create directory '/var/jenkins/workspace/deal.II-CUDA11.0/build/tests/matrix_free/get_functions_multife.debug': No space left on device
mv: cannot create directory '/var/jenkins/workspace/deal.II-CUDA11.0/build/tests/matrix_free/interpolate_quadrature_01.release': No space left on device
mv: cannot create directory '/var/jenkins/workspace/deal.II-CUDA11.0/build/tests/matrix_free/inverse_mass_08.release': No space left on device
mv: cannot create directory '/var/jenkins/workspace/deal.II-CUDA11.0/build/tests/matrix_free/matrix_vector_faces_25.release': No space left on device
mv: cannot create directory '/var/jenkins/workspace/deal.II-CUDA11.0/build/tests/matrix_free/matrix_vector_stokes_qdg0.debug': No space left on device
mv: cannot create directory '/var/jenkins/workspace/deal.II-CUDA11.0/build/tests/matrix_free/evaluate_1d_shape_07.debug': No space left on device
mv: cannot create directory '/var/jenkins/workspace/deal.II-CUDA11.0/build/tests/matrix_free/matrix_free_type_traits.release': No space left on device
mv: cannot create directory '/var/jenkins/workspace/deal.II-CUDA11.0/build/tests/matrix_free/parallel_multigrid_adaptive_01.release': No space left on device
mv: cannot create directory '/var/jenkins/workspace/deal.II-CUDA11.0/build/tests/matrix_free/point_evaluation_07.release': No space left on device
mv: cannot create directory '/var/jenkins/workspace/deal.II-CUDA11.0/build/tests/matrix_free/interpolate_to_mg.debug': No space left on device
mv: cannot create directory '/var/jenkins/workspace/deal.II-CUDA11.0/build/tests/matrix_free/matrix_vector_faces_05.debug': No space left on device
mv: cannot create directory '/var/jenkins/workspace/deal.II-CUDA11.0/build/tests/matrix_free/parallel_multigrid_fullydistributed.debug': No space left on device
mv: cannot create directory '/var/jenkins/workspace/deal.II-CUDA11.0/build/tests/matrix_free/matrix_vector_21.debug': No space left on device
mv: cannot create directory '/var/jenkins/workspace/deal.II-CUDA11.0/build/tests/matrix_free/matrix_vector_hp_no_template.release': No space left on device
mv: cannot create directory '/var/jenkins/workspace/deal.II-CUDA11.0/build/tests/matrix_free/stokes_computation.release': No space left on device
mv: cannot create directory '/var/jenkins/workspace/deal.II-CUDA11.0/build/tests/matrix_free/categorize_by_boundary_ids_01.debug': No space left on device
mv: cannot create directory '/var/jenkins/workspace/deal.II-CUDA11.0/build/tests/matrix_free/evaluate_1d_shape_07.release': No space left on device
mv: cannot create directory '/var/jenkins/workspace/deal.II-CUDA11.0/build/tests/matrix_free/get_functions_multife.release': No space left on device
mv: cannot create directory '/var/jenkins/workspace/deal.II-CUDA11.0/build/tests/matrix_free/inverse_mass_09.debug': No space left on device
mv: cannot create directory '/var/jenkins/workspace/deal.II-CUDA11.0/build/tests/matrix_free/matrix_vector_01.debug': No space left on device
mv: cannot create directory '/var/jenkins/workspace/deal.II-CUDA11.0/build/tests/matrix_free/matrix_vector_stokes_qdg0.release': No space left on device
mv: cannot create directory '/var/jenkins/workspace/deal.II-CUDA11.0/build/tests/matrix_free/point_evaluation_08.debug': No space left on device
mv: cannot create directory '/var/jenkins/workspace/deal.II-CUDA11.0/build/tests/matrix_free/compute_diagonal_06.debug': No space left on device
mv: cannot create directory '/var/jenkins/workspace/deal.II-CUDA11.0/build/tests/matrix_free/matrix_vector_faces_05.release': No space left on device
mv: cannot create directory '/var/jenkins/workspace/deal.II-CUDA11.0/build/tests/matrix_free/matrix_vector_faces_16.debug': No space left on device
mv: cannot create directory '/var/jenkins/workspace/deal.II-CUDA11.0/build/tests/matrix_free/parallel_multigrid_fullydistributed.release': No space left on device
mv: cannot create directory '/var/jenkins/workspace/deal.II-CUDA11.0/build/tests/matrix_free/matrix_vector_stokes_qdg0b.debug': No space left on device
mv: cannot create directory '/var/jenkins/workspace/deal.II-CUDA11.0/build/tests/matrix_free/point_evaluation_08.release': No space left on device
mv: cannot create directory '/var/jenkins/workspace/deal.II-CUDA11.0/build/tests/matrix_free/categorize_by_boundary_ids_01.release': No space left on device
mv: cannot create directory '/var/jenkins/workspace/deal.II-CUDA11.0/build/tests/matrix_free/interpolate_to_mg.release': No space left on device
mv: cannot create directory '/var/jenkins/workspace/deal.II-CUDA11.0/build/tests/matrix_free/matrix_vector_faces_26.debug': No space left on device
mv: cannot create directory '/var/jenkins/workspace/deal.II-CUDA11.0/build/tests/matrix_free/cell_categorization.debug': No space left on device
mv: cannot create directory '/var/jenkins/workspace/deal.II-CUDA11.0/build/tests/matrix_free/loop_boundary.debug': No space left on device
mv: cannot create directory '/var/jenkins/workspace/deal.II-CUDA11.0/build/tests/matrix_free/matrix_vector_01.release': No space left on device
mv: cannot create directory '/var/jenkins/workspace/deal.II-CUDA11.0/build/tests/matrix_free/matrix_vector_faces_06.debug': No space left on device
mv: cannot create directory '/var/jenkins/workspace/deal.II-CUDA11.0/build/tests/matrix_free/matrix_vector_stokes_qdg0b.release': No space left on device
mv: cannot create directory '/var/jenkins/workspace/deal.II-CUDA11.0/build/tests/matrix_free/point_evaluation_09.debug': No space left on device
mv: cannot create directory '/var/jenkins/workspace/deal.II-CUDA11.0/build/tests/matrix_free/inverse_mass_09.release': No space left on device
mv: cannot create directory '/var/jenkins/workspace/deal.II-CUDA11.0/build/tests/matrix_free/matrix_vector_12.debug': No space left on device
mv: cannot create directory '/var/jenkins/workspace/deal.II-CUDA11.0/build/tests/matrix_free/matrix_vector_21.release': No space left on device
mv: cannot create directory '/var/jenkins/workspace/deal.II-CUDA11.0/build/tests/matrix_free/quadrature_points.debug': No space left on device
mv: cannot create directory '/var/jenkins/workspace/deal.II-CUDA11.0/build/tests/matrix_free/tensor_product_evaluate_01.debug': No space left on device
mv: cannot create directory '/var/jenkins/workspace/deal.II-CUDA11.0/build/tests/matrix_free/cell_categorization.release': No space left on device
mv: cannot create directory '/var/jenkins/workspace/deal.II-CUDA11.0/build/tests/matrix_free/compute_diagonal_06.release': No space left on device
mv: cannot create directory '/var/jenkins/workspace/deal.II-CUDA11.0/build/tests/matrix_free/evaluate_1d_shape_08.debug': No space left on device
mv: cannot create directory '/var/jenkins/workspace/deal.II-CUDA11.0/build/tests/matrix_free/get_functions_multife2.debug': No space left on device
mv: cannot create directory '/var/jenkins/workspace/deal.II-CUDA11.0/build/tests/matrix_free/matrix_vector_hp_parallel_01.debug': No space left on device
mv: cannot create directory '/var/jenkins/workspace/deal.II-CUDA11.0/build/tests/matrix_free/point_evaluation_09.release': No space left on device
mv: cannot create directory '/var/jenkins/workspace/deal.II-CUDA11.0/build/tests/matrix_free/matrix_vector_02.debug': No space left on device
mv: cannot create directory '/var/jenkins/workspace/deal.II-CUDA11.0/build/tests/matrix_free/matrix_vector_faces_06.release': No space left on device
mv: cannot create directory '/var/jenkins/workspace/deal.II-CUDA11.0/build/tests/matrix_free/matrix_vector_faces_16.release': No space left on device
mv: cannot create directory '/var/jenkins/workspace/deal.II-CUDA11.0/build/tests/matrix_free/parallel_multigrid_mf.debug': No space left on device
mv: cannot create directory '/var/jenkins/workspace/deal.II-CUDA11.0/build/tests/matrix_free/get_functions_multife2.release': No space left on device
mv: cannot create directory '/var/jenkins/workspace/deal.II-CUDA11.0/build/tests/matrix_free/matrix_vector_12.release': No space left on device
mv: cannot create directory '/var/jenkins/workspace/deal.II-CUDA11.0/build/tests/matrix_free/multigrid_dg_periodic.debug': No space left on device
mv: cannot create directory '/var/jenkins/workspace/deal.II-CUDA11.0/build/tests/matrix_free/quadrature_points.release': No space left on device
mv: cannot create directory '/var/jenkins/workspace/deal.II-CUDA11.0/build/tests/matrix_free/copy.debug': No space left on device
mv: cannot create directory '/var/jenkins/workspace/deal.II-CUDA11.0/build/tests/matrix_free/evaluate_1d_shape_08.release': No space left on device
mv: cannot create directory '/var/jenkins/workspace/deal.II-CUDA11.0/build/tests/matrix_free/matrix_vector_faces_26.release': No space left on device
mv: cannot create directory '/var/jenkins/workspace/deal.II-CUDA11.0/build/tests/matrix_free/matrix_vector_hp_parallel_01.release': No space left on device
mv: cannot create directory '/var/jenkins/workspace/deal.II-CUDA11.0/build/tests/matrix_free/cell_categorization_02.debug': No space left on device
mv: cannot create directory '/var/jenkins/workspace/deal.II-CUDA11.0/build/tests/matrix_free/matrix_vector_02.release': No space left on device
mv: cannot create directory '/var/jenkins/workspace/deal.II-CUDA11.0/build/tests/matrix_free/parallel_multigrid_mf.release': No space left on device
mv: cannot create directory '/var/jenkins/workspace/deal.II-CUDA11.0/build/tests/matrix_free/point_evaluation_10.debug': No space left on device
mv: cannot create directory '/var/jenkins/workspace/deal.II-CUDA11.0/build/tests/matrix_free/tensor_product_evaluate_01.release': No space left on device
mv: cannot create directory '/var/jenkins/workspace/deal.II-CUDA11.0/build/tests/matrix_free/copy.release': No space left on device
mv: cannot create directory '/var/jenkins/workspace/deal.II-CUDA11.0/build/tests/matrix_free/is_supported_01.debug': No space left on device
mv: cannot create directory '/var/jenkins/workspace/deal.II-CUDA11.0/build/tests/matrix_free/matrix_vector_22.debug': No space left on device
mv: cannot create directory '/var/jenkins/workspace/deal.II-CUDA11.0/build/tests/matrix_free/get_functions_notempl.debug': No space left on device
mv: cannot create directory '/var/jenkins/workspace/deal.II-CUDA11.0/build/tests/matrix_free/loop_boundary.release': No space left on device
mv: cannot create directory '/var/jenkins/workspace/deal.II-CUDA11.0/build/tests/matrix_free/matrix_vector_03.debug': No space left on device
mv: cannot create directory '/var/jenkins/workspace/deal.II-CUDA11.0/build/tests/matrix_free/matrix_vector_faces_07.debug': No space left on device
mv: cannot create directory '/var/jenkins/workspace/deal.II-CUDA11.0/build/tests/matrix_free/matrix_vector_faces_27.debug': No space left on device
mv: cannot create directory '/var/jenkins/workspace/deal.II-CUDA11.0/build/tests/matrix_free/multigrid_dg_periodic.release': No space left on device
mv: cannot create directory '/var/jenkins/workspace/deal.II-CUDA11.0/build/tests/matrix_free/parallel_multigrid_adaptive_02.debug': No space left on device
mv: cannot create directory '/var/jenkins/workspace/deal.II-CUDA11.0/build/tests/matrix_free/read_cell_data_01.debug': No space left on device
mv: cannot create directory '/var/jenkins/workspace/deal.II-CUDA11.0/build/tests/matrix_free/cell_categorization_02.release': No space left on device
mv: cannot create directory '/var/jenkins/workspace/deal.II-CUDA11.0/build/tests/matrix_free/copy_feevaluation.debug': No space left on device
mv: cannot create directory '/var/jenkins/workspace/deal.II-CUDA11.0/build/tests/matrix_free/point_evaluation_10.release': No space left on device
mv: cannot create directory '/var/jenkins/workspace/deal.II-CUDA11.0/build/tests/matrix_free/matrix_vector_03.release': No space left on device
mv: cannot create directory '/var/jenkins/workspace/deal.II-CUDA11.0/build/tests/matrix_free/tensor_product_evaluate_02.debug': No space left on device
mv: cannot create directory '/var/jenkins/workspace/deal.II-CUDA11.0/build/tests/matrix_free/copy_feevaluation.release': No space left on device
mv: cannot create directory '/var/jenkins/workspace/deal.II-CUDA11.0/build/tests/matrix_free/evaluate_1d_shape_09.debug': No space left on device
mv: cannot create directory '/var/jenkins/workspace/deal.II-CUDA11.0/build/tests/matrix_free/get_functions_notempl.release': No space left on device
mv: cannot create directory '/var/jenkins/workspace/deal.II-CUDA11.0/build/tests/matrix_free/is_supported_01.release': No space left on device
mv: cannot create directory '/var/jenkins/workspace/deal.II-CUDA11.0/build/tests/matrix_free/matrix_vector_faces_07.release': No space left on device
mv: cannot create directory '/var/jenkins/workspace/deal.II-CUDA11.0/build/tests/matrix_free/parallel_multigrid_mf_02.debug': No space left on device
mv: cannot create directory '/var/jenkins/workspace/deal.II-CUDA11.0/build/tests/matrix_free/matrix_vector_04.debug': No space left on device
mv: cannot create directory '/var/jenkins/workspace/deal.II-CUDA11.0/build/tests/matrix_free/matrix_vector_22.release': No space left on device
mv: cannot create directory '/var/jenkins/workspace/deal.II-CUDA11.0/build/tests/matrix_free/matrix_vector_faces_27.release': No space left on device
mv: cannot create directory '/var/jenkins/workspace/deal.II-CUDA11.0/build/tests/matrix_free/parallel_multigrid_adaptive_02.release': No space left on device
mv: cannot create directory '/var/jenkins/workspace/deal.II-CUDA11.0/build/tests/matrix_free/read_cell_data_01.release': No space left on device
mv: cannot create directory '/var/jenkins/workspace/deal.II-CUDA11.0/build/tests/matrix_free/tensor_product_evaluate_02.release': No space left on device
mv: cannot create directory '/var/jenkins/workspace/deal.II-CUDA11.0/build/tests/matrix_free/dg_pbc_01.debug': No space left on device
mv: cannot create directory '/var/jenkins/workspace/deal.II-CUDA11.0/build/tests/matrix_free/evaluate_1d_shape_09.release': No space left on device
mv: cannot create directory '/var/jenkins/workspace/deal.II-CUDA11.0/build/tests/matrix_free/matrix_vector_large_degree_01.debug': No space left on device
mv: cannot create directory '/var/jenkins/workspace/deal.II-CUDA11.0/build/tests/matrix_free/point_evaluation_11.debug': No space left on device
mv: cannot create directory '/var/jenkins/workspace/deal.II-CUDA11.0/build/tests/matrix_free/iterators.debug': No space left on device
mv: cannot create directory '/var/jenkins/workspace/deal.II-CUDA11.0/build/tests/matrix_free/matrix_vector_faces_08.debug': No space left on device
mv: cannot create directory '/var/jenkins/workspace/deal.II-CUDA11.0/build/tests/matrix_free/parallel_multigrid_mf_02.release': No space left on device
mv: cannot create directory '/var/jenkins/workspace/deal.II-CUDA11.0/build/tests/matrix_free/read_cell_data_02.debug': No space left on device
mv: cannot create directory '/var/jenkins/workspace/deal.II-CUDA11.0/build/tests/matrix_free/dg_pbc_01.release': No space left on device
mv: cannot create directory '/var/jenkins/workspace/deal.II-CUDA11.0/build/tests/matrix_free/face_setup_01.debug': No space left on device
mv: cannot create directory '/var/jenkins/workspace/deal.II-CUDA11.0/build/tests/matrix_free/matrix_vector_04.release': No space left on device
mv: cannot create directory '/var/jenkins/workspace/deal.II-CUDA11.0/build/tests/matrix_free/tensor_product_evaluate_03.debug': No space left on device
mv: cannot create regular file '/var/jenkins/workspace/deal.II-CUDA11.0/build/tests/matrix_free/CMakeCache.txt': No space left on device
mv: cannot create regular file '/var/jenkins/workspace/deal.II-CUDA11.0/build/tests/matrix_free/Makefile': No space left on device
mv: cannot create regular file '/var/jenkins/workspace/deal.II-CUDA11.0/build/tests/matrix_free/cmake_install.cmake': No space left on device
mv: cannot create regular file '/var/jenkins/workspace/deal.II-CUDA11.0/build/tests/matrix_free/CTestTestfile.cmake': No space left on device
mv: cannot create directory '/var/jenkins/workspace/deal.II-CUDA11.0/build/tests/matrix_free/matrix_vector_large_degree_01.release': No space left on device
mv: cannot create directory '/var/jenkins/workspace/deal.II-CUDA11.0/build/tests/matrix_free/face_setup_01.release': No space left on device
mv: cannot create directory '/var/jenkins/workspace/deal.II-CUDA11.0/build/tests/matrix_free/get_functions_q_hierarchical.debug': No space left on device
mv: cannot create directory '/var/jenkins/workspace/deal.II-CUDA11.0/build/tests/matrix_free/matrix_vector_23.debug': No space left on device
mv: cannot create directory '/var/jenkins/workspace/deal.II-CUDA11.0/build/tests/matrix_free/matrix_vector_faces_08.release': No space left on device
mv: cannot create directory '/var/jenkins/workspace/deal.II-CUDA11.0/build/tests/matrix_free/matrix_vector_faces_28.debug': No space left on device
mv: cannot create directory '/var/jenkins/workspace/deal.II-CUDA11.0/build/tests/matrix_free/inverse_mass_01.debug': No space left on device
mv: cannot create directory '/var/jenkins/workspace/deal.II-CUDA11.0/build/tests/matrix_free/iterators.release': No space left on device
mv: cannot create directory '/var/jenkins/workspace/deal.II-CUDA11.0/build/tests/matrix_free/matrix_vector_04b.debug': No space left on device
mv: cannot create directory '/var/jenkins/workspace/deal.II-CUDA11.0/build/tests/matrix_free/matrix_vector_faces_17.debug': No space left on device
mv: cannot create directory '/var/jenkins/workspace/deal.II-CUDA11.0/build/tests/matrix_free/point_evaluation_11.release': No space left on device
mv: cannot create directory '/var/jenkins/workspace/deal.II-CUDA11.0/build/tests/matrix_free/read_cell_data_02.release': No space left on device
mv: cannot create directory '/var/jenkins/workspace/deal.II-CUDA11.0/build/tests/matrix_free/tensor_product_evaluate_03.release': No space left on device
mv: cannot create directory '/var/jenkins/workspace/deal.II-CUDA11.0/build/tests/matrix_free/get_functions_q_hierarchical.release': No space left on device
mv: cannot create directory '/var/jenkins/workspace/deal.II-CUDA11.0/build/tests/matrix_free/matrix_vector_04b.release': No space left on device
mv: cannot create directory '/var/jenkins/workspace/deal.II-CUDA11.0/build/tests/matrix_free/cell_level_and_index.debug': No space left on device
mv: cannot create directory '/var/jenkins/workspace/deal.II-CUDA11.0/build/tests/matrix_free/dg_pbc_02.debug': No space left on device
mv: cannot create directory '/var/jenkins/workspace/deal.II-CUDA11.0/build/tests/matrix_free/matrix_vector_13.debug': No space left on device
mv: cannot create directory '/var/jenkins/workspace/deal.II-CUDA11.0/build/tests/matrix_free/matrix_vector_23.release': No space left on device
mv: cannot create directory '/var/jenkins/workspace/deal.II-CUDA11.0/build/tests/matrix_free/matrix_vector_faces_09.debug': No space left on device
mv: cannot create directory '/var/jenkins/workspace/deal.II-CUDA11.0/build/tests/matrix_free/partitioner_01.debug': No space left on device
mv: cannot create directory '/var/jenkins/workspace/deal.II-CUDA11.0/build/tests/matrix_free/get_functions_rect.debug': No space left on device
mv: cannot create directory '/var/jenkins/workspace/deal.II-CUDA11.0/build/tests/matrix_free/inverse_mass_01.release': No space left on device
mv: cannot create directory '/var/jenkins/workspace/deal.II-CUDA11.0/build/tests/matrix_free/matrix_vector_faces_28.release': No space left on device
mv: cannot create directory '/var/jenkins/workspace/deal.II-CUDA11.0/build/tests/matrix_free/matrix_vector_large_degree_02.debug': No space left on device
mv: cannot create directory '/var/jenkins/workspace/deal.II-CUDA11.0/build/tests/matrix_free/dg_pbc_02.release': No space left on device
mv: cannot create directory '/var/jenkins/workspace/deal.II-CUDA11.0/build/tests/matrix_free/faces_value_optimization.debug': No space left on device
mv: cannot create directory '/var/jenkins/workspace/deal.II-CUDA11.0/build/tests/matrix_free/matrix_vector_faces_09.release': No space left on device
mv: cannot create directory '/var/jenkins/workspace/deal.II-CUDA11.0/build/tests/matrix_free/matrix_vector_faces_17.release': No space left on device
mv: cannot create directory '/var/jenkins/workspace/deal.II-CUDA11.0/build/tests/matrix_free/parallel_multigrid_adaptive_03.debug': No space left on device
mv: cannot create directory '/var/jenkins/workspace/deal.II-CUDA11.0/build/tests/matrix_free/point_evaluation_12.debug': No space left on device
mv: cannot create directory '/var/jenkins/workspace/deal.II-CUDA11.0/build/tests/matrix_free/tensor_product_evaluate_04.debug': No space left on device
mv: cannot create directory '/var/jenkins/workspace/deal.II-CUDA11.0/build/tests/matrix_free/cell_level_and_index.release': No space left on device
mv: cannot create directory '/var/jenkins/workspace/deal.II-CUDA11.0/build/tests/matrix_free/jxw_values.debug': No space left on device
mv: cannot create directory '/var/jenkins/workspace/deal.II-CUDA11.0/build/tests/matrix_free/loop_boundary_02.debug': No space left on device
mv: cannot create directory '/var/jenkins/workspace/deal.II-CUDA11.0/build/tests/matrix_free/matrix_vector_05.debug': No space left on device
mv: cannot create directory '/var/jenkins/workspace/deal.II-CUDA11.0/build/tests/matrix_free/matrix_vector_13.release': No space left on device
mv: cannot create directory '/var/jenkins/workspace/deal.II-CUDA11.0/build/tests/matrix_free/matrix_vector_24.debug': No space left on device
mv: cannot create directory '/var/jenkins/workspace/deal.II-CUDA11.0/build/tests/matrix_free/faces_value_optimization.release': No space left on device
mv: cannot create directory '/var/jenkins/workspace/deal.II-CUDA11.0/build/tests/matrix_free/get_functions_rect.release': No space left on device
mv: cannot create directory '/var/jenkins/workspace/deal.II-CUDA11.0/build/tests/matrix_free/inverse_mass_02.debug': No space left on device
mv: cannot create directory '/var/jenkins/workspace/deal.II-CUDA11.0/build/tests/matrix_free/loop_boundary_02.release': No space left on device
mv: cannot create directory '/var/jenkins/workspace/deal.II-CUDA11.0/build/tests/matrix_free/matrix_vector_faces_10.debug': No space left on device
mv: cannot create directory '/var/jenkins/workspace/deal.II-CUDA11.0/build/tests/matrix_free/matrix_vector_large_degree_02.release': No space left on device
mv: cannot create directory '/var/jenkins/workspace/deal.II-CUDA11.0/build/tests/matrix_free/partitioner_01.release': No space left on device
mv: cannot create directory '/var/jenkins/workspace/deal.II-CUDA11.0/build/tests/matrix_free/point_evaluation_12.release': No space left on device
mv: cannot create directory '/var/jenkins/workspace/deal.II-CUDA11.0/build/tests/matrix_free/shape_info.debug': No space left on device
mv: cannot create directory '/var/jenkins/workspace/deal.II-CUDA11.0/build/tests/matrix_free/matrix_vector_05.release': No space left on device
mv: cannot create directory '/var/jenkins/workspace/deal.II-CUDA11.0/build/tests/matrix_free/matrix_vector_24.release': No space left on device
mv: cannot create directory '/var/jenkins/workspace/deal.II-CUDA11.0/build/tests/matrix_free/matrix_vector_faces_29.debug': No space left on device
mv: cannot create directory '/var/jenkins/workspace/deal.II-CUDA11.0/build/tests/matrix_free/mapping_info_01.debug': No space left on device
mv: cannot create directory '/var/jenkins/workspace/deal.II-CUDA11.0/build/tests/matrix_free/matrix_vector_faces_18.debug': No space left on device
mv: cannot create directory '/var/jenkins/workspace/deal.II-CUDA11.0/build/tests/matrix_free/parallel_multigrid_adaptive_03.release': No space left on device
mv: cannot create directory '/var/jenkins/workspace/deal.II-CUDA11.0/build/tests/matrix_free/tensor_product_evaluate_04.release': No space left on device
mv: cannot create directory '/var/jenkins/workspace/deal.II-CUDA11.0/build/tests/matrix_free/faces_value_optimization_02.debug': No space left on device
mv: cannot create directory '/var/jenkins/workspace/deal.II-CUDA11.0/build/tests/matrix_free/mapping_info_01.release': No space left on device
mv: cannot create directory '/var/jenkins/workspace/deal.II-CUDA11.0/build/tests/matrix_free/matrix_vector_large_degree_03.debug': No space left on device
mv: cannot create directory '/var/jenkins/workspace/deal.II-CUDA11.0/build/tests/matrix_free/multigrid_dg_sip_01.debug': No space left on device
mv: cannot create directory '/var/jenkins/workspace/deal.II-CUDA11.0/build/tests/matrix_free/pre_and_post_loops_01.debug': No space left on device
mv: cannot create directory '/var/jenkins/workspace/deal.II-CUDA11.0/build/tests/matrix_free/get_functions_variants.debug': No space left on device
mv: cannot create directory '/var/jenkins/workspace/deal.II-CUDA11.0/build/tests/matrix_free/matrix_vector_blocks.debug': No space left on device
mv: cannot create directory '/var/jenkins/workspace/deal.II-CUDA11.0/build/tests/matrix_free/partitioner_02.debug': No space left on device
mv: cannot create directory '/var/jenkins/workspace/deal.II-CUDA11.0/build/tests/matrix_free/inverse_mass_02.release': No space left on device
mv: cannot create directory '/var/jenkins/workspace/deal.II-CUDA11.0/build/tests/matrix_free/jxw_values.release': No space left on device
mv: cannot create directory '/var/jenkins/workspace/deal.II-CUDA11.0/build/tests/matrix_free/matrix_vector_06.debug': No space left on device
mv: cannot create directory '/var/jenkins/workspace/deal.II-CUDA11.0/build/tests/matrix_free/matrix_vector_faces_18.release': No space left on device
mv: cannot create directory '/var/jenkins/workspace/deal.II-CUDA11.0/build/tests/matrix_free/matrix_vector_faces_29.release': No space left on device
mv: cannot create directory '/var/jenkins/workspace/deal.II-CUDA11.0/build/tests/matrix_free/matrix_vector_large_degree_03.release': No space left on device
mv: cannot create directory '/var/jenkins/workspace/deal.II-CUDA11.0/build/tests/matrix_free/compare_faces_by_cells.debug': No space left on device
mv: cannot create directory '/var/jenkins/workspace/deal.II-CUDA11.0/build/tests/matrix_free/dof_info_01.debug': No space left on device
mv: cannot create directory '/var/jenkins/workspace/deal.II-CUDA11.0/build/tests/matrix_free/faces_value_optimization_02.release': No space left on device
mv: cannot create directory '/var/jenkins/workspace/deal.II-CUDA11.0/build/tests/matrix_free/mass_operator_01.debug': No space left on device
mv: cannot create directory '/var/jenkins/workspace/deal.II-CUDA11.0/build/tests/matrix_free/shape_info.release': No space left on device
mv: cannot create directory '/var/jenkins/workspace/deal.II-CUDA11.0/build/tests/matrix_free/get_functions_variants.release': No space left on device
mv: cannot create directory '/var/jenkins/workspace/deal.II-CUDA11.0/build/tests/matrix_free/matrix_vector_faces_10.release': No space left on device
mv: cannot create directory '/var/jenkins/workspace/deal.II-CUDA11.0/build/tests/matrix_free/parallel_multigrid_adaptive_04.debug': No space left on device
mv: cannot create directory '/var/jenkins/workspace/deal.II-CUDA11.0/build/tests/matrix_free/partitioner_02.release': No space left on device
mv: cannot create directory '/var/jenkins/workspace/deal.II-CUDA11.0/build/tests/matrix_free/pre_and_post_loops_01.release': No space left on device
mv: cannot create directory '/var/jenkins/workspace/deal.II-CUDA11.0/build/tests/matrix_free/fe_evaluation_access_1d.debug': No space left on device
mv: cannot create directory '/var/jenkins/workspace/deal.II-CUDA11.0/build/tests/matrix_free/matrix_vector_blocks.release': No space left on device
mv: cannot create directory '/var/jenkins/workspace/deal.II-CUDA11.0/build/tests/matrix_free/matrix_vector_faces_30.debug': No space left on device
mv: cannot create directory '/var/jenkins/workspace/deal.II-CUDA11.0/build/tests/matrix_free/matrix_vector_06.release': No space left on device
mv: cannot create directory '/var/jenkins/workspace/deal.II-CUDA11.0/build/tests/matrix_free/matrix_vector_faces_19.debug': No space left on device
mv: cannot create directory '/var/jenkins/workspace/deal.II-CUDA11.0/build/tests/matrix_free/pbc_orientation_01.debug': No space left on device
mv: cannot create directory '/var/jenkins/workspace/deal.II-CUDA11.0/build/tests/matrix_free/mass_operator_01.release': No space left on device
mv: cannot create directory '/var/jenkins/workspace/deal.II-CUDA11.0/build/tests/matrix_free/dof_info_01.release': No space left on device
mv: cannot create directory '/var/jenkins/workspace/deal.II-CUDA11.0/build/tests/matrix_free/inverse_mass_03.debug': No space left on device
mv: cannot create directory '/var/jenkins/workspace/deal.II-CUDA11.0/build/tests/matrix_free/laplace_operator_01.debug': No space left on device
mv: cannot create directory '/var/jenkins/workspace/deal.II-CUDA11.0/build/tests/matrix_free/matrix_vector_06_notempl.debug': No space left on device
mv: cannot create directory '/var/jenkins/workspace/deal.II-CUDA11.0/build/tests/matrix_free/matrix_vector_mg.debug': No space left on device
mv: cannot create directory '/var/jenkins/workspace/deal.II-CUDA11.0/build/tests/matrix_free/multigrid_dg_sip_01.release': No space left on device
mv: cannot create directory '/var/jenkins/workspace/deal.II-CUDA11.0/build/tests/matrix_free/pbc_orientation_01.release': No space left on device
mv: cannot create directory '/var/jenkins/workspace/deal.II-CUDA11.0/build/tests/matrix_free/shape_info_inverse.debug': No space left on device
mv: cannot create directory '/var/jenkins/workspace/deal.II-CUDA11.0/build/tests/matrix_free/compare_faces_by_cells.release': No space left on device
mv: cannot create directory '/var/jenkins/workspace/deal.II-CUDA11.0/build/tests/matrix_free/get_functions_variants_gl.debug': No space left on device
mv: cannot create directory '/var/jenkins/workspace/deal.II-CUDA11.0/build/tests/matrix_free/matrix_vector_faces_30.release': No space left on device
mv: cannot create directory '/var/jenkins/workspace/deal.II-CUDA11.0/build/tests/matrix_free/parallel_multigrid_adaptive_04.release': No space left on device
mv: cannot create directory '/var/jenkins/workspace/deal.II-CUDA11.0/build/tests/matrix_free/fe_evaluation_access_1d.release': No space left on device
mv: cannot create directory '/var/jenkins/workspace/deal.II-CUDA11.0/build/tests/matrix_free/get_functions_variants_gl.release': No space left on device
mv: cannot create directory '/var/jenkins/workspace/deal.II-CUDA11.0/build/tests/matrix_free/matrix_vector_06_notempl.release': No space left on device
mv: cannot create directory '/var/jenkins/workspace/deal.II-CUDA11.0/build/tests/matrix_free/matrix_vector_14.debug': No space left on device
mv: cannot create directory '/var/jenkins/workspace/deal.II-CUDA11.0/build/tests/matrix_free/matrix_vector_faces_11.debug': No space left on device
mv: cannot create directory '/var/jenkins/workspace/deal.II-CUDA11.0/build/tests/matrix_free/matrix_vector_faces_19.release': No space left on device
mv: cannot create directory '/var/jenkins/workspace/deal.II-CUDA11.0/build/tests/matrix_free/matrix_vector_mg.release': No space left on device
mv: cannot create directory '/var/jenkins/workspace/deal.II-CUDA11.0/build/tests/matrix_free/point_evaluation_01.debug': No space left on device
mv: cannot create directory '/var/jenkins/workspace/deal.II-CUDA11.0/build/tests/matrix_free/shape_info_inverse.release': No space left on device
mv: cannot create directory '/var/jenkins/workspace/deal.II-CUDA11.0/build/tests/matrix_free/fe_evaluation_dofs_per_cell.debug': No space left on device
mv: cannot create directory '/var/jenkins/workspace/deal.II-CUDA11.0/build/tests/matrix_free/inverse_mass_03.release': No space left on device
mv: cannot create directory '/var/jenkins/workspace/deal.II-CUDA11.0/build/tests/matrix_free/matrix_vector_07.debug': No space left on device
mv: cannot create directory '/var/jenkins/workspace/deal.II-CUDA11.0/build/tests/matrix_free/matrix_vector_stokes.debug': No space left on device
mv: cannot create directory '/var/jenkins/workspace/deal.II-CUDA11.0/build/tests/matrix_free/thread_correctness.debug': No space left on device
mv: cannot create directory '/var/jenkins/workspace/deal.II-CUDA11.0/build/tests/matrix_free/get_values_plain.debug': No space left on device
mv: cannot create directory '/var/jenkins/workspace/deal.II-CUDA11.0/build/tests/matrix_free/laplace_operator_01.release': No space left on device
mv: cannot create directory '/var/jenkins/workspace/deal.II-CUDA11.0/build/tests/matrix_free/matrix_vector_curl.debug': No space left on device
mv: cannot create directory '/var/jenkins/workspace/deal.II-CUDA11.0/build/tests/matrix_free/point_evaluation_01.release': No space left on device
mv: cannot create directory '/var/jenkins/workspace/deal.II-CUDA11.0/build/tests/matrix_free/fe_evaluation_dofs_per_cell.release': No space left on device
mv: cannot create directory '/var/jenkins/workspace/deal.II-CUDA11.0/build/tests/matrix_free/matrix_vector_14.release': No space left on device
mv: cannot create directory '/var/jenkins/workspace/deal.II-CUDA11.0/build/tests/matrix_free/matrix_vector_faces_31.debug': No space left on device
mv: cannot create directory '/var/jenkins/workspace/deal.II-CUDA11.0/build/tests/matrix_free/pre_and_post_loops_02.debug': No space left on device
mv: cannot create directory '/var/jenkins/workspace/deal.II-CUDA11.0/build/tests/matrix_free/step-37-inhomogeneous-1.debug': No space left on device
mv: cannot create directory '/var/jenkins/workspace/deal.II-CUDA11.0/build/tests/matrix_free/thread_correctness.release': No space left on device
mv: cannot create directory '/var/jenkins/workspace/deal.II-CUDA11.0/build/tests/matrix_free/get_values_plain.release': No space left on device
mv: cannot create directory '/var/jenkins/workspace/deal.II-CUDA11.0/build/tests/matrix_free/matrix_vector_07.release': No space left on device
mv: cannot create directory '/var/jenkins/workspace/deal.II-CUDA11.0/build/tests/matrix_free/matrix_vector_curl.release': No space left on device
mv: cannot create directory '/var/jenkins/workspace/deal.II-CUDA11.0/build/tests/matrix_free/parallel_multigrid_adaptive_05.debug': No space left on device
mv: cannot create directory '/var/jenkins/workspace/deal.II-CUDA11.0/build/tests/matrix_free/dof_info_02.debug': No space left on device
mv: cannot create directory '/var/jenkins/workspace/deal.II-CUDA11.0/build/tests/matrix_free/fe_evaluation_print_01.debug': No space left on device
mv: cannot create directory '/var/jenkins/workspace/deal.II-CUDA11.0/build/tests/matrix_free/matrix_vector_faces_11.release': No space left on device
mv: cannot create directory '/var/jenkins/workspace/deal.II-CUDA11.0/build/tests/matrix_free/matrix_vector_faces_20.debug': No space left on device
mv: cannot create directory '/var/jenkins/workspace/deal.II-CUDA11.0/build/tests/matrix_free/matrix_vector_stokes.release': No space left on device
mv: cannot create directory '/var/jenkins/workspace/deal.II-CUDA11.0/build/tests/matrix_free/fe_evaluation_print_01.release': No space left on device
mv: cannot create directory '/var/jenkins/workspace/deal.II-CUDA11.0/build/tests/matrix_free/mass_operator_02.debug': No space left on device
mv: cannot create directory '/var/jenkins/workspace/deal.II-CUDA11.0/build/tests/matrix_free/multigrid_dg_sip_02.debug': No space left on device
mv: cannot create directory '/var/jenkins/workspace/deal.II-CUDA11.0/build/tests/matrix_free/thread_correctness_dg.debug': No space left on device
mv: cannot create directory '/var/jenkins/workspace/deal.II-CUDA11.0/build/tests/matrix_free/hanging_node_kernels_01.debug': No space left on device
mv: cannot create directory '/var/jenkins/workspace/deal.II-CUDA11.0/build/tests/matrix_free/pre_and_post_loops_02.release': No space left on device
mv: cannot create directory '/var/jenkins/workspace/deal.II-CUDA11.0/build/tests/matrix_free/step-37-inhomogeneous-1.release': No space left on device
mv: cannot create directory '/var/jenkins/workspace/deal.II-CUDA11.0/build/tests/meshworker': No space left on device
mv: cannot create directory '/var/jenkins/workspace/deal.II-CUDA11.0/build/tests/metis': No space left on device
mv: cannot create directory '/var/jenkins/workspace/deal.II-CUDA11.0/build/tests/mpi': No space left on device
mv: cannot create directory '/var/jenkins/workspace/deal.II-CUDA11.0/build/tests/multigrid': No space left on device
mv: cannot create directory '/var/jenkins/workspace/deal.II-CUDA11.0/build/tests/multigrid-global-coarsening': No space left on device
mv: cannot create directory '/var/jenkins/workspace/deal.II-CUDA11.0/build/tests/multithreading': No space left on device
mv: cannot create directory '/var/jenkins/workspace/deal.II-CUDA11.0/build/tests/non_matching': No space left on device
mv: cannot create directory '/var/jenkins/workspace/deal.II-CUDA11.0/build/tests/numerics': No space left on device
mv: cannot create directory '/var/jenkins/workspace/deal.II-CUDA11.0/build/tests/opencascade': No space left on device
mv: cannot create directory '/var/jenkins/workspace/deal.II-CUDA11.0/build/tests/optimization': No space left on device
mv: cannot create directory '/var/jenkins/workspace/deal.II-CUDA11.0/build/tests/parameter_handler': No space left on device
mv: cannot create directory '/var/jenkins/workspace/deal.II-CUDA11.0/build/tests/particles': No space left on device
mv: cannot create directory '/var/jenkins/workspace/deal.II-CUDA11.0/build/tests/petsc': No space left on device
mv: cannot create directory '/var/jenkins/workspace/deal.II-CUDA11.0/build/tests/petsc_complex': No space left on device
mv: cannot create directory '/var/jenkins/workspace/deal.II-CUDA11.0/build/tests/physics': No space left on device
mv: cannot create directory '/var/jenkins/workspace/deal.II-CUDA11.0/build/tests/remote_point_evaluation': No space left on device
mv: cannot create directory '/var/jenkins/workspace/deal.II-CUDA11.0/build/tests/rol': No space left on device
mv: cannot create directory '/var/jenkins/workspace/deal.II-CUDA11.0/build/tests/sacado': No space left on device
mv: cannot create directory '/var/jenkins/workspace/deal.II-CUDA11.0/build/tests/scalapack': No space left on device
mv: cannot create directory '/var/jenkins/workspace/deal.II-CUDA11.0/build/tests/serialization': No space left on device
mv: cannot create directory '/var/jenkins/workspace/deal.II-CUDA11.0/build/tests/sharedtria': No space left on device
mv: cannot create directory '/var/jenkins/workspace/deal.II-CUDA11.0/build/tests/simplex': No space left on device
mv: cannot create directory '/var/jenkins/workspace/deal.II-CUDA11.0/build/tests/slepc': No space left on device
mv: cannot create directory '/var/jenkins/workspace/deal.II-CUDA11.0/build/tests/slepc_complex': No space left on device
mv: cannot create directory '/var/jenkins/workspace/deal.II-CUDA11.0/build/tests/sparsity': No space left on device
mv: cannot create directory '/var/jenkins/workspace/deal.II-CUDA11.0/build/tests/sundials': No space left on device
mv: cannot create directory '/var/jenkins/workspace/deal.II-CUDA11.0/build/tests/symengine': No space left on device
mv: cannot create directory '/var/jenkins/workspace/deal.II-CUDA11.0/build/tests/tensors': No space left on device
mv: cannot create directory '/var/jenkins/workspace/deal.II-CUDA11.0/build/tests/trilinos': No space left on device
mv: cannot create directory '/var/jenkins/workspace/deal.II-CUDA11.0/build/tests/umfpack': No space left on device
mv: cannot create directory '/var/jenkins/workspace/deal.II-CUDA11.0/build/doc': No space left on device
mv: cannot create directory '/var/jenkins/workspace/deal.II-CUDA11.0/build/bundled': No space left on device
mv: cannot create regular file '/var/jenkins/workspace/deal.II-CUDA11.0/build/revision.log': No space left on device
mv: cannot create regular file '/var/jenkins/workspace/deal.II-CUDA11.0/build/detailed.log': No space left on device
mv: cannot create regular file '/var/jenkins/workspace/deal.II-CUDA11.0/build/summary.log': No space left on device
mv: cannot create regular file '/var/jenkins/workspace/deal.II-CUDA11.0/build/CTestTestfile.cmake': No space left on device
mv: cannot create regular file '/var/jenkins/workspace/deal.II-CUDA11.0/build/Makefile': No space left on device
mv: cannot create regular file '/var/jenkins/workspace/deal.II-CUDA11.0/build/cmake_install.cmake': No space left on device
mv: cannot create regular file '/var/jenkins/workspace/deal.II-CUDA11.0/build/CMakeCache.txt': No space left on device
mv: cannot create directory '/var/jenkins/workspace/deal.II-CUDA11.0/build/CMakeFiles': No space left on device
mv: cannot create directory '/var/jenkins/workspace/deal.II-CUDA11.0/build/source': No space left on device
+ docker rm -f cuda11_deal_ci
cuda11_deal_ci
Build step 'Execute shell' marked build as failure
INFO: Processing CTest-Version 3.x (default)
INFO: [CTest-Version 3.x (default)] - 1 test report file(s) were found with the pattern 'build/Testing/**/Test.xml' relative to '/var/jenkins/workspace/deal.II-CUDA11.0' for the testing framework 'CTest-Version 3.x (default)'.
INFO: Check 'Failed Tests' threshold.
INFO: The total number of tests for the threshold 'Failed Tests' exceeds the specified "failure threshold" value.
INFO: Setting the build status to FAILURE
Finished: FAILURE