Console Output

Skipping 2,114 KB.. Full Log
10677/11419 Test  #9570: numerics/project_parallel_q_04.mpirun=4.release ........................................   Passed   23.25 sec
            Start 10127: remote_point_evaluation/vector_tools_evaluate_at_points_05.mpirun=4.release
10678/11419 Test  #9572: numerics/project_parallel_q_05.mpirun=4.release ........................................   Passed   22.69 sec
            Start 10228: sharedtria/limit_p_level_difference_01.mpirun=4.debug
10679/11419 Test #10228: sharedtria/limit_p_level_difference_01.mpirun=4.debug ..................................   Passed    0.67 sec
            Start 10229: sharedtria/limit_p_level_difference_01.mpirun=4.release
10680/11419 Test #10229: sharedtria/limit_p_level_difference_01.mpirun=4.release ................................   Passed    0.55 sec
            Start 10232: sharedtria/limit_p_level_difference_02.mpirun=4.debug
10681/11419 Test  #9571: numerics/project_parallel_q_05.mpirun=4.debug ..........................................   Passed   27.27 sec
            Start 10233: sharedtria/limit_p_level_difference_02.mpirun=4.release
10682/11419 Test #10232: sharedtria/limit_p_level_difference_02.mpirun=4.debug ..................................   Passed    0.77 sec
            Start 10236: sharedtria/limit_p_level_difference_03.mpirun=4.debug
10683/11419 Test #10233: sharedtria/limit_p_level_difference_02.mpirun=4.release ................................   Passed    0.56 sec
            Start 10237: sharedtria/limit_p_level_difference_03.mpirun=4.release
10684/11419 Test #10237: sharedtria/limit_p_level_difference_03.mpirun=4.release ................................   Passed    0.58 sec
            Start 10240: sharedtria/limit_p_level_difference_04.mpirun=4.debug
10685/11419 Test #10236: sharedtria/limit_p_level_difference_03.mpirun=4.debug ..................................   Passed    1.06 sec
            Start 10241: sharedtria/limit_p_level_difference_04.mpirun=4.release
10686/11419 Test #10240: sharedtria/limit_p_level_difference_04.mpirun=4.debug ..................................***Failed    0.73 sec
            Start 10286: simplex/extract_boundary_dofs.mpirun=5.debug
10687/11419 Test #10241: sharedtria/limit_p_level_difference_04.mpirun=4.release ................................***Failed    0.52 sec
            Start 10287: simplex/extract_boundary_dofs.mpirun=5.release
10688/11419 Test #10287: simplex/extract_boundary_dofs.mpirun=5.release .........................................   Passed    0.69 sec
            Start 10400: simplex/step-68.mpirun=4.debug
10689/11419 Test #10286: simplex/extract_boundary_dofs.mpirun=5.debug ...........................................   Passed    0.90 sec
            Start 10401: simplex/step-68.mpirun=4.release
10690/11419 Test #10401: simplex/step-68.mpirun=4.release .......................................................   Passed    1.62 sec
            Start 10884: trilinos/assemble_matrix_parallel_02.mpirun=4.debug
10691/11419 Test #10884: trilinos/assemble_matrix_parallel_02.mpirun=4.debug ....................................   Passed    6.96 sec
            Start 10885: trilinos/assemble_matrix_parallel_02.mpirun=4.release
10692/11419 Test #10885: trilinos/assemble_matrix_parallel_02.mpirun=4.release ..................................   Passed    1.35 sec
            Start 10886: trilinos/assemble_matrix_parallel_03.mpirun=4.debug
10693/11419 Test #10121: remote_point_evaluation/vector_tools_evaluate_at_points_03.mpirun=4.release ............   Passed   31.44 sec
            Start 10887: trilinos/assemble_matrix_parallel_03.mpirun=4.release
10694/11419 Test #10120: remote_point_evaluation/vector_tools_evaluate_at_points_03.mpirun=4.debug ..............   Passed   34.41 sec
            Start 10888: trilinos/assemble_matrix_parallel_04.mpirun=4.debug
10695/11419 Test #10400: simplex/step-68.mpirun=4.debug .........................................................   Passed   19.04 sec
            Start 10889: trilinos/assemble_matrix_parallel_04.mpirun=4.release
10696/11419 Test #10126: remote_point_evaluation/vector_tools_evaluate_at_points_05.mpirun=4.debug ..............   Passed   33.95 sec
            Start 10892: trilinos/assemble_matrix_parallel_05.mpirun=4.debug
10697/11419 Test #10127: remote_point_evaluation/vector_tools_evaluate_at_points_05.mpirun=4.release ............   Passed   31.41 sec
            Start 10893: trilinos/assemble_matrix_parallel_05.mpirun=4.release
10698/11419 Test #10893: trilinos/assemble_matrix_parallel_05.mpirun=4.release ..................................   Passed    1.38 sec
            Start 10894: trilinos/assemble_matrix_parallel_06.mpirun=4.debug
10699/11419 Test #10892: trilinos/assemble_matrix_parallel_05.mpirun=4.debug ....................................   Passed    7.28 sec
            Start 10895: trilinos/assemble_matrix_parallel_06.mpirun=4.release
10700/11419 Test #10886: trilinos/assemble_matrix_parallel_03.mpirun=4.debug ....................................   Passed   32.31 sec
            Start 10896: trilinos/assemble_matrix_parallel_07.mpirun=4.debug
10701/11419 Test #10887: trilinos/assemble_matrix_parallel_03.mpirun=4.release ..................................   Passed   26.60 sec
            Start 10897: trilinos/assemble_matrix_parallel_07.mpirun=4.release
10702/11419 Test #10889: trilinos/assemble_matrix_parallel_04.mpirun=4.release ..................................   Passed   32.21 sec
            Start 10920: trilinos/copy_to_dealvec_block.mpirun=4.debug
10703/11419 Test #10888: trilinos/assemble_matrix_parallel_04.mpirun=4.debug ....................................   Passed   35.58 sec
            Start 10921: trilinos/copy_to_dealvec_block.mpirun=4.release
10704/11419 Test #10894: trilinos/assemble_matrix_parallel_06.mpirun=4.debug ....................................   Passed   36.56 sec
            Start 11132: trilinos/trilinos_sparsity_pattern_02.mpirun=4.debug
10705/11419 Test #10895: trilinos/assemble_matrix_parallel_06.mpirun=4.release ..................................   Passed   32.93 sec
            Start 11133: trilinos/trilinos_sparsity_pattern_02.mpirun=4.release
10706/11419 Test #10920: trilinos/copy_to_dealvec_block.mpirun=4.debug ..........................................   Passed   13.40 sec
            Start 11134: trilinos/trilinos_sparsity_pattern_03.mpirun=4.debug
10707/11419 Test #10921: trilinos/copy_to_dealvec_block.mpirun=4.release ........................................   Passed   12.19 sec
            Start 11135: trilinos/trilinos_sparsity_pattern_03.mpirun=4.release
10708/11419 Test #10897: trilinos/assemble_matrix_parallel_07.mpirun=4.release ..................................   Passed   27.72 sec
10709/11419 Test #11135: trilinos/trilinos_sparsity_pattern_03.mpirun=4.release .................................   Passed    9.70 sec
            Start  1604: base/mpi_all_gather_01.mpirun=6.debug
10710/11419 Test #11134: trilinos/trilinos_sparsity_pattern_03.mpirun=4.debug ...................................   Passed   11.43 sec
            Start  1605: base/mpi_all_gather_01.mpirun=6.release
10711/11419 Test  #1604: base/mpi_all_gather_01.mpirun=6.debug ..................................................   Passed    2.50 sec
            Start  1624: base/mpi_gather_01.mpirun=6.debug
10712/11419 Test  #1605: base/mpi_all_gather_01.mpirun=6.release ................................................   Passed    2.37 sec
            Start  1625: base/mpi_gather_01.mpirun=6.release
10713/11419 Test  #1624: base/mpi_gather_01.mpirun=6.debug ......................................................   Passed    2.37 sec
            Start  1644: base/mpi_some_to_some_01.mpirun=6.debug
10714/11419 Test #10896: trilinos/assemble_matrix_parallel_07.mpirun=4.debug ....................................   Passed   38.01 sec
10715/11419 Test #11133: trilinos/trilinos_sparsity_pattern_02.mpirun=4.release .................................   Passed   17.46 sec
            Start  1645: base/mpi_some_to_some_01.mpirun=6.release
10716/11419 Test  #1625: base/mpi_gather_01.mpirun=6.release ....................................................   Passed    2.41 sec
            Start  4800: fullydistributed_grids/copy_serial_tria_05.mpirun=9.debug
10717/11419 Test #11132: trilinos/trilinos_sparsity_pattern_02.mpirun=4.debug ...................................   Passed   20.11 sec
10718/11419 Test  #1644: base/mpi_some_to_some_01.mpirun=6.debug ................................................   Passed    2.37 sec
            Start  8179: mpi/mg_04.mpirun=10.debug
10719/11419 Test  #1645: base/mpi_some_to_some_01.mpirun=6.release ..............................................   Passed    2.32 sec
            Start  4822: fullydistributed_grids/copy_serial_tria_grouped_01.mpirun=7.debug
10720/11419 Test  #8179: mpi/mg_04.mpirun=10.debug ..............................................................   Passed    3.06 sec
            Start  8180: mpi/mg_04.mpirun=10.release
10721/11419 Test  #8180: mpi/mg_04.mpirun=10.release ............................................................   Passed    2.94 sec
            Start  8349: mpi/p4est_3d_refine_04.mpirun=10.debug
10722/11419 Test  #8349: mpi/p4est_3d_refine_04.mpirun=10.debug .................................................   Passed    6.85 sec
            Start  8350: mpi/p4est_3d_refine_04.mpirun=10.release
10723/11419 Test  #8350: mpi/p4est_3d_refine_04.mpirun=10.release ...............................................   Passed    3.00 sec
            Start  8594: mpi/point_to_point_pattern_01.mpirun=10.debug
10724/11419 Test  #4800: fullydistributed_grids/copy_serial_tria_05.mpirun=9.debug ..............................   Passed   27.34 sec
            Start  8181: mpi/mg_04.mpirun=2.debug
            Start  8182: mpi/mg_04.mpirun=2.release
10725/11419 Test  #8594: mpi/point_to_point_pattern_01.mpirun=10.debug ..........................................   Passed   13.16 sec
            Start  8939: multigrid/distribute_bug_01.mpirun=13.debug
            Start  8596: mpi/point_to_point_pattern_01.mpirun=3.debug
10726/11419 Test  #8182: mpi/mg_04.mpirun=2.release .............................................................   Passed    3.04 sec
10727/11419 Test  #8181: mpi/mg_04.mpirun=2.debug ...............................................................   Passed    3.13 sec
            Start  8183: mpi/mg_04.mpirun=4.debug
10728/11419 Test  #8596: mpi/point_to_point_pattern_01.mpirun=3.debug ...........................................   Passed    2.97 sec
10729/11419 Test  #8183: mpi/mg_04.mpirun=4.debug ...............................................................   Passed    2.97 sec
            Start  4823: fullydistributed_grids/copy_serial_tria_grouped_01.mpirun=7.release
10730/11419 Test  #8939: multigrid/distribute_bug_01.mpirun=13.debug ............................................   Passed   21.80 sec
            Start  8940: multigrid/distribute_bug_01.mpirun=13.release
10731/11419 Test  #8940: multigrid/distribute_bug_01.mpirun=13.release ..........................................   Passed   16.95 sec
            Start  8595: mpi/point_to_point_pattern_01.mpirun=10.release
            Start  8941: multigrid/distribute_bug_01.mpirun=2.debug
10732/11419 Test  #8941: multigrid/distribute_bug_01.mpirun=2.debug .............................................   Passed    2.37 sec
            Start  8942: multigrid/distribute_bug_01.mpirun=2.release
10733/11419 Test  #8942: multigrid/distribute_bug_01.mpirun=2.release ...........................................   Passed    0.68 sec
10734/11419 Test  #4822: fullydistributed_grids/copy_serial_tria_grouped_01.mpirun=7.debug ......................   Passed   72.75 sec
            Start  4801: fullydistributed_grids/copy_serial_tria_05.mpirun=9.release
10735/11419 Test  #8595: mpi/point_to_point_pattern_01.mpirun=10.release ........................................   Passed   11.05 sec
            Start  8670: mpi/refinement_listener_01.mpirun=10.debug
10736/11419 Test  #4823: fullydistributed_grids/copy_serial_tria_grouped_01.mpirun=7.release ....................   Passed   60.15 sec
            Start  8597: mpi/point_to_point_pattern_01.mpirun=3.release
            Start  8184: mpi/mg_04.mpirun=4.release
10737/11419 Test  #8184: mpi/mg_04.mpirun=4.release .............................................................   Passed    2.78 sec
            Start  8598: mpi/point_to_point_pattern_01.mpirun=4.debug
10738/11419 Test  #8597: mpi/point_to_point_pattern_01.mpirun=3.release .........................................   Passed    2.81 sec
10739/11419 Test  #4801: fullydistributed_grids/copy_serial_tria_05.mpirun=9.release ............................   Passed   21.91 sec
            Start  8671: mpi/refinement_listener_01.mpirun=10.release
10740/11419 Test  #8598: mpi/point_to_point_pattern_01.mpirun=4.debug ...........................................   Passed    2.99 sec
            Start  8599: mpi/point_to_point_pattern_01.mpirun=4.release
10741/11419 Test  #8599: mpi/point_to_point_pattern_01.mpirun=4.release .........................................   Passed    2.80 sec
10742/11419 Test  #8670: mpi/refinement_listener_01.mpirun=10.debug .............................................   Passed   23.07 sec
            Start  8676: mpi/refinement_listener_02.mpirun=10.debug
10743/11419 Test  #8671: mpi/refinement_listener_01.mpirun=10.release ...........................................   Passed   19.44 sec
            Start  8677: mpi/refinement_listener_02.mpirun=10.release
10744/11419 Test  #8676: mpi/refinement_listener_02.mpirun=10.debug .............................................   Passed   23.11 sec
            Start  8716: mpi/simple_mpi_01.mpirun=10.debug
10745/11419 Test  #8677: mpi/refinement_listener_02.mpirun=10.release ...........................................   Passed   19.07 sec
            Start  8717: mpi/simple_mpi_01.mpirun=10.release
10746/11419 Test  #8716: mpi/simple_mpi_01.mpirun=10.debug ......................................................   Passed   12.52 sec
            Start  8754: mpi/tria_01.mpirun=10.debug
            Start  8718: mpi/simple_mpi_01.mpirun=3.debug
10747/11419 Test  #8718: mpi/simple_mpi_01.mpirun=3.debug .......................................................   Passed    2.85 sec
            Start  8720: mpi/simple_mpi_01.mpirun=4.debug
10748/11419 Test  #8720: mpi/simple_mpi_01.mpirun=4.debug .......................................................   Passed    2.92 sec
10749/11419 Test  #8717: mpi/simple_mpi_01.mpirun=10.release ....................................................   Passed   10.80 sec
            Start  8755: mpi/tria_01.mpirun=10.release
            Start  8719: mpi/simple_mpi_01.mpirun=3.release
10750/11419 Test  #8719: mpi/simple_mpi_01.mpirun=3.release .....................................................   Passed    2.79 sec
            Start  8721: mpi/simple_mpi_01.mpirun=4.release
10751/11419 Test  #8721: mpi/simple_mpi_01.mpirun=4.release .....................................................   Passed    2.83 sec
10752/11419 Test  #8754: mpi/tria_01.mpirun=10.debug ............................................................   Passed   22.00 sec
            Start  8824: mpi/trilinos_distribute_01.mpirun=10.debug
            Start  8756: mpi/tria_01.mpirun=2.debug
10753/11419 Test  #8824: mpi/trilinos_distribute_01.mpirun=10.debug .............................................   Passed    2.98 sec
            Start  8825: mpi/trilinos_distribute_01.mpirun=10.release
            Start  8826: mpi/trilinos_distribute_01.mpirun=2.debug
10754/11419 Test  #8756: mpi/tria_01.mpirun=2.debug .............................................................   Passed    3.03 sec
10755/11419 Test  #8755: mpi/tria_01.mpirun=10.release ..........................................................   Passed   18.52 sec
            Start  8832: mpi/trilinos_distribute_01_block.mpirun=10.debug
            Start  8757: mpi/tria_01.mpirun=2.release
10756/11419 Test  #8826: mpi/trilinos_distribute_01.mpirun=2.debug ..............................................   Passed    2.91 sec
10757/11419 Test  #8825: mpi/trilinos_distribute_01.mpirun=10.release ...........................................   Passed    2.93 sec
            Start  8833: mpi/trilinos_distribute_01_block.mpirun=10.release
            Start  8827: mpi/trilinos_distribute_01.mpirun=2.release
10758/11419 Test  #8832: mpi/trilinos_distribute_01_block.mpirun=10.debug .......................................   Passed    2.94 sec
            Start  8840: mpi/trilinos_distribute_01_inhomogenous.mpirun=10.debug
10759/11419 Test  #8757: mpi/tria_01.mpirun=2.release ...........................................................   Passed    2.98 sec
            Start  8834: mpi/trilinos_distribute_01_block.mpirun=2.debug
10760/11419 Test  #8827: mpi/trilinos_distribute_01.mpirun=2.release ............................................   Passed    2.83 sec
10761/11419 Test  #8833: mpi/trilinos_distribute_01_block.mpirun=10.release .....................................   Passed    2.88 sec
            Start  8841: mpi/trilinos_distribute_01_inhomogenous.mpirun=10.release
            Start  8835: mpi/trilinos_distribute_01_block.mpirun=2.release
10762/11419 Test  #8834: mpi/trilinos_distribute_01_block.mpirun=2.debug ........................................   Passed    2.96 sec
10763/11419 Test  #8840: mpi/trilinos_distribute_01_inhomogenous.mpirun=10.debug ................................   Passed    3.05 sec
            Start  3195: distributed_grids/grid_tools_exchange_bounding_boxes_1.mpirun=12.debug
10764/11419 Test  #8835: mpi/trilinos_distribute_01_block.mpirun=2.release ......................................   Passed    2.85 sec
            Start  8842: mpi/trilinos_distribute_01_inhomogenous.mpirun=2.debug
10765/11419 Test  #8841: mpi/trilinos_distribute_01_inhomogenous.mpirun=10.release ..............................   Passed    2.94 sec
            Start  7280: matrix_free/matrix_vector_10.mpirun=10.debug
10766/11419 Test  #8842: mpi/trilinos_distribute_01_inhomogenous.mpirun=2.debug .................................   Passed    3.16 sec
            Start  8843: mpi/trilinos_distribute_01_inhomogenous.mpirun=2.release
10767/11419 Test  #7280: matrix_free/matrix_vector_10.mpirun=10.debug ...........................................   Passed    3.72 sec
            Start  7281: matrix_free/matrix_vector_10.mpirun=10.release
10768/11419 Test  #7281: matrix_free/matrix_vector_10.mpirun=10.release .........................................   Passed    1.68 sec
            Start  7284: matrix_free/matrix_vector_11.mpirun=10.debug
10769/11419 Test  #8843: mpi/trilinos_distribute_01_inhomogenous.mpirun=2.release ...............................   Passed    2.89 sec
10770/11419 Test  #3195: distributed_grids/grid_tools_exchange_bounding_boxes_1.mpirun=12.debug .................   Passed   20.88 sec
            Start  3196: distributed_grids/grid_tools_exchange_bounding_boxes_1.mpirun=12.release
10771/11419 Test  #3196: distributed_grids/grid_tools_exchange_bounding_boxes_1.mpirun=12.release ...............   Passed   16.23 sec
            Start  7285: matrix_free/matrix_vector_11.mpirun=10.release
            Start  3197: distributed_grids/grid_tools_exchange_bounding_boxes_1.mpirun=4.debug
10772/11419 Test  #3197: distributed_grids/grid_tools_exchange_bounding_boxes_1.mpirun=4.debug ..................   Passed    0.67 sec
            Start  3198: distributed_grids/grid_tools_exchange_bounding_boxes_1.mpirun=4.release
10773/11419 Test  #3198: distributed_grids/grid_tools_exchange_bounding_boxes_1.mpirun=4.release ................   Passed    0.59 sec
            Start  7282: matrix_free/matrix_vector_10.mpirun=4.debug
10774/11419 Test  #7282: matrix_free/matrix_vector_10.mpirun=4.debug ............................................   Passed    3.61 sec
            Start  7283: matrix_free/matrix_vector_10.mpirun=4.release
10775/11419 Test  #7283: matrix_free/matrix_vector_10.mpirun=4.release ..........................................   Passed    1.23 sec
            Start  8758: mpi/tria_01.mpirun=4.debug
10776/11419 Test  #8758: mpi/tria_01.mpirun=4.debug .............................................................   Passed    3.19 sec
            Start  8759: mpi/tria_01.mpirun=4.release
10777/11419 Test  #8759: mpi/tria_01.mpirun=4.release ...........................................................   Passed    3.19 sec
            Start  8828: mpi/trilinos_distribute_01.mpirun=4.debug
10778/11419 Test  #7284: matrix_free/matrix_vector_11.mpirun=10.debug ...........................................   Passed   43.07 sec
            Start  7290: matrix_free/matrix_vector_12.mpirun=10.debug
10779/11419 Test  #8828: mpi/trilinos_distribute_01.mpirun=4.debug ..............................................   Passed    3.11 sec
            Start  7286: matrix_free/matrix_vector_11.mpirun=4.debug
10780/11419 Test  #7290: matrix_free/matrix_vector_12.mpirun=10.debug ...........................................   Passed    3.46 sec
            Start  7291: matrix_free/matrix_vector_12.mpirun=10.release
10781/11419 Test  #7291: matrix_free/matrix_vector_12.mpirun=10.release .........................................   Passed    1.78 sec
            Start  7543: matrix_free/step-48.mpirun=10.debug
10782/11419 Test  #7543: matrix_free/step-48.mpirun=10.debug ....................................................   Passed    4.83 sec
            Start  7544: matrix_free/step-48.mpirun=10.release
10783/11419 Test  #7286: matrix_free/matrix_vector_11.mpirun=4.debug ............................................   Passed    8.59 sec
            Start  7292: matrix_free/matrix_vector_12.mpirun=3.debug
            Start  7293: matrix_free/matrix_vector_12.mpirun=3.release
10784/11419 Test  #7544: matrix_free/step-48.mpirun=10.release ..................................................   Passed    1.60 sec
            Start  7678: mpi/collective_01.mpirun=10.debug
10785/11419 Test  #7293: matrix_free/matrix_vector_12.mpirun=3.release ..........................................   Passed    1.27 sec
10786/11419 Test  #7678: mpi/collective_01.mpirun=10.debug ......................................................   Passed    2.95 sec
            Start  7679: mpi/collective_01.mpirun=10.release
10787/11419 Test  #7292: matrix_free/matrix_vector_12.mpirun=3.debug ............................................   Passed    3.90 sec
            Start  7545: matrix_free/step-48.mpirun=4.debug
10788/11419 Test  #7679: mpi/collective_01.mpirun=10.release ....................................................   Passed    2.92 sec
            Start  7684: mpi/collective_02.mpirun=10.debug
10789/11419 Test  #7545: matrix_free/step-48.mpirun=4.debug .....................................................   Passed    3.06 sec
            Start  7546: matrix_free/step-48.mpirun=4.release
10790/11419 Test  #7546: matrix_free/step-48.mpirun=4.release ...................................................   Passed    1.19 sec
            Start  7680: mpi/collective_01.mpirun=4.debug
10791/11419 Test  #7684: mpi/collective_02.mpirun=10.debug ......................................................   Passed    2.91 sec
            Start  7685: mpi/collective_02.mpirun=10.release
10792/11419 Test  #7680: mpi/collective_01.mpirun=4.debug .......................................................   Passed    2.87 sec
            Start  7681: mpi/collective_01.mpirun=4.release
10793/11419 Test  #7685: mpi/collective_02.mpirun=10.release ....................................................   Passed    2.78 sec
            Start  7690: mpi/collective_02_array.mpirun=10.debug
10794/11419 Test  #7681: mpi/collective_01.mpirun=4.release .....................................................   Passed    2.79 sec
            Start  7686: mpi/collective_02.mpirun=4.debug
10795/11419 Test  #7690: mpi/collective_02_array.mpirun=10.debug ................................................   Passed    2.90 sec
            Start  7691: mpi/collective_02_array.mpirun=10.release
10796/11419 Test  #7686: mpi/collective_02.mpirun=4.debug .......................................................   Passed    3.04 sec
            Start  7687: mpi/collective_02.mpirun=4.release
10797/11419 Test  #7285: matrix_free/matrix_vector_11.mpirun=10.release .........................................   Passed   41.57 sec
            Start  7696: mpi/collective_02_array_in_place.mpirun=10.debug
10798/11419 Test  #7691: mpi/collective_02_array.mpirun=10.release ..............................................   Passed    2.93 sec
            Start  7697: mpi/collective_02_array_in_place.mpirun=10.release
10799/11419 Test  #7687: mpi/collective_02.mpirun=4.release .....................................................   Passed    2.89 sec
            Start  7287: matrix_free/matrix_vector_11.mpirun=4.release
10800/11419 Test  #7696: mpi/collective_02_array_in_place.mpirun=10.debug .......................................   Passed    2.98 sec
            Start  7710: mpi/collective_02_vector.mpirun=10.debug
10801/11419 Test  #7697: mpi/collective_02_array_in_place.mpirun=10.release .....................................   Passed    2.89 sec
            Start  7711: mpi/collective_02_vector.mpirun=10.release
10802/11419 Test  #7287: matrix_free/matrix_vector_11.mpirun=4.release ..........................................   Passed    1.56 sec
            Start  7692: mpi/collective_02_array.mpirun=4.debug
10803/11419 Test  #7710: mpi/collective_02_vector.mpirun=10.debug ...............................................   Passed    2.91 sec
            Start  7716: mpi/collective_02_vector_in_place.mpirun=10.debug
10804/11419 Test  #7711: mpi/collective_02_vector.mpirun=10.release .............................................   Passed    2.93 sec
            Start  7717: mpi/collective_02_vector_in_place.mpirun=10.release
10805/11419 Test  #7692: mpi/collective_02_array.mpirun=4.debug .................................................   Passed    2.86 sec
            Start  7693: mpi/collective_02_array.mpirun=4.release
10806/11419 Test  #7716: mpi/collective_02_vector_in_place.mpirun=10.debug ......................................   Passed    2.95 sec
            Start  7722: mpi/collective_full_matrix.mpirun=10.debug
10807/11419 Test  #7717: mpi/collective_02_vector_in_place.mpirun=10.release ....................................   Passed    2.85 sec
            Start  7723: mpi/collective_full_matrix.mpirun=10.release
10808/11419 Test  #7693: mpi/collective_02_array.mpirun=4.release ...............................................   Passed    2.87 sec
            Start  7698: mpi/collective_02_array_in_place.mpirun=4.debug
10809/11419 Test  #7722: mpi/collective_full_matrix.mpirun=10.debug .............................................   Passed    2.87 sec
            Start  7732: mpi/collective_logical_or.mpirun=10.debug
10810/11419 Test  #7723: mpi/collective_full_matrix.mpirun=10.release ...........................................   Passed    2.90 sec
            Start  7733: mpi/collective_logical_or.mpirun=10.release
10811/11419 Test  #7698: mpi/collective_02_array_in_place.mpirun=4.debug ........................................   Passed    2.97 sec
            Start  7699: mpi/collective_02_array_in_place.mpirun=4.release
10812/11419 Test  #7732: mpi/collective_logical_or.mpirun=10.debug ..............................................   Passed    2.89 sec
            Start  7738: mpi/collective_logical_or_array.mpirun=10.debug
10813/11419 Test  #7733: mpi/collective_logical_or.mpirun=10.release ............................................   Passed    2.94 sec
            Start  7739: mpi/collective_logical_or_array.mpirun=10.release
10814/11419 Test  #7699: mpi/collective_02_array_in_place.mpirun=4.release ......................................   Passed    2.91 sec
            Start  7712: mpi/collective_02_vector.mpirun=4.debug
10815/11419 Test  #7738: mpi/collective_logical_or_array.mpirun=10.debug ........................................   Passed    2.89 sec
            Start  7744: mpi/collective_logical_or_array_in_place.mpirun=10.debug
10816/11419 Test  #7739: mpi/collective_logical_or_array.mpirun=10.release ......................................   Passed    2.84 sec
            Start  7745: mpi/collective_logical_or_array_in_place.mpirun=10.release
10817/11419 Test  #7712: mpi/collective_02_vector.mpirun=4.debug ................................................   Passed    2.86 sec
            Start  7713: mpi/collective_02_vector.mpirun=4.release
10818/11419 Test  #7744: mpi/collective_logical_or_array_in_place.mpirun=10.debug ...............................   Passed    3.06 sec
            Start  7750: mpi/collective_logical_or_vector.mpirun=10.debug
10819/11419 Test  #7745: mpi/collective_logical_or_array_in_place.mpirun=10.release .............................   Passed    2.89 sec
            Start  7751: mpi/collective_logical_or_vector.mpirun=10.release
10820/11419 Test  #7713: mpi/collective_02_vector.mpirun=4.release ..............................................   Passed    2.77 sec
            Start  7718: mpi/collective_02_vector_in_place.mpirun=4.debug
10821/11419 Test  #7750: mpi/collective_logical_or_vector.mpirun=10.debug .......................................   Passed    3.07 sec
            Start  7756: mpi/collective_logical_or_vector_in_place.mpirun=10.debug
10822/11419 Test  #7751: mpi/collective_logical_or_vector.mpirun=10.release .....................................   Passed    2.95 sec
            Start  7757: mpi/collective_logical_or_vector_in_place.mpirun=10.release
10823/11419 Test  #7718: mpi/collective_02_vector_in_place.mpirun=4.debug .......................................   Passed    2.97 sec
            Start  7719: mpi/collective_02_vector_in_place.mpirun=4.release
10824/11419 Test  #7756: mpi/collective_logical_or_vector_in_place.mpirun=10.debug ..............................   Passed    3.03 sec
            Start  7762: mpi/collective_max.mpirun=10.debug
10825/11419 Test  #7757: mpi/collective_logical_or_vector_in_place.mpirun=10.release ............................   Passed    2.95 sec
            Start  7763: mpi/collective_max.mpirun=10.release
10826/11419 Test  #7719: mpi/collective_02_vector_in_place.mpirun=4.release .....................................   Passed    2.90 sec
            Start  7724: mpi/collective_full_matrix.mpirun=3.debug
            Start  7725: mpi/collective_full_matrix.mpirun=3.release
10827/11419 Test  #7762: mpi/collective_max.mpirun=10.debug .....................................................   Passed    3.10 sec
            Start  7768: mpi/collective_max_array.mpirun=10.debug
10828/11419 Test  #7763: mpi/collective_max.mpirun=10.release ...................................................   Passed    3.02 sec
            Start  7769: mpi/collective_max_array.mpirun=10.release
10829/11419 Test  #7725: mpi/collective_full_matrix.mpirun=3.release ............................................   Passed    2.86 sec
10830/11419 Test  #7724: mpi/collective_full_matrix.mpirun=3.debug ..............................................   Passed    2.99 sec
            Start  7734: mpi/collective_logical_or.mpirun=4.debug
10831/11419 Test  #7769: mpi/collective_max_array.mpirun=10.release .............................................   Passed    2.94 sec
            Start  7774: mpi/collective_max_array_in_place.mpirun=10.debug
10832/11419 Test  #7768: mpi/collective_max_array.mpirun=10.debug ...............................................   Passed    3.08 sec
            Start  7775: mpi/collective_max_array_in_place.mpirun=10.release
10833/11419 Test  #7734: mpi/collective_logical_or.mpirun=4.debug ...............................................   Passed    2.93 sec
            Start  7735: mpi/collective_logical_or.mpirun=4.release
10834/11419 Test  #7774: mpi/collective_max_array_in_place.mpirun=10.debug ......................................   Passed    3.04 sec
            Start  7780: mpi/collective_max_vector.mpirun=10.debug
10835/11419 Test  #7775: mpi/collective_max_array_in_place.mpirun=10.release ....................................   Passed    2.98 sec
            Start  7781: mpi/collective_max_vector.mpirun=10.release
10836/11419 Test  #7735: mpi/collective_logical_or.mpirun=4.release .............................................   Passed    2.94 sec
            Start  7740: mpi/collective_logical_or_array.mpirun=4.debug
10837/11419 Test  #7780: mpi/collective_max_vector.mpirun=10.debug ..............................................   Passed    3.04 sec
            Start  7786: mpi/collective_max_vector_in_place.mpirun=10.debug
10838/11419 Test  #7781: mpi/collective_max_vector.mpirun=10.release ............................................   Passed    3.05 sec
            Start  7787: mpi/collective_max_vector_in_place.mpirun=10.release
10839/11419 Test  #7740: mpi/collective_logical_or_array.mpirun=4.debug .........................................   Passed    2.98 sec
            Start  7741: mpi/collective_logical_or_array.mpirun=4.release
10840/11419 Test  #7786: mpi/collective_max_vector_in_place.mpirun=10.debug .....................................   Passed    3.09 sec
            Start  7794: mpi/collective_min.mpirun=10.debug
10841/11419 Test  #7741: mpi/collective_logical_or_array.mpirun=4.release .......................................   Passed    3.00 sec
            Start  7746: mpi/collective_logical_or_array_in_place.mpirun=4.debug
10842/11419 Test  #7787: mpi/collective_max_vector_in_place.mpirun=10.release ...................................   Passed    3.04 sec
            Start  7795: mpi/collective_min.mpirun=10.release
10843/11419 Test  #7746: mpi/collective_logical_or_array_in_place.mpirun=4.debug ................................   Passed    3.13 sec
            Start  7747: mpi/collective_logical_or_array_in_place.mpirun=4.release
10844/11419 Test  #7795: mpi/collective_min.mpirun=10.release ...................................................   Passed    3.10 sec
            Start  7800: mpi/collective_min_array.mpirun=10.debug
10845/11419 Test  #7794: mpi/collective_min.mpirun=10.debug .....................................................   Passed    3.14 sec
            Start  7801: mpi/collective_min_array.mpirun=10.release
10846/11419 Test  #7747: mpi/collective_logical_or_array_in_place.mpirun=4.release ..............................   Passed    2.88 sec
            Start  7752: mpi/collective_logical_or_vector.mpirun=4.debug
10847/11419 Test  #7800: mpi/collective_min_array.mpirun=10.debug ...............................................   Passed    3.00 sec
            Start  7806: mpi/collective_min_array_in_place.mpirun=10.debug
10848/11419 Test  #7801: mpi/collective_min_array.mpirun=10.release .............................................   Passed    3.04 sec
            Start  7807: mpi/collective_min_array_in_place.mpirun=10.release
10849/11419 Test  #7752: mpi/collective_logical_or_vector.mpirun=4.debug ........................................   Passed    3.04 sec
            Start  7753: mpi/collective_logical_or_vector.mpirun=4.release
10850/11419 Test  #7807: mpi/collective_min_array_in_place.mpirun=10.release ....................................   Passed    2.96 sec
            Start  7812: mpi/collective_min_vector.mpirun=10.debug
10851/11419 Test  #7806: mpi/collective_min_array_in_place.mpirun=10.debug ......................................   Passed    3.03 sec
            Start  7813: mpi/collective_min_vector.mpirun=10.release
10852/11419 Test  #7753: mpi/collective_logical_or_vector.mpirun=4.release ......................................   Passed    2.97 sec
            Start  7758: mpi/collective_logical_or_vector_in_place.mpirun=4.debug
10853/11419 Test  #7813: mpi/collective_min_vector.mpirun=10.release ............................................   Passed    3.00 sec
            Start  7818: mpi/collective_min_vector_in_place.mpirun=10.debug
10854/11419 Test  #7812: mpi/collective_min_vector.mpirun=10.debug ..............................................   Passed    3.13 sec
            Start  7819: mpi/collective_min_vector_in_place.mpirun=10.release
10855/11419 Test  #7758: mpi/collective_logical_or_vector_in_place.mpirun=4.debug ...............................   Passed    3.03 sec
            Start  7759: mpi/collective_logical_or_vector_in_place.mpirun=4.release
10856/11419 Test  #7818: mpi/collective_min_vector_in_place.mpirun=10.debug .....................................   Passed    3.07 sec
            Start  7828: mpi/collective_tensor.mpirun=10.debug
10857/11419 Test  #7819: mpi/collective_min_vector_in_place.mpirun=10.release ...................................   Passed    2.98 sec
            Start  7829: mpi/collective_tensor.mpirun=10.release
10858/11419 Test  #7759: mpi/collective_logical_or_vector_in_place.mpirun=4.release .............................   Passed    3.02 sec
            Start  7764: mpi/collective_max.mpirun=4.debug
10859/11419 Test  #7829: mpi/collective_tensor.mpirun=10.release ................................................   Passed    2.92 sec
            Start  7854: mpi/compute_mean_value.mpirun=10.debug
10860/11419 Test  #7828: mpi/collective_tensor.mpirun=10.debug ..................................................   Passed    3.02 sec
            Start  7855: mpi/compute_mean_value.mpirun=10.release
10861/11419 Test  #7764: mpi/collective_max.mpirun=4.debug ......................................................   Passed    2.86 sec
            Start  7765: mpi/collective_max.mpirun=4.release
10862/11419 Test  #7765: mpi/collective_max.mpirun=4.release ....................................................   Passed    2.75 sec
            Start  7770: mpi/collective_max_array.mpirun=4.debug
10863/11419 Test  #7770: mpi/collective_max_array.mpirun=4.debug ................................................   Passed    2.85 sec
            Start  7771: mpi/collective_max_array.mpirun=4.release
10864/11419 Test  #7771: mpi/collective_max_array.mpirun=4.release ..............................................   Passed    2.76 sec
            Start  7776: mpi/collective_max_array_in_place.mpirun=4.debug
10865/11419 Test  #7776: mpi/collective_max_array_in_place.mpirun=4.debug .......................................   Passed    2.93 sec
            Start  7777: mpi/collective_max_array_in_place.mpirun=4.release
10866/11419 Test  #7777: mpi/collective_max_array_in_place.mpirun=4.release .....................................   Passed    2.73 sec
            Start  7782: mpi/collective_max_vector.mpirun=4.debug
10867/11419 Test  #7782: mpi/collective_max_vector.mpirun=4.debug ...............................................   Passed    2.80 sec
            Start  7783: mpi/collective_max_vector.mpirun=4.release
10868/11419 Test  #7783: mpi/collective_max_vector.mpirun=4.release .............................................   Passed    2.69 sec
            Start  7788: mpi/collective_max_vector_in_place.mpirun=4.debug
10869/11419 Test  #7855: mpi/compute_mean_value.mpirun=10.release ...............................................   Passed   23.12 sec
            Start  7864: mpi/constraint_matrix_trilinos_bug.mpirun=10.debug
10870/11419 Test  #7788: mpi/collective_max_vector_in_place.mpirun=4.debug ......................................   Passed    2.92 sec
            Start  7789: mpi/collective_max_vector_in_place.mpirun=4.release
10871/11419 Test  #7854: mpi/compute_mean_value.mpirun=10.debug .................................................   Passed   25.69 sec
            Start  7870: mpi/count_dofs_per_block_01.mpirun=10.debug
10872/11419 Test  #7789: mpi/collective_max_vector_in_place.mpirun=4.release ....................................   Passed    2.85 sec
            Start  7796: mpi/collective_min.mpirun=4.debug
10873/11419 Test  #7796: mpi/collective_min.mpirun=4.debug ......................................................   Passed    2.95 sec
            Start  7797: mpi/collective_min.mpirun=4.release
10874/11419 Test  #7797: mpi/collective_min.mpirun=4.release ....................................................   Passed    2.65 sec
            Start  7802: mpi/collective_min_array.mpirun=4.debug
10875/11419 Test  #7802: mpi/collective_min_array.mpirun=4.debug ................................................   Passed    2.90 sec
            Start  7803: mpi/collective_min_array.mpirun=4.release
10876/11419 Test  #7803: mpi/collective_min_array.mpirun=4.release ..............................................   Passed    2.80 sec
            Start  7808: mpi/collective_min_array_in_place.mpirun=4.debug
10877/11419 Test  #7808: mpi/collective_min_array_in_place.mpirun=4.debug .......................................   Passed    2.74 sec
            Start  7809: mpi/collective_min_array_in_place.mpirun=4.release
10878/11419 Test  #7809: mpi/collective_min_array_in_place.mpirun=4.release .....................................   Passed    2.77 sec
            Start  7814: mpi/collective_min_vector.mpirun=4.debug
10879/11419 Test  #7814: mpi/collective_min_vector.mpirun=4.debug ...............................................   Passed    3.61 sec
            Start  7815: mpi/collective_min_vector.mpirun=4.release
10880/11419 Test  #7870: mpi/count_dofs_per_block_01.mpirun=10.debug ............................................   Passed   25.52 sec
            Start  7871: mpi/count_dofs_per_block_01.mpirun=10.release
10881/11419 Test  #7864: mpi/constraint_matrix_trilinos_bug.mpirun=10.debug .....................................   Passed   28.00 sec
            Start  7874: mpi/count_dofs_per_block_02.mpirun=10.debug
10882/11419 Test  #7815: mpi/collective_min_vector.mpirun=4.release .............................................   Passed    3.54 sec
            Start  7820: mpi/collective_min_vector_in_place.mpirun=4.debug
10883/11419 Test  #7820: mpi/collective_min_vector_in_place.mpirun=4.debug ......................................   Passed    2.90 sec
            Start  7821: mpi/collective_min_vector_in_place.mpirun=4.release
10884/11419 Test  #7821: mpi/collective_min_vector_in_place.mpirun=4.release ....................................   Passed    2.76 sec
            Start  7830: mpi/collective_tensor.mpirun=4.debug
10885/11419 Test  #7830: mpi/collective_tensor.mpirun=4.debug ...................................................   Passed    2.95 sec
            Start  7831: mpi/collective_tensor.mpirun=4.release
10886/11419 Test  #7831: mpi/collective_tensor.mpirun=4.release .................................................   Passed    2.81 sec
            Start  7856: mpi/compute_mean_value.mpirun=4.debug
10887/11419 Test  #7856: mpi/compute_mean_value.mpirun=4.debug ..................................................   Passed    3.62 sec
            Start  7857: mpi/compute_mean_value.mpirun=4.release
10888/11419 Test  #7857: mpi/compute_mean_value.mpirun=4.release ................................................   Passed    2.90 sec
            Start  7865: mpi/constraint_matrix_trilinos_bug.mpirun=4.debug
10889/11419 Test  #7871: mpi/count_dofs_per_block_01.mpirun=10.release ..........................................   Passed   19.69 sec
            Start  7875: mpi/count_dofs_per_block_02.mpirun=10.release
10890/11419 Test  #7865: mpi/constraint_matrix_trilinos_bug.mpirun=4.debug ......................................   Passed    3.03 sec
            Start  7872: mpi/count_dofs_per_block_01.mpirun=4.debug
10891/11419 Test  #7874: mpi/count_dofs_per_block_02.mpirun=10.debug ............................................   Passed   23.12 sec
            Start  7878: mpi/count_dofs_per_component_01.mpirun=10.debug
10892/11419 Test  #7872: mpi/count_dofs_per_block_01.mpirun=4.debug .............................................   Passed    6.19 sec
            Start  7873: mpi/count_dofs_per_block_01.mpirun=4.release
10893/11419 Test  #7873: mpi/count_dofs_per_block_01.mpirun=4.release ...........................................   Passed    2.89 sec
            Start  7876: mpi/count_dofs_per_block_02.mpirun=4.debug
10894/11419 Test  #7876: mpi/count_dofs_per_block_02.mpirun=4.debug .............................................   Passed    3.90 sec
            Start  8829: mpi/trilinos_distribute_01.mpirun=4.release
10895/11419 Test  #8829: mpi/trilinos_distribute_01.mpirun=4.release ............................................   Passed    2.77 sec
            Start  8836: mpi/trilinos_distribute_01_block.mpirun=4.debug
10896/11419 Test  #7875: mpi/count_dofs_per_block_02.mpirun=10.release ..........................................   Passed   19.81 sec
            Start  7879: mpi/count_dofs_per_component_01.mpirun=10.release
10897/11419 Test  #8836: mpi/trilinos_distribute_01_block.mpirun=4.debug ........................................   Passed    2.90 sec
            Start  7877: mpi/count_dofs_per_block_02.mpirun=4.release
10898/11419 Test  #7877: mpi/count_dofs_per_block_02.mpirun=4.release ...........................................   Passed    2.87 sec
            Start  8837: mpi/trilinos_distribute_01_block.mpirun=4.release
10899/11419 Test  #7878: mpi/count_dofs_per_component_01.mpirun=10.debug ........................................   Passed   21.28 sec
            Start  7882: mpi/crash_01.mpirun=10.debug
10900/11419 Test  #8837: mpi/trilinos_distribute_01_block.mpirun=4.release ......................................   Passed    2.87 sec
            Start  7880: mpi/count_dofs_per_component_01.mpirun=4.debug
10901/11419 Test  #7880: mpi/count_dofs_per_component_01.mpirun=4.debug .........................................   Passed    3.11 sec
            Start  8844: mpi/trilinos_distribute_01_inhomogenous.mpirun=4.debug
10902/11419 Test  #8844: mpi/trilinos_distribute_01_inhomogenous.mpirun=4.debug .................................   Passed    2.85 sec
            Start  8845: mpi/trilinos_distribute_01_inhomogenous.mpirun=4.release
10903/11419 Test  #8845: mpi/trilinos_distribute_01_inhomogenous.mpirun=4.release ...............................   Passed    2.72 sec
10904/11419 Test  #7879: mpi/count_dofs_per_component_01.mpirun=10.release ......................................   Passed   19.64 sec
            Start  7883: mpi/crash_01.mpirun=10.release
            Start  7881: mpi/count_dofs_per_component_01.mpirun=4.release
10905/11419 Test  #7881: mpi/count_dofs_per_component_01.mpirun=4.release .......................................   Passed    2.81 sec
10906/11419 Test  #7882: mpi/crash_01.mpirun=10.debug ...........................................................   Passed   19.95 sec
            Start  7888: mpi/crash_03.mpirun=10.debug
            Start  7884: mpi/crash_01.mpirun=4.debug
10907/11419 Test  #7884: mpi/crash_01.mpirun=4.debug ............................................................   Passed    2.87 sec
10908/11419 Test  #7883: mpi/crash_01.mpirun=10.release .........................................................   Passed   16.85 sec
            Start  7889: mpi/crash_03.mpirun=10.release
            Start  7885: mpi/crash_01.mpirun=4.release
10909/11419 Test  #7885: mpi/crash_01.mpirun=4.release ..........................................................   Passed    2.80 sec
10910/11419 Test  #7888: mpi/crash_03.mpirun=10.debug ...........................................................   Passed   17.96 sec
            Start  7929: mpi/distribute_sp_01.mpirun=10.debug
            Start  7890: mpi/crash_03.mpirun=4.debug
10911/11419 Test  #7890: mpi/crash_03.mpirun=4.debug ............................................................   Passed    3.00 sec
10912/11419 Test  #7889: mpi/crash_03.mpirun=10.release .........................................................   Passed   14.90 sec
            Start  7930: mpi/distribute_sp_01.mpirun=10.release
            Start  7891: mpi/crash_03.mpirun=4.release
10913/11419 Test  #7891: mpi/crash_03.mpirun=4.release ..........................................................   Passed    2.83 sec
10914/11419 Test  #7929: mpi/distribute_sp_01.mpirun=10.debug ...................................................   Passed   14.02 sec
            Start  7933: mpi/distribute_sp_02.mpirun=10.debug
            Start  7931: mpi/distribute_sp_01.mpirun=4.debug
10915/11419 Test  #7931: mpi/distribute_sp_01.mpirun=4.debug ....................................................   Passed    2.86 sec
10916/11419 Test  #7930: mpi/distribute_sp_01.mpirun=10.release .................................................   Passed   11.97 sec
            Start  7934: mpi/distribute_sp_02.mpirun=10.release
            Start  7932: mpi/distribute_sp_01.mpirun=4.release
10917/11419 Test  #7932: mpi/distribute_sp_01.mpirun=4.release ..................................................   Passed    2.80 sec
10918/11419 Test  #7933: mpi/distribute_sp_02.mpirun=10.debug ...................................................   Passed   13.92 sec
            Start  7937: mpi/dof_handler_number_cache.mpirun=10.debug
            Start  7935: mpi/distribute_sp_02.mpirun=4.debug
10919/11419 Test  #7935: mpi/distribute_sp_02.mpirun=4.debug ....................................................   Passed    2.92 sec
10920/11419 Test  #7934: mpi/distribute_sp_02.mpirun=10.release .................................................   Passed   12.69 sec
            Start  7938: mpi/dof_handler_number_cache.mpirun=10.release
            Start  7936: mpi/distribute_sp_02.mpirun=4.release
10921/11419 Test  #7936: mpi/distribute_sp_02.mpirun=4.release ..................................................   Passed    2.86 sec
10922/11419 Test  #7937: mpi/dof_handler_number_cache.mpirun=10.debug ...........................................   Passed   28.43 sec
            Start  7949: mpi/extract_boundary_dofs.mpirun=10.debug
            Start  7939: mpi/dof_handler_number_cache.mpirun=4.debug
10923/11419 Test  #7938: mpi/dof_handler_number_cache.mpirun=10.release .........................................   Passed   24.83 sec
            Start  7950: mpi/extract_boundary_dofs.mpirun=10.release
10924/11419 Test  #7939: mpi/dof_handler_number_cache.mpirun=4.debug ............................................   Passed    4.05 sec
            Start  7940: mpi/dof_handler_number_cache.mpirun=4.release
10925/11419 Test  #7940: mpi/dof_handler_number_cache.mpirun=4.release ..........................................   Passed    2.87 sec
10926/11419 Test  #7950: mpi/extract_boundary_dofs.mpirun=10.release ............................................   Passed   19.19 sec
            Start  7953: mpi/extract_constant_modes_01.mpirun=10.debug
            Start  7952: mpi/extract_boundary_dofs.mpirun=4.release
10927/11419 Test  #7949: mpi/extract_boundary_dofs.mpirun=10.debug ..............................................   Passed   21.72 sec
            Start  7954: mpi/extract_constant_modes_01.mpirun=10.release
10928/11419 Test  #7952: mpi/extract_boundary_dofs.mpirun=4.release .............................................   Passed    2.85 sec
            Start  7951: mpi/extract_boundary_dofs.mpirun=4.debug
10929/11419 Test  #7951: mpi/extract_boundary_dofs.mpirun=4.debug ...............................................   Passed    3.53 sec
10930/11419 Test  #7954: mpi/extract_constant_modes_01.mpirun=10.release ........................................   Passed   17.42 sec
            Start  7959: mpi/extract_locally_active_dofs.mpirun=10.debug
            Start  7956: mpi/extract_constant_modes_01.mpirun=4.release
10931/11419 Test  #7953: mpi/extract_constant_modes_01.mpirun=10.debug ..........................................   Passed   20.11 sec
            Start  7960: mpi/extract_locally_active_dofs.mpirun=10.release
10932/11419 Test  #7956: mpi/extract_constant_modes_01.mpirun=4.release .........................................   Passed    2.82 sec
            Start  7955: mpi/extract_constant_modes_01.mpirun=4.debug
10933/11419 Test  #7955: mpi/extract_constant_modes_01.mpirun=4.debug ...........................................   Passed    2.85 sec
10934/11419 Test  #7960: mpi/extract_locally_active_dofs.mpirun=10.release ......................................   Passed   18.88 sec
            Start  7963: mpi/extract_locally_active_level_dofs.mpirun=10.debug
            Start  7962: mpi/extract_locally_active_dofs.mpirun=4.release
10935/11419 Test  #7959: mpi/extract_locally_active_dofs.mpirun=10.debug ........................................   Passed   22.41 sec
            Start  7964: mpi/extract_locally_active_level_dofs.mpirun=10.release
10936/11419 Test  #7962: mpi/extract_locally_active_dofs.mpirun=4.release .......................................   Passed    2.95 sec
            Start  7961: mpi/extract_locally_active_dofs.mpirun=4.debug
10937/11419 Test  #7961: mpi/extract_locally_active_dofs.mpirun=4.debug .........................................   Passed    3.49 sec
10938/11419 Test  #7964: mpi/extract_locally_active_level_dofs.mpirun=10.release ................................   Passed   19.01 sec
            Start  7967: mpi/fe_field_function_01.mpirun=10.debug
            Start  7966: mpi/extract_locally_active_level_dofs.mpirun=4.release
10939/11419 Test  #7963: mpi/extract_locally_active_level_dofs.mpirun=10.debug ..................................   Passed   22.11 sec
            Start  7968: mpi/fe_field_function_01.mpirun=10.release
10940/11419 Test  #7966: mpi/extract_locally_active_level_dofs.mpirun=4.release .................................   Passed    2.97 sec
            Start  7965: mpi/extract_locally_active_level_dofs.mpirun=4.debug
10941/11419 Test  #7965: mpi/extract_locally_active_level_dofs.mpirun=4.debug ...................................   Passed    3.88 sec
10942/11419 Test  #7968: mpi/fe_field_function_01.mpirun=10.release .............................................   Passed   23.64 sec
            Start  7981: mpi/fe_tools_extrapolate_03.mpirun=10.debug
            Start  7970: mpi/fe_field_function_01.mpirun=4.release
10943/11419 Test  #7970: mpi/fe_field_function_01.mpirun=4.release ..............................................   Passed    6.25 sec
10944/11419 Test  #7967: mpi/fe_field_function_01.mpirun=10.debug ...............................................   Passed   48.58 sec
            Start  7982: mpi/fe_tools_extrapolate_03.mpirun=10.release
            Start  7969: mpi/fe_field_function_01.mpirun=4.debug
10945/11419 Test  #7981: mpi/fe_tools_extrapolate_03.mpirun=10.debug ............................................   Passed   25.59 sec
            Start  8043: mpi/hp_integrate_difference.mpirun=10.debug
10946/11419 Test  #7982: mpi/fe_tools_extrapolate_03.mpirun=10.release ..........................................   Passed    3.33 sec
            Start  8044: mpi/hp_integrate_difference.mpirun=10.release
10947/11419 Test  #7969: mpi/fe_field_function_01.mpirun=4.debug ................................................   Passed   20.17 sec
            Start  7983: mpi/fe_tools_extrapolate_03.mpirun=3.debug
            Start  7984: mpi/fe_tools_extrapolate_03.mpirun=3.release
10948/11419 Test  #7984: mpi/fe_tools_extrapolate_03.mpirun=3.release ...........................................   Passed    3.08 sec
10949/11419 Test  #7983: mpi/fe_tools_extrapolate_03.mpirun=3.debug .............................................   Passed    5.23 sec
10950/11419 Test  #8044: mpi/hp_integrate_difference.mpirun=10.release ..........................................   Passed   23.95 sec
            Start  8093: mpi/integrate_difference.mpirun=10.debug
            Start  8046: mpi/hp_integrate_difference.mpirun=4.release
10951/11419 Test  #8046: mpi/hp_integrate_difference.mpirun=4.release ...........................................   Passed    3.07 sec
10952/11419 Test  #8043: mpi/hp_integrate_difference.mpirun=10.debug ............................................   Passed   29.19 sec
            Start  8094: mpi/integrate_difference.mpirun=10.release
            Start  8045: mpi/hp_integrate_difference.mpirun=4.debug
10953/11419 Test  #8045: mpi/hp_integrate_difference.mpirun=4.debug .............................................   Passed    4.19 sec
10954/11419 Test  #8093: mpi/integrate_difference.mpirun=10.debug ...............................................   Passed   25.73 sec
            Start  8097: mpi/interpolate_01.mpirun=10.debug
            Start  8095: mpi/integrate_difference.mpirun=4.debug
10955/11419 Test  #8094: mpi/integrate_difference.mpirun=10.release .............................................   Passed   22.61 sec
            Start  8098: mpi/interpolate_01.mpirun=10.release
10956/11419 Test  #8095: mpi/integrate_difference.mpirun=4.debug ................................................   Passed    3.39 sec
            Start  8096: mpi/integrate_difference.mpirun=4.release
10957/11419 Test  #8096: mpi/integrate_difference.mpirun=4.release ..............................................   Passed    2.82 sec
10958/11419 Test  #8098: mpi/interpolate_01.mpirun=10.release ...................................................   Passed   22.45 sec
            Start  8101: mpi/interpolate_03.mpirun=10.debug
            Start  8100: mpi/interpolate_01.mpirun=4.release
10959/11419 Test  #8097: mpi/interpolate_01.mpirun=10.debug .....................................................   Passed   25.27 sec
            Start  8102: mpi/interpolate_03.mpirun=10.release
10960/11419 Test  #8100: mpi/interpolate_01.mpirun=4.release ....................................................   Passed    2.95 sec
            Start  8099: mpi/interpolate_01.mpirun=4.debug
10961/11419 Test  #8099: mpi/interpolate_01.mpirun=4.debug ......................................................   Passed    3.14 sec
10962/11419 Test  #8102: mpi/interpolate_03.mpirun=10.release ...................................................   Passed   20.20 sec
            Start  8111: mpi/is_locally_owned.mpirun=10.debug
            Start  8104: mpi/interpolate_03.mpirun=4.release
10963/11419 Test  #8101: mpi/interpolate_03.mpirun=10.debug .....................................................   Passed   23.80 sec
            Start  8112: mpi/is_locally_owned.mpirun=10.release
10964/11419 Test  #8104: mpi/interpolate_03.mpirun=4.release ....................................................   Passed    2.88 sec
            Start  8103: mpi/interpolate_03.mpirun=4.debug
10965/11419 Test  #8103: mpi/interpolate_03.mpirun=4.debug ......................................................   Passed    3.00 sec
10966/11419 Test  #8112: mpi/is_locally_owned.mpirun=10.release .................................................   Passed   17.64 sec
            Start  8137: mpi/make_zero_boundary_values.mpirun=10.debug
            Start  8114: mpi/is_locally_owned.mpirun=4.release
10967/11419 Test  #8111: mpi/is_locally_owned.mpirun=10.debug ...................................................   Passed   21.64 sec
            Start  8138: mpi/make_zero_boundary_values.mpirun=10.release
10968/11419 Test  #8114: mpi/is_locally_owned.mpirun=4.release ..................................................   Passed    2.96 sec
            Start  8113: mpi/is_locally_owned.mpirun=4.debug
10969/11419 Test  #8113: mpi/is_locally_owned.mpirun=4.debug ....................................................   Passed    2.97 sec
10970/11419 Test  #8137: mpi/make_zero_boundary_values.mpirun=10.debug ..........................................   Passed   22.32 sec
            Start  8141: mpi/map_dofs_to_support_points.mpirun=10.debug
            Start  8139: mpi/make_zero_boundary_values.mpirun=4.debug
10971/11419 Test  #8138: mpi/make_zero_boundary_values.mpirun=10.release ........................................   Passed   19.98 sec
            Start  8142: mpi/map_dofs_to_support_points.mpirun=10.release
10972/11419 Test  #8139: mpi/make_zero_boundary_values.mpirun=4.debug ...........................................   Passed    3.47 sec
            Start  8140: mpi/make_zero_boundary_values.mpirun=4.release
10973/11419 Test  #8140: mpi/make_zero_boundary_values.mpirun=4.release .........................................   Passed    2.94 sec
10974/11419 Test  #8142: mpi/map_dofs_to_support_points.mpirun=10.release .......................................   Passed   19.65 sec
            Start  8163: mpi/mg_01.mpirun=10.debug
            Start  8144: mpi/map_dofs_to_support_points.mpirun=4.release
10975/11419 Test  #8141: mpi/map_dofs_to_support_points.mpirun=10.debug .........................................   Passed   22.13 sec
            Start  8164: mpi/mg_01.mpirun=10.release
10976/11419 Test  #8144: mpi/map_dofs_to_support_points.mpirun=4.release ........................................   Passed    2.79 sec
            Start  8143: mpi/map_dofs_to_support_points.mpirun=4.debug
10977/11419 Test  #8143: mpi/map_dofs_to_support_points.mpirun=4.debug ..........................................   Passed    3.07 sec
10978/11419 Test  #8164: mpi/mg_01.mpirun=10.release ............................................................   Passed   15.32 sec
            Start  8167: mpi/mg_02.mpirun=10.debug
            Start  8166: mpi/mg_01.mpirun=4.release
10979/11419 Test  #8163: mpi/mg_01.mpirun=10.debug ..............................................................   Passed   18.73 sec
            Start  8168: mpi/mg_02.mpirun=10.release
10980/11419 Test  #8166: mpi/mg_01.mpirun=4.release .............................................................   Passed    2.80 sec
            Start  8165: mpi/mg_01.mpirun=4.debug
10981/11419 Test  #8165: mpi/mg_01.mpirun=4.debug ...............................................................   Passed    2.91 sec
10982/11419 Test  #8167: mpi/mg_02.mpirun=10.debug ..............................................................   Passed   24.18 sec
            Start  8173: mpi/mg_03.mpirun=10.debug
            Start  8169: mpi/mg_02.mpirun=4.debug
10983/11419 Test  #8168: mpi/mg_02.mpirun=10.release ............................................................   Passed   23.27 sec
            Start  8174: mpi/mg_03.mpirun=10.release
10984/11419 Test  #8169: mpi/mg_02.mpirun=4.debug ...............................................................   Passed    3.10 sec
            Start  8170: mpi/mg_02.mpirun=4.release
10985/11419 Test  #8174: mpi/mg_03.mpirun=10.release ............................................................   Passed    3.12 sec
            Start  8243: mpi/p4est_2d_coarse_01.mpirun=10.debug
10986/11419 Test  #8173: mpi/mg_03.mpirun=10.debug ..............................................................   Passed    3.23 sec
            Start  8244: mpi/p4est_2d_coarse_01.mpirun=10.release
10987/11419 Test  #8170: mpi/mg_02.mpirun=4.release .............................................................   Passed    2.81 sec
            Start  8175: mpi/mg_03.mpirun=4.debug
10988/11419 Test  #8175: mpi/mg_03.mpirun=4.debug ...............................................................   Passed    3.00 sec
            Start  8176: mpi/mg_03.mpirun=4.release
10989/11419 Test  #8176: mpi/mg_03.mpirun=4.release .............................................................   Passed    2.76 sec
10990/11419 Test  #8244: mpi/p4est_2d_coarse_01.mpirun=10.release ...............................................   Passed   18.28 sec
            Start  8247: mpi/p4est_2d_constraintmatrix_01.mpirun=10.debug
            Start  8246: mpi/p4est_2d_coarse_01.mpirun=4.release
10991/11419 Test  #8246: mpi/p4est_2d_coarse_01.mpirun=4.release ................................................   Passed    3.40 sec
10992/11419 Test  #8243: mpi/p4est_2d_coarse_01.mpirun=10.debug .................................................   Passed   32.98 sec
            Start  8248: mpi/p4est_2d_constraintmatrix_01.mpirun=10.release
            Start  8245: mpi/p4est_2d_coarse_01.mpirun=4.debug
10993/11419 Test  #8247: mpi/p4est_2d_constraintmatrix_01.mpirun=10.debug .......................................   Passed   20.34 sec
            Start  8251: mpi/p4est_2d_constraintmatrix_02.mpirun=10.debug
10994/11419 Test  #8245: mpi/p4est_2d_coarse_01.mpirun=4.debug ..................................................   Passed   13.21 sec
            Start  8249: mpi/p4est_2d_constraintmatrix_01.mpirun=4.debug
10995/11419 Test  #8249: mpi/p4est_2d_constraintmatrix_01.mpirun=4.debug ........................................   Passed    2.91 sec
10996/11419 Test  #8248: mpi/p4est_2d_constraintmatrix_01.mpirun=10.release .....................................   Passed   17.26 sec
            Start  8252: mpi/p4est_2d_constraintmatrix_02.mpirun=10.release
            Start  8250: mpi/p4est_2d_constraintmatrix_01.mpirun=4.release
10997/11419 Test  #8250: mpi/p4est_2d_constraintmatrix_01.mpirun=4.release ......................................   Passed    2.77 sec
10998/11419 Test  #8251: mpi/p4est_2d_constraintmatrix_02.mpirun=10.debug .......................................   Passed   20.75 sec
            Start  8255: mpi/p4est_2d_constraintmatrix_03.mpirun=10.debug
            Start  8253: mpi/p4est_2d_constraintmatrix_02.mpirun=4.debug
10999/11419 Test  #8253: mpi/p4est_2d_constraintmatrix_02.mpirun=4.debug ........................................   Passed    3.02 sec
11000/11419 Test  #8252: mpi/p4est_2d_constraintmatrix_02.mpirun=10.release .....................................   Passed   17.53 sec
            Start  8256: mpi/p4est_2d_constraintmatrix_03.mpirun=10.release
            Start  8254: mpi/p4est_2d_constraintmatrix_02.mpirun=4.release
11001/11419 Test  #8254: mpi/p4est_2d_constraintmatrix_02.mpirun=4.release ......................................   Passed    2.82 sec
11002/11419 Test  #8255: mpi/p4est_2d_constraintmatrix_03.mpirun=10.debug .......................................   Passed   25.62 sec
            Start  8259: mpi/p4est_2d_constraintmatrix_04.mpirun=10.debug
            Start  8257: mpi/p4est_2d_constraintmatrix_03.mpirun=4.debug
11003/11419 Test  #8257: mpi/p4est_2d_constraintmatrix_03.mpirun=4.debug ........................................   Passed    3.51 sec
11004/11419 Test  #8256: mpi/p4est_2d_constraintmatrix_03.mpirun=10.release .....................................   Passed   21.45 sec
            Start  8260: mpi/p4est_2d_constraintmatrix_04.mpirun=10.release
            Start  8258: mpi/p4est_2d_constraintmatrix_03.mpirun=4.release
11005/11419 Test  #8258: mpi/p4est_2d_constraintmatrix_03.mpirun=4.release ......................................   Passed    2.95 sec
11006/11419 Test  #8260: mpi/p4est_2d_constraintmatrix_04.mpirun=10.release .....................................   Passed   25.96 sec
            Start  8265: mpi/p4est_2d_dofhandler_01.mpirun=10.debug
            Start  8262: mpi/p4est_2d_constraintmatrix_04.mpirun=4.release
11007/11419 Test  #8259: mpi/p4est_2d_constraintmatrix_04.mpirun=10.debug .......................................   Passed   30.11 sec
            Start  8266: mpi/p4est_2d_dofhandler_01.mpirun=10.release
11008/11419 Test  #8262: mpi/p4est_2d_constraintmatrix_04.mpirun=4.release ......................................   Passed    2.97 sec
            Start  8261: mpi/p4est_2d_constraintmatrix_04.mpirun=4.debug
11009/11419 Test  #8261: mpi/p4est_2d_constraintmatrix_04.mpirun=4.debug ........................................   Passed    4.69 sec
11010/11419 Test  #8266: mpi/p4est_2d_dofhandler_01.mpirun=10.release ...........................................   Passed   18.28 sec
            Start  8269: mpi/p4est_2d_dofhandler_02.mpirun=10.debug
            Start  8268: mpi/p4est_2d_dofhandler_01.mpirun=4.release
11011/11419 Test  #8268: mpi/p4est_2d_dofhandler_01.mpirun=4.release ............................................   Passed    2.81 sec
11012/11419 Test  #8265: mpi/p4est_2d_dofhandler_01.mpirun=10.debug .............................................   Passed   22.88 sec
            Start  8270: mpi/p4est_2d_dofhandler_02.mpirun=10.release
            Start  8267: mpi/p4est_2d_dofhandler_01.mpirun=4.debug
11013/11419 Test  #8267: mpi/p4est_2d_dofhandler_01.mpirun=4.debug ..............................................   Passed    2.89 sec
11014/11419 Test  #8270: mpi/p4est_2d_dofhandler_02.mpirun=10.release ...........................................   Passed   18.12 sec
            Start  8273: mpi/p4est_2d_dofhandler_03.mpirun=10.debug
            Start  8272: mpi/p4est_2d_dofhandler_02.mpirun=4.release
11015/11419 Test  #8272: mpi/p4est_2d_dofhandler_02.mpirun=4.release ............................................   Passed    3.06 sec
11016/11419 Test  #8269: mpi/p4est_2d_dofhandler_02.mpirun=10.debug .............................................   Passed   28.13 sec
            Start  8274: mpi/p4est_2d_dofhandler_03.mpirun=10.release
            Start  8271: mpi/p4est_2d_dofhandler_02.mpirun=4.debug
11017/11419 Test  #8271: mpi/p4est_2d_dofhandler_02.mpirun=4.debug ..............................................   Passed    5.06 sec
11018/11419 Test  #8274: mpi/p4est_2d_dofhandler_03.mpirun=10.release ...........................................   Passed   22.05 sec
            Start  8277: mpi/p4est_2d_dofhandler_04.mpirun=10.debug
            Start  8276: mpi/p4est_2d_dofhandler_03.mpirun=4.release
11019/11419 Test  #8273: mpi/p4est_2d_dofhandler_03.mpirun=10.debug .............................................   Passed   29.84 sec
            Start  8278: mpi/p4est_2d_dofhandler_04.mpirun=10.release
11020/11419 Test  #8276: mpi/p4est_2d_dofhandler_03.mpirun=4.release ............................................   Passed    2.95 sec
            Start  8275: mpi/p4est_2d_dofhandler_03.mpirun=4.debug
11021/11419 Test  #8275: mpi/p4est_2d_dofhandler_03.mpirun=4.debug ..............................................   Passed    5.27 sec
11022/11419 Test  #8278: mpi/p4est_2d_dofhandler_04.mpirun=10.release ...........................................   Passed   18.16 sec
            Start  8281: mpi/p4est_2d_dofhandler_05.mpirun=10.debug
            Start  8280: mpi/p4est_2d_dofhandler_04.mpirun=4.release
11023/11419 Test  #8280: mpi/p4est_2d_dofhandler_04.mpirun=4.release ............................................   Passed    2.85 sec
11024/11419 Test  #8277: mpi/p4est_2d_dofhandler_04.mpirun=10.debug .............................................   Passed   27.17 sec
            Start  8282: mpi/p4est_2d_dofhandler_05.mpirun=10.release
            Start  8279: mpi/p4est_2d_dofhandler_04.mpirun=4.debug
11025/11419 Test  #8279: mpi/p4est_2d_dofhandler_04.mpirun=4.debug ..............................................   Passed    5.19 sec
11026/11419 Test  #8281: mpi/p4est_2d_dofhandler_05.mpirun=10.debug .............................................   Passed   19.97 sec
            Start  8285: mpi/p4est_2d_ghost_01.mpirun=10.debug
            Start  8283: mpi/p4est_2d_dofhandler_05.mpirun=4.debug
11027/11419 Test  #8283: mpi/p4est_2d_dofhandler_05.mpirun=4.debug ..............................................   Passed    2.96 sec
11028/11419 Test  #8282: mpi/p4est_2d_dofhandler_05.mpirun=10.release ...........................................   Passed   17.23 sec
            Start  8286: mpi/p4est_2d_ghost_01.mpirun=10.release
            Start  8284: mpi/p4est_2d_dofhandler_05.mpirun=4.release
11029/11419 Test  #8284: mpi/p4est_2d_dofhandler_05.mpirun=4.release ............................................   Passed    2.81 sec
11030/11419 Test  #8285: mpi/p4est_2d_ghost_01.mpirun=10.debug ..................................................   Passed   21.93 sec
            Start  8289: mpi/p4est_2d_ghost_02.mpirun=10.debug
            Start  8287: mpi/p4est_2d_ghost_01.mpirun=4.debug
11031/11419 Test  #8286: mpi/p4est_2d_ghost_01.mpirun=10.release ................................................   Passed   18.18 sec
            Start  8290: mpi/p4est_2d_ghost_02.mpirun=10.release
11032/11419 Test  #8287: mpi/p4est_2d_ghost_01.mpirun=4.debug ...................................................   Passed    2.97 sec
            Start  8288: mpi/p4est_2d_ghost_01.mpirun=4.release
11033/11419 Test  #8288: mpi/p4est_2d_ghost_01.mpirun=4.release .................................................   Passed    2.83 sec
11034/11419 Test  #8290: mpi/p4est_2d_ghost_02.mpirun=10.release ................................................   Passed   18.34 sec
            Start  8293: mpi/p4est_2d_refine_01.mpirun=10.debug
            Start  8292: mpi/p4est_2d_ghost_02.mpirun=4.release
11035/11419 Test  #8292: mpi/p4est_2d_ghost_02.mpirun=4.release .................................................   Passed    2.90 sec
11036/11419 Test  #8289: mpi/p4est_2d_ghost_02.mpirun=10.debug ..................................................   Passed   21.80 sec
            Start  8294: mpi/p4est_2d_refine_01.mpirun=10.release
            Start  8291: mpi/p4est_2d_ghost_02.mpirun=4.debug
11037/11419 Test  #8291: mpi/p4est_2d_ghost_02.mpirun=4.debug ...................................................   Passed    3.15 sec
11038/11419 Test  #8293: mpi/p4est_2d_refine_01.mpirun=10.debug .................................................   Passed   21.67 sec
            Start  8297: mpi/p4est_2d_refine_02.mpirun=10.debug
            Start  8295: mpi/p4est_2d_refine_01.mpirun=4.debug
11039/11419 Test  #8294: mpi/p4est_2d_refine_01.mpirun=10.release ...............................................   Passed   18.39 sec
            Start  8298: mpi/p4est_2d_refine_02.mpirun=10.release
11040/11419 Test  #8295: mpi/p4est_2d_refine_01.mpirun=4.debug ..................................................   Passed    2.93 sec
            Start  8296: mpi/p4est_2d_refine_01.mpirun=4.release
11041/11419 Test  #8296: mpi/p4est_2d_refine_01.mpirun=4.release ................................................   Passed    2.88 sec
11042/11419 Test  #8298: mpi/p4est_2d_refine_02.mpirun=10.release ...............................................   Passed   17.84 sec
            Start  8301: mpi/p4est_2d_refine_03.mpirun=10.debug
            Start  8300: mpi/p4est_2d_refine_02.mpirun=4.release
11043/11419 Test  #8300: mpi/p4est_2d_refine_02.mpirun=4.release ................................................   Passed    2.88 sec
11044/11419 Test  #8297: mpi/p4est_2d_refine_02.mpirun=10.debug .................................................   Passed   22.09 sec
            Start  8302: mpi/p4est_2d_refine_03.mpirun=10.release
            Start  8299: mpi/p4est_2d_refine_02.mpirun=4.debug
11045/11419 Test  #8299: mpi/p4est_2d_refine_02.mpirun=4.debug ..................................................   Passed    3.00 sec
11046/11419 Test  #8301: mpi/p4est_2d_refine_03.mpirun=10.debug .................................................   Passed   22.11 sec
            Start  8305: mpi/p4est_2d_renumber_01.mpirun=10.debug
            Start  8303: mpi/p4est_2d_refine_03.mpirun=4.debug
11047/11419 Test  #8302: mpi/p4est_2d_refine_03.mpirun=10.release ...............................................   Passed   18.08 sec
            Start  8306: mpi/p4est_2d_renumber_01.mpirun=10.release
11048/11419 Test  #8303: mpi/p4est_2d_refine_03.mpirun=4.debug ..................................................   Passed    4.32 sec
            Start  8304: mpi/p4est_2d_refine_03.mpirun=4.release
11049/11419 Test  #8304: mpi/p4est_2d_refine_03.mpirun=4.release ................................................   Passed    2.89 sec
11050/11419 Test  #8306: mpi/p4est_2d_renumber_01.mpirun=10.release .............................................   Passed   20.08 sec
            Start  8309: mpi/p4est_2d_renumber_02.mpirun=10.debug
            Start  8308: mpi/p4est_2d_renumber_01.mpirun=4.release
11051/11419 Test  #8305: mpi/p4est_2d_renumber_01.mpirun=10.debug ...............................................   Passed   22.45 sec
            Start  8310: mpi/p4est_2d_renumber_02.mpirun=10.release
11052/11419 Test  #8308: mpi/p4est_2d_renumber_01.mpirun=4.release ..............................................   Passed    2.90 sec
            Start  8307: mpi/p4est_2d_renumber_01.mpirun=4.debug
11053/11419 Test  #8307: mpi/p4est_2d_renumber_01.mpirun=4.debug ................................................   Passed    3.14 sec
11054/11419 Test  #8309: mpi/p4est_2d_renumber_02.mpirun=10.debug ...............................................   Passed   24.52 sec
            Start  8313: mpi/p4est_2d_simple.mpirun=10.debug
            Start  8311: mpi/p4est_2d_renumber_02.mpirun=4.debug
11055/11419 Test  #8310: mpi/p4est_2d_renumber_02.mpirun=10.release .............................................   Passed   22.66 sec
            Start  8314: mpi/p4est_2d_simple.mpirun=10.release
11056/11419 Test  #8311: mpi/p4est_2d_renumber_02.mpirun=4.debug ................................................   Passed    3.02 sec
            Start  8312: mpi/p4est_2d_renumber_02.mpirun=4.release
11057/11419 Test  #8312: mpi/p4est_2d_renumber_02.mpirun=4.release ..............................................   Passed    2.79 sec
11058/11419 Test  #8314: mpi/p4est_2d_simple.mpirun=10.release ..................................................   Passed   14.11 sec
            Start  8317: mpi/p4est_3d_constraintmatrix_01.mpirun=10.debug
            Start  8316: mpi/p4est_2d_simple.mpirun=4.release
11059/11419 Test  #8313: mpi/p4est_2d_simple.mpirun=10.debug ....................................................   Passed   17.24 sec
            Start  8318: mpi/p4est_3d_constraintmatrix_01.mpirun=10.release
11060/11419 Test  #8316: mpi/p4est_2d_simple.mpirun=4.release ...................................................   Passed    2.82 sec
            Start  8315: mpi/p4est_2d_simple.mpirun=4.debug
11061/11419 Test  #8315: mpi/p4est_2d_simple.mpirun=4.debug .....................................................   Passed    2.90 sec
11062/11419 Test  #8318: mpi/p4est_3d_constraintmatrix_01.mpirun=10.release .....................................   Passed   17.79 sec
            Start  8321: mpi/p4est_3d_constraintmatrix_02.mpirun=10.debug
            Start  8320: mpi/p4est_3d_constraintmatrix_01.mpirun=4.release
11063/11419 Test  #8317: mpi/p4est_3d_constraintmatrix_01.mpirun=10.debug .......................................   Passed   21.93 sec
            Start  8322: mpi/p4est_3d_constraintmatrix_02.mpirun=10.release
11064/11419 Test  #8320: mpi/p4est_3d_constraintmatrix_01.mpirun=4.release ......................................   Passed    2.95 sec
            Start  8319: mpi/p4est_3d_constraintmatrix_01.mpirun=4.debug
11065/11419 Test  #8319: mpi/p4est_3d_constraintmatrix_01.mpirun=4.debug ........................................   Passed    4.38 sec
11066/11419 Test  #8322: mpi/p4est_3d_constraintmatrix_02.mpirun=10.release .....................................   Passed   18.26 sec
            Start  8325: mpi/p4est_3d_constraintmatrix_03.mpirun=10.debug
            Start  8324: mpi/p4est_3d_constraintmatrix_02.mpirun=4.release
11067/11419 Test  #8321: mpi/p4est_3d_constraintmatrix_02.mpirun=10.debug .......................................   Passed   21.00 sec
            Start  8326: mpi/p4est_3d_constraintmatrix_03.mpirun=10.release
11068/11419 Test  #8324: mpi/p4est_3d_constraintmatrix_02.mpirun=4.release ......................................   Passed    2.80 sec
            Start  8323: mpi/p4est_3d_constraintmatrix_02.mpirun=4.debug
11069/11419 Test  #8323: mpi/p4est_3d_constraintmatrix_02.mpirun=4.debug ........................................   Passed    3.14 sec
11070/11419 Test  #8326: mpi/p4est_3d_constraintmatrix_03.mpirun=10.release .....................................   Passed   22.85 sec
            Start  8331: mpi/p4est_3d_ghost_01.mpirun=10.debug
            Start  8328: mpi/p4est_3d_constraintmatrix_03.mpirun=4.release
11071/11419 Test  #8328: mpi/p4est_3d_constraintmatrix_03.mpirun=4.release ......................................   Passed    4.59 sec
11072/11419 Test  #8331: mpi/p4est_3d_ghost_01.mpirun=10.debug ..................................................   Passed   24.68 sec
            Start  8332: mpi/p4est_3d_ghost_01.mpirun=10.release
            Start  8333: mpi/p4est_3d_ghost_01.mpirun=4.debug
11073/11419 Test  #8325: mpi/p4est_3d_constraintmatrix_03.mpirun=10.debug .......................................   Passed   49.08 sec
            Start  8335: mpi/p4est_3d_refine_01.mpirun=10.debug
11074/11419 Test  #8333: mpi/p4est_3d_ghost_01.mpirun=4.debug ...................................................   Passed    3.22 sec
            Start  8327: mpi/p4est_3d_constraintmatrix_03.mpirun=4.debug
11075/11419 Test  #8332: mpi/p4est_3d_ghost_01.mpirun=10.release ................................................   Passed   18.14 sec
            Start  8336: mpi/p4est_3d_refine_01.mpirun=10.release
11076/11419 Test  #8335: mpi/p4est_3d_refine_01.mpirun=10.debug .................................................   Passed   30.63 sec
            Start  8339: mpi/p4est_3d_refine_02.mpirun=10.debug
11077/11419 Test  #8336: mpi/p4est_3d_refine_01.mpirun=10.release ...............................................   Passed   19.13 sec
            Start  8340: mpi/p4est_3d_refine_02.mpirun=10.release
11078/11419 Test  #8327: mpi/p4est_3d_constraintmatrix_03.mpirun=4.debug ........................................   Passed   37.16 sec
            Start  8334: mpi/p4est_3d_ghost_01.mpirun=4.release
11079/11419 Test  #8334: mpi/p4est_3d_ghost_01.mpirun=4.release .................................................   Passed    2.83 sec
            Start  8337: mpi/p4est_3d_refine_01.mpirun=4.debug
11080/11419 Test  #8339: mpi/p4est_3d_refine_02.mpirun=10.debug .................................................   Passed   22.01 sec
            Start  8343: mpi/p4est_3d_refine_03.mpirun=10.debug
11081/11419 Test  #8337: mpi/p4est_3d_refine_01.mpirun=4.debug ..................................................   Passed    9.58 sec
            Start  8338: mpi/p4est_3d_refine_01.mpirun=4.release
11082/11419 Test  #8340: mpi/p4est_3d_refine_02.mpirun=10.release ...............................................   Passed   18.21 sec
            Start  8344: mpi/p4est_3d_refine_03.mpirun=10.release
11083/11419 Test  #8338: mpi/p4est_3d_refine_01.mpirun=4.release ................................................   Passed    3.10 sec
            Start  8341: mpi/p4est_3d_refine_02.mpirun=4.debug
11084/11419 Test  #8341: mpi/p4est_3d_refine_02.mpirun=4.debug ..................................................   Passed    3.02 sec
            Start  8342: mpi/p4est_3d_refine_02.mpirun=4.release
11085/11419 Test  #8342: mpi/p4est_3d_refine_02.mpirun=4.release ................................................   Passed    2.85 sec
11086/11419 Test  #8344: mpi/p4est_3d_refine_03.mpirun=10.release ...............................................   Passed   18.44 sec
            Start  8356: mpi/p4est_data_out_01.mpirun=10.debug
            Start  8346: mpi/p4est_3d_refine_03.mpirun=4.release
11087/11419 Test  #8343: mpi/p4est_3d_refine_03.mpirun=10.debug .................................................   Passed   21.53 sec
            Start  8357: mpi/p4est_data_out_01.mpirun=10.release
11088/11419 Test  #8346: mpi/p4est_3d_refine_03.mpirun=4.release ................................................   Passed    2.92 sec
            Start  8345: mpi/p4est_3d_refine_03.mpirun=4.debug
11089/11419 Test  #8345: mpi/p4est_3d_refine_03.mpirun=4.debug ..................................................   Passed    3.01 sec
11090/11419 Test  #8357: mpi/p4est_data_out_01.mpirun=10.release ................................................   Passed   18.62 sec
            Start  8360: mpi/p4est_get_subdomain_association.mpirun=10.debug
            Start  8359: mpi/p4est_data_out_01.mpirun=4.release
11091/11419 Test  #8359: mpi/p4est_data_out_01.mpirun=4.release .................................................   Passed    2.90 sec
11092/11419 Test  #8356: mpi/p4est_data_out_01.mpirun=10.debug ..................................................   Passed   23.90 sec
            Start  8361: mpi/p4est_get_subdomain_association.mpirun=10.release
            Start  8358: mpi/p4est_data_out_01.mpirun=4.debug
11093/11419 Test  #8358: mpi/p4est_data_out_01.mpirun=4.debug ...................................................   Passed    2.90 sec
11094/11419 Test  #8360: mpi/p4est_get_subdomain_association.mpirun=10.debug ....................................   Passed   23.07 sec
            Start  8368: mpi/p4est_save_01.mpirun=10.debug
            Start  8362: mpi/p4est_get_subdomain_association.mpirun=4.debug
11095/11419 Test  #8361: mpi/p4est_get_subdomain_association.mpirun=10.release ..................................   Passed   18.18 sec
            Start  8369: mpi/p4est_save_01.mpirun=10.release
11096/11419 Test  #8362: mpi/p4est_get_subdomain_association.mpirun=4.debug .....................................   Passed    2.97 sec
            Start  8363: mpi/p4est_get_subdomain_association.mpirun=4.release
11097/11419 Test  #8363: mpi/p4est_get_subdomain_association.mpirun=4.release ...................................   Passed    2.78 sec
11098/11419 Test  #8369: mpi/p4est_save_01.mpirun=10.release ....................................................   Passed   18.05 sec
            Start  8392: mpi/parallel_block_vector_01.mpirun=10.debug
            Start  8371: mpi/p4est_save_01.mpirun=4.release
11099/11419 Test  #8371: mpi/p4est_save_01.mpirun=4.release .....................................................   Passed    2.97 sec
11100/11419 Test  #8392: mpi/parallel_block_vector_01.mpirun=10.debug ...........................................   Passed    3.02 sec
            Start  8393: mpi/parallel_block_vector_01.mpirun=10.release
            Start  8394: mpi/parallel_block_vector_01.mpirun=4.debug
11101/11419 Test  #8368: mpi/p4est_save_01.mpirun=10.debug ......................................................   Passed   21.62 sec
            Start  8398: mpi/parallel_block_vector_02.mpirun=10.debug
11102/11419 Test  #8394: mpi/parallel_block_vector_01.mpirun=4.debug ............................................   Passed    2.88 sec
            Start  8370: mpi/p4est_save_01.mpirun=4.debug
11103/11419 Test  #8393: mpi/parallel_block_vector_01.mpirun=10.release .........................................   Passed    2.93 sec
            Start  8399: mpi/parallel_block_vector_02.mpirun=10.release
11104/11419 Test  #8398: mpi/parallel_block_vector_02.mpirun=10.debug ...........................................   Passed    2.97 sec
            Start  8404: mpi/parallel_block_vector_04.mpirun=10.debug
11105/11419 Test  #8399: mpi/parallel_block_vector_02.mpirun=10.release .........................................   Passed    2.93 sec
            Start  8405: mpi/parallel_block_vector_04.mpirun=10.release
11106/11419 Test  #8370: mpi/p4est_save_01.mpirun=4.debug .......................................................   Passed    3.12 sec
            Start  8395: mpi/parallel_block_vector_01.mpirun=4.release
11107/11419 Test  #8404: mpi/parallel_block_vector_04.mpirun=10.debug ...........................................   Passed    2.98 sec
            Start  8436: mpi/parallel_partitioner_01.mpirun=10.debug
11108/11419 Test  #8405: mpi/parallel_block_vector_04.mpirun=10.release .........................................   Passed    2.79 sec
            Start  8437: mpi/parallel_partitioner_01.mpirun=10.release
11109/11419 Test  #8395: mpi/parallel_block_vector_01.mpirun=4.release ..........................................   Passed    2.80 sec
            Start  8400: mpi/parallel_block_vector_02.mpirun=4.debug
11110/11419 Test  #8400: mpi/parallel_block_vector_02.mpirun=4.debug ............................................   Passed    2.85 sec
            Start  8401: mpi/parallel_block_vector_02.mpirun=4.release
11111/11419 Test  #8401: mpi/parallel_block_vector_02.mpirun=4.release ..........................................   Passed    2.79 sec
            Start  8406: mpi/parallel_block_vector_04.mpirun=4.debug
11112/11419 Test  #8406: mpi/parallel_block_vector_04.mpirun=4.debug ............................................   Passed    2.70 sec
            Start  8407: mpi/parallel_block_vector_04.mpirun=4.release
11113/11419 Test  #8407: mpi/parallel_block_vector_04.mpirun=4.release ..........................................   Passed    2.82 sec
11114/11419 Test  #8436: mpi/parallel_partitioner_01.mpirun=10.debug ............................................   Passed   13.73 sec
            Start  8440: mpi/parallel_partitioner_02.mpirun=10.debug
            Start  8438: mpi/parallel_partitioner_01.mpirun=4.debug
11115/11419 Test  #8437: mpi/parallel_partitioner_01.mpirun=10.release ..........................................   Passed   12.23 sec
            Start  8441: mpi/parallel_partitioner_02.mpirun=10.release
11116/11419 Test  #8438: mpi/parallel_partitioner_01.mpirun=4.debug .............................................   Passed    2.81 sec
            Start  8439: mpi/parallel_partitioner_01.mpirun=4.release
11117/11419 Test  #8439: mpi/parallel_partitioner_01.mpirun=4.release ...........................................   Passed    2.78 sec
11118/11419 Test  #8441: mpi/parallel_partitioner_02.mpirun=10.release ..........................................   Passed   11.69 sec
            Start  8444: mpi/parallel_partitioner_03.mpirun=10.debug
            Start  8443: mpi/parallel_partitioner_02.mpirun=4.release
11119/11419 Test  #8440: mpi/parallel_partitioner_02.mpirun=10.debug ............................................   Passed   13.29 sec
            Start  8445: mpi/parallel_partitioner_03.mpirun=10.release
11120/11419 Test  #8443: mpi/parallel_partitioner_02.mpirun=4.release ...........................................   Passed    2.87 sec
            Start  8442: mpi/parallel_partitioner_02.mpirun=4.debug
11121/11419 Test  #8442: mpi/parallel_partitioner_02.mpirun=4.debug .............................................   Passed    2.90 sec
11122/11419 Test  #8445: mpi/parallel_partitioner_03.mpirun=10.release ..........................................   Passed   11.94 sec
            Start  8450: mpi/parallel_partitioner_04.mpirun=10.debug
            Start  8447: mpi/parallel_partitioner_03.mpirun=4.release
11123/11419 Test  #8444: mpi/parallel_partitioner_03.mpirun=10.debug ............................................   Passed   13.80 sec
            Start  8451: mpi/parallel_partitioner_04.mpirun=10.release
11124/11419 Test  #8447: mpi/parallel_partitioner_03.mpirun=4.release ...........................................   Passed    2.80 sec
            Start  8446: mpi/parallel_partitioner_03.mpirun=4.debug
11125/11419 Test  #8446: mpi/parallel_partitioner_03.mpirun=4.debug .............................................   Passed    2.88 sec
11126/11419 Test  #8451: mpi/parallel_partitioner_04.mpirun=10.release ..........................................   Passed   12.55 sec
            Start  8464: mpi/parallel_vector_01.mpirun=10.debug
            Start  8453: mpi/parallel_partitioner_04.mpirun=4.release
11127/11419 Test  #8450: mpi/parallel_partitioner_04.mpirun=10.debug ............................................   Passed   13.90 sec
            Start  8465: mpi/parallel_vector_01.mpirun=10.release
11128/11419 Test  #8453: mpi/parallel_partitioner_04.mpirun=4.release ...........................................   Passed    2.72 sec
            Start  8452: mpi/parallel_partitioner_04.mpirun=4.debug
11129/11419 Test  #8452: mpi/parallel_partitioner_04.mpirun=4.debug .............................................   Passed    2.97 sec
11130/11419 Test  #8465: mpi/parallel_vector_01.mpirun=10.release ...............................................   Passed   11.62 sec
            Start  8468: mpi/parallel_vector_02.mpirun=10.debug
            Start  8467: mpi/parallel_vector_01.mpirun=4.release
11131/11419 Test  #8464: mpi/parallel_vector_01.mpirun=10.debug .................................................   Passed   13.65 sec
            Start  8469: mpi/parallel_vector_02.mpirun=10.release
11132/11419 Test  #8467: mpi/parallel_vector_01.mpirun=4.release ................................................   Passed    2.83 sec
            Start  8466: mpi/parallel_vector_01.mpirun=4.debug
11133/11419 Test  #8466: mpi/parallel_vector_01.mpirun=4.debug ..................................................   Passed    2.91 sec
11134/11419 Test  #8469: mpi/parallel_vector_02.mpirun=10.release ...............................................   Passed   11.82 sec
            Start  8472: mpi/parallel_vector_03.mpirun=10.debug
            Start  8471: mpi/parallel_vector_02.mpirun=4.release
11135/11419 Test  #8468: mpi/parallel_vector_02.mpirun=10.debug .................................................   Passed   13.50 sec
            Start  8473: mpi/parallel_vector_03.mpirun=10.release
11136/11419 Test  #8471: mpi/parallel_vector_02.mpirun=4.release ................................................   Passed    2.83 sec
            Start  8470: mpi/parallel_vector_02.mpirun=4.debug
11137/11419 Test  #8470: mpi/parallel_vector_02.mpirun=4.debug ..................................................   Passed    2.86 sec
11138/11419 Test  #8473: mpi/parallel_vector_03.mpirun=10.release ...............................................   Passed   11.94 sec
            Start  8478: mpi/parallel_vector_04.mpirun=10.debug
            Start  8475: mpi/parallel_vector_03.mpirun=4.release
11139/11419 Test  #8472: mpi/parallel_vector_03.mpirun=10.debug .................................................   Passed   13.77 sec
            Start  8479: mpi/parallel_vector_04.mpirun=10.release
11140/11419 Test  #8475: mpi/parallel_vector_03.mpirun=4.release ................................................   Passed    2.86 sec
            Start  8474: mpi/parallel_vector_03.mpirun=4.debug
11141/11419 Test  #8474: mpi/parallel_vector_03.mpirun=4.debug ..................................................   Passed    2.94 sec
11142/11419 Test  #8479: mpi/parallel_vector_04.mpirun=10.release ...............................................   Passed   12.18 sec
            Start  8482: mpi/parallel_vector_05.mpirun=10.debug
            Start  8481: mpi/parallel_vector_04.mpirun=4.release
11143/11419 Test  #8478: mpi/parallel_vector_04.mpirun=10.debug .................................................   Passed   14.06 sec
            Start  8483: mpi/parallel_vector_05.mpirun=10.release
11144/11419 Test  #8481: mpi/parallel_vector_04.mpirun=4.release ................................................   Passed    2.78 sec
            Start  8480: mpi/parallel_vector_04.mpirun=4.debug
11145/11419 Test  #8480: mpi/parallel_vector_04.mpirun=4.debug ..................................................   Passed    2.98 sec
11146/11419 Test  #8483: mpi/parallel_vector_05.mpirun=10.release ...............................................   Passed   11.70 sec
            Start  8488: mpi/parallel_vector_06.mpirun=10.debug
            Start  8485: mpi/parallel_vector_05.mpirun=4.release
11147/11419 Test  #8482: mpi/parallel_vector_05.mpirun=10.debug .................................................   Passed   13.71 sec
            Start  8489: mpi/parallel_vector_06.mpirun=10.release
11148/11419 Test  #8485: mpi/parallel_vector_05.mpirun=4.release ................................................   Passed    2.87 sec
            Start  8484: mpi/parallel_vector_05.mpirun=4.debug
11149/11419 Test  #8488: mpi/parallel_vector_06.mpirun=10.debug .................................................   Passed    2.96 sec
            Start  8492: mpi/parallel_vector_07.mpirun=10.debug
11150/11419 Test  #8489: mpi/parallel_vector_06.mpirun=10.release ...............................................   Passed    2.80 sec
            Start  8493: mpi/parallel_vector_07.mpirun=10.release
11151/11419 Test  #8484: mpi/parallel_vector_05.mpirun=4.debug ..................................................   Passed    2.89 sec
            Start  8490: mpi/parallel_vector_06.mpirun=4.debug
11152/11419 Test  #8490: mpi/parallel_vector_06.mpirun=4.debug ..................................................   Passed    2.87 sec
            Start  8491: mpi/parallel_vector_06.mpirun=4.release
11153/11419 Test  #8491: mpi/parallel_vector_06.mpirun=4.release ................................................   Passed    2.79 sec
11154/11419 Test  #8492: mpi/parallel_vector_07.mpirun=10.debug .................................................   Passed   13.81 sec
            Start  8496: mpi/parallel_vector_08.mpirun=10.debug
            Start  8494: mpi/parallel_vector_07.mpirun=4.debug
11155/11419 Test  #8493: mpi/parallel_vector_07.mpirun=10.release ...............................................   Passed   12.37 sec
            Start  8497: mpi/parallel_vector_08.mpirun=10.release
11156/11419 Test  #8494: mpi/parallel_vector_07.mpirun=4.debug ..................................................   Passed    2.86 sec
            Start  8495: mpi/parallel_vector_07.mpirun=4.release
11157/11419 Test  #8495: mpi/parallel_vector_07.mpirun=4.release ................................................   Passed    2.78 sec
11158/11419 Test  #8497: mpi/parallel_vector_08.mpirun=10.release ...............................................   Passed   12.64 sec
            Start  8500: mpi/parallel_vector_09.mpirun=10.debug
            Start  8499: mpi/parallel_vector_08.mpirun=4.release
11159/11419 Test  #8496: mpi/parallel_vector_08.mpirun=10.debug .................................................   Passed   13.84 sec
            Start  8501: mpi/parallel_vector_09.mpirun=10.release
11160/11419 Test  #8499: mpi/parallel_vector_08.mpirun=4.release ................................................   Passed    2.84 sec
            Start  8498: mpi/parallel_vector_08.mpirun=4.debug
11161/11419 Test  #8498: mpi/parallel_vector_08.mpirun=4.debug ..................................................   Passed    2.84 sec
11162/11419 Test  #8501: mpi/parallel_vector_09.mpirun=10.release ...............................................   Passed   11.93 sec
            Start  8504: mpi/parallel_vector_10.mpirun=10.debug
            Start  8503: mpi/parallel_vector_09.mpirun=4.release
11163/11419 Test  #8500: mpi/parallel_vector_09.mpirun=10.debug .................................................   Passed   13.48 sec
            Start  8505: mpi/parallel_vector_10.mpirun=10.release
11164/11419 Test  #8503: mpi/parallel_vector_09.mpirun=4.release ................................................   Passed    2.87 sec
            Start  8502: mpi/parallel_vector_09.mpirun=4.debug
11165/11419 Test  #8502: mpi/parallel_vector_09.mpirun=4.debug ..................................................   Passed    2.96 sec
11166/11419 Test  #8505: mpi/parallel_vector_10.mpirun=10.release ...............................................   Passed   11.44 sec
            Start  8508: mpi/parallel_vector_11.mpirun=10.debug
            Start  8507: mpi/parallel_vector_10.mpirun=4.release
11167/11419 Test  #8504: mpi/parallel_vector_10.mpirun=10.debug .................................................   Passed   13.50 sec
            Start  8509: mpi/parallel_vector_11.mpirun=10.release
11168/11419 Test  #8507: mpi/parallel_vector_10.mpirun=4.release ................................................   Passed    2.81 sec
            Start  8506: mpi/parallel_vector_10.mpirun=4.debug
11169/11419 Test  #8506: mpi/parallel_vector_10.mpirun=4.debug ..................................................   Passed    2.95 sec
11170/11419 Test  #8509: mpi/parallel_vector_11.mpirun=10.release ...............................................   Passed   11.81 sec
            Start  8514: mpi/parallel_vector_12.mpirun=10.debug
            Start  8511: mpi/parallel_vector_11.mpirun=4.release
11171/11419 Test  #8508: mpi/parallel_vector_11.mpirun=10.debug .................................................   Passed   13.78 sec
            Start  8515: mpi/parallel_vector_12.mpirun=10.release
11172/11419 Test  #8511: mpi/parallel_vector_11.mpirun=4.release ................................................   Passed    2.91 sec
            Start  8510: mpi/parallel_vector_11.mpirun=4.debug
11173/11419 Test  #8514: mpi/parallel_vector_12.mpirun=10.debug .................................................   Passed    3.05 sec
            Start  8518: mpi/parallel_vector_13.mpirun=10.debug
11174/11419 Test  #8515: mpi/parallel_vector_12.mpirun=10.release ...............................................   Passed    2.94 sec
            Start  8519: mpi/parallel_vector_13.mpirun=10.release
11175/11419 Test  #8510: mpi/parallel_vector_11.mpirun=4.debug ..................................................   Passed    2.94 sec
            Start  8516: mpi/parallel_vector_12.mpirun=4.debug
11176/11419 Test  #8516: mpi/parallel_vector_12.mpirun=4.debug ..................................................   Passed    2.86 sec
            Start  8517: mpi/parallel_vector_12.mpirun=4.release
11177/11419 Test  #8517: mpi/parallel_vector_12.mpirun=4.release ................................................   Passed    2.77 sec
11178/11419 Test  #8519: mpi/parallel_vector_13.mpirun=10.release ...............................................   Passed   11.76 sec
            Start  8534: mpi/parallel_vector_18.mpirun=10.debug
            Start  8521: mpi/parallel_vector_13.mpirun=4.release
11179/11419 Test  #8518: mpi/parallel_vector_13.mpirun=10.debug .................................................   Passed   13.77 sec
            Start  8535: mpi/parallel_vector_18.mpirun=10.release
11180/11419 Test  #8521: mpi/parallel_vector_13.mpirun=4.release ................................................   Passed    2.78 sec
            Start  8520: mpi/parallel_vector_13.mpirun=4.debug
11181/11419 Test  #8534: mpi/parallel_vector_18.mpirun=10.debug .................................................   Passed    2.90 sec
            Start  8540: mpi/parallel_vector_19.mpirun=10.debug
11182/11419 Test  #8535: mpi/parallel_vector_18.mpirun=10.release ...............................................   Passed    2.80 sec
            Start  8541: mpi/parallel_vector_19.mpirun=10.release
11183/11419 Test  #8520: mpi/parallel_vector_13.mpirun=4.debug ..................................................   Passed    2.90 sec
            Start  8536: mpi/parallel_vector_18.mpirun=4.debug
11184/11419 Test  #8540: mpi/parallel_vector_19.mpirun=10.debug .................................................   Passed    2.88 sec
            Start  8548: mpi/parallel_vector_22.mpirun=10.debug
11185/11419 Test  #8541: mpi/parallel_vector_19.mpirun=10.release ...............................................   Passed    2.99 sec
            Start  8549: mpi/parallel_vector_22.mpirun=10.release
11186/11419 Test  #8536: mpi/parallel_vector_18.mpirun=4.debug ..................................................   Passed    2.94 sec
            Start  8537: mpi/parallel_vector_18.mpirun=4.release
11187/11419 Test  #8537: mpi/parallel_vector_18.mpirun=4.release ................................................   Passed    2.74 sec
            Start  8542: mpi/parallel_vector_19.mpirun=4.debug
11188/11419 Test  #8542: mpi/parallel_vector_19.mpirun=4.debug ..................................................   Passed    2.88 sec
            Start  8543: mpi/parallel_vector_19.mpirun=4.release
11189/11419 Test  #8543: mpi/parallel_vector_19.mpirun=4.release ................................................   Passed    2.78 sec
11190/11419 Test  #8548: mpi/parallel_vector_22.mpirun=10.debug .................................................   Passed   13.53 sec
            Start  8610: mpi/refine_and_coarsen_fixed_fraction_01.mpirun=10.debug
            Start  8550: mpi/parallel_vector_22.mpirun=4.debug
11191/11419 Test  #8549: mpi/parallel_vector_22.mpirun=10.release ...............................................   Passed   12.15 sec
            Start  8611: mpi/refine_and_coarsen_fixed_fraction_01.mpirun=10.release
11192/11419 Test  #8550: mpi/parallel_vector_22.mpirun=4.debug ..................................................   Passed    2.93 sec
            Start  8551: mpi/parallel_vector_22.mpirun=4.release
11193/11419 Test  #8551: mpi/parallel_vector_22.mpirun=4.release ................................................   Passed    2.80 sec
11194/11419 Test  #8611: mpi/refine_and_coarsen_fixed_fraction_01.mpirun=10.release .............................   Passed   18.51 sec
            Start  8614: mpi/refine_and_coarsen_fixed_fraction_02.mpirun=10.debug
            Start  8613: mpi/refine_and_coarsen_fixed_fraction_01.mpirun=4.release
11195/11419 Test  #8613: mpi/refine_and_coarsen_fixed_fraction_01.mpirun=4.release ..............................   Passed    2.86 sec
11196/11419 Test  #8610: mpi/refine_and_coarsen_fixed_fraction_01.mpirun=10.debug ...............................   Passed   22.19 sec
            Start  8615: mpi/refine_and_coarsen_fixed_fraction_02.mpirun=10.release
            Start  8612: mpi/refine_and_coarsen_fixed_fraction_01.mpirun=4.debug
11197/11419 Test  #8612: mpi/refine_and_coarsen_fixed_fraction_01.mpirun=4.debug ................................   Passed    3.03 sec
11198/11419 Test  #8615: mpi/refine_and_coarsen_fixed_fraction_02.mpirun=10.release .............................   Passed   18.82 sec
            Start  8618: mpi/refine_and_coarsen_fixed_fraction_03.mpirun=10.debug
            Start  8617: mpi/refine_and_coarsen_fixed_fraction_02.mpirun=4.release
11199/11419 Test  #8614: mpi/refine_and_coarsen_fixed_fraction_02.mpirun=10.debug ...............................   Passed   22.39 sec
            Start  8619: mpi/refine_and_coarsen_fixed_fraction_03.mpirun=10.release
11200/11419 Test  #8617: mpi/refine_and_coarsen_fixed_fraction_02.mpirun=4.release ..............................   Passed    2.93 sec
            Start  8616: mpi/refine_and_coarsen_fixed_fraction_02.mpirun=4.debug
11201/11419 Test  #8616: mpi/refine_and_coarsen_fixed_fraction_02.mpirun=4.debug ................................   Passed    3.01 sec
11202/11419 Test  #8619: mpi/refine_and_coarsen_fixed_fraction_03.mpirun=10.release .............................   Passed   18.61 sec
            Start  8638: mpi/refine_and_coarsen_fixed_number_01.mpirun=10.debug
            Start  8621: mpi/refine_and_coarsen_fixed_fraction_03.mpirun=4.release
11203/11419 Test  #8621: mpi/refine_and_coarsen_fixed_fraction_03.mpirun=4.release ..............................   Passed    2.82 sec
11204/11419 Test  #8618: mpi/refine_and_coarsen_fixed_fraction_03.mpirun=10.debug ...............................   Passed   22.22 sec
            Start  8639: mpi/refine_and_coarsen_fixed_number_01.mpirun=10.release
            Start  8620: mpi/refine_and_coarsen_fixed_fraction_03.mpirun=4.debug
11205/11419 Test  #8620: mpi/refine_and_coarsen_fixed_fraction_03.mpirun=4.debug ................................   Passed    3.01 sec
11206/11419 Test  #8639: mpi/refine_and_coarsen_fixed_number_01.mpirun=10.release ...............................   Passed   18.62 sec
            Start  8642: mpi/refine_and_coarsen_fixed_number_02.mpirun=10.debug
            Start  8641: mpi/refine_and_coarsen_fixed_number_01.mpirun=4.release
11207/11419 Test  #8638: mpi/refine_and_coarsen_fixed_number_01.mpirun=10.debug .................................   Passed   22.35 sec
            Start  8643: mpi/refine_and_coarsen_fixed_number_02.mpirun=10.release
11208/11419 Test  #8641: mpi/refine_and_coarsen_fixed_number_01.mpirun=4.release ................................   Passed    2.94 sec
            Start  8640: mpi/refine_and_coarsen_fixed_number_01.mpirun=4.debug
11209/11419 Test  #8640: mpi/refine_and_coarsen_fixed_number_01.mpirun=4.debug ..................................   Passed    2.94 sec
11210/11419 Test  #8643: mpi/refine_and_coarsen_fixed_number_02.mpirun=10.release ...............................   Passed   18.30 sec
            Start  8646: mpi/refine_and_coarsen_fixed_number_03.mpirun=10.debug
            Start  8645: mpi/refine_and_coarsen_fixed_number_02.mpirun=4.release
11211/11419 Test  #8645: mpi/refine_and_coarsen_fixed_number_02.mpirun=4.release ................................   Passed    2.85 sec
11212/11419 Test  #8642: mpi/refine_and_coarsen_fixed_number_02.mpirun=10.debug .................................   Passed   22.17 sec
            Start  8647: mpi/refine_and_coarsen_fixed_number_03.mpirun=10.release
            Start  8644: mpi/refine_and_coarsen_fixed_number_02.mpirun=4.debug
11213/11419 Test  #8644: mpi/refine_and_coarsen_fixed_number_02.mpirun=4.debug ..................................   Passed    2.99 sec
11214/11419 Test  #8647: mpi/refine_and_coarsen_fixed_number_03.mpirun=10.release ...............................   Passed   17.89 sec
            Start  8656: mpi/refine_and_coarsen_fixed_number_06.mpirun=10.debug
            Start  8649: mpi/refine_and_coarsen_fixed_number_03.mpirun=4.release
11215/11419 Test  #8646: mpi/refine_and_coarsen_fixed_number_03.mpirun=10.debug .................................   Passed   22.11 sec
            Start  8657: mpi/refine_and_coarsen_fixed_number_06.mpirun=10.release
11216/11419 Test  #8649: mpi/refine_and_coarsen_fixed_number_03.mpirun=4.release ................................   Passed    3.05 sec
            Start  8648: mpi/refine_and_coarsen_fixed_number_03.mpirun=4.debug
11217/11419 Test  #8656: mpi/refine_and_coarsen_fixed_number_06.mpirun=10.debug .................................   Passed    3.20 sec
            Start  8662: mpi/refine_and_coarsen_fixed_number_07.mpirun=10.debug
11218/11419 Test  #8657: mpi/refine_and_coarsen_fixed_number_06.mpirun=10.release ...............................   Passed    2.86 sec
            Start  8663: mpi/refine_and_coarsen_fixed_number_07.mpirun=10.release
11219/11419 Test  #8648: mpi/refine_and_coarsen_fixed_number_03.mpirun=4.debug ..................................   Passed    3.07 sec
            Start  8658: mpi/refine_and_coarsen_fixed_number_06.mpirun=4.debug
11220/11419 Test  #8663: mpi/refine_and_coarsen_fixed_number_07.mpirun=10.release ...............................   Passed    5.45 sec
            Start  8692: mpi/renumber_z_order_01.mpirun=10.debug
11221/11419 Test  #8662: mpi/refine_and_coarsen_fixed_number_07.mpirun=10.debug .................................   Passed    5.83 sec
            Start  8693: mpi/renumber_z_order_01.mpirun=10.release
11222/11419 Test  #8658: mpi/refine_and_coarsen_fixed_number_06.mpirun=4.debug ..................................   Passed    3.22 sec
            Start  8659: mpi/refine_and_coarsen_fixed_number_06.mpirun=4.release
11223/11419 Test  #8692: mpi/renumber_z_order_01.mpirun=10.debug ................................................   Passed    3.24 sec
            Start  8698: mpi/renumber_z_order_02.mpirun=10.debug
11224/11419 Test  #8693: mpi/renumber_z_order_01.mpirun=10.release ..............................................   Passed    3.12 sec
            Start  8699: mpi/renumber_z_order_02.mpirun=10.release
11225/11419 Test  #8659: mpi/refine_and_coarsen_fixed_number_06.mpirun=4.release ................................   Passed    3.00 sec
            Start  8664: mpi/refine_and_coarsen_fixed_number_07.mpirun=4.debug
11226/11419 Test  #8699: mpi/renumber_z_order_02.mpirun=10.release ..............................................   Passed    3.88 sec
            Start  8774: mpi/tria_ghost_owners_02.mpirun=11.debug
11227/11419 Test  #8698: mpi/renumber_z_order_02.mpirun=10.debug ................................................   Passed    3.95 sec
            Start  8775: mpi/tria_ghost_owners_02.mpirun=11.release
11228/11419 Test  #8664: mpi/refine_and_coarsen_fixed_number_07.mpirun=4.debug ..................................   Passed    4.27 sec
            Start  8665: mpi/refine_and_coarsen_fixed_number_07.mpirun=4.release
11229/11419 Test  #8665: mpi/refine_and_coarsen_fixed_number_07.mpirun=4.release ................................   Passed    2.93 sec
            Start  8694: mpi/renumber_z_order_01.mpirun=4.debug
11230/11419 Test  #8694: mpi/renumber_z_order_01.mpirun=4.debug .................................................   Passed    2.93 sec
            Start  8695: mpi/renumber_z_order_01.mpirun=4.release
11231/11419 Test  #8695: mpi/renumber_z_order_01.mpirun=4.release ...............................................   Passed    2.69 sec
            Start  8700: mpi/renumber_z_order_02.mpirun=4.debug
11232/11419 Test  #8700: mpi/renumber_z_order_02.mpirun=4.debug .................................................   Passed    2.82 sec
            Start  8701: mpi/renumber_z_order_02.mpirun=4.release
11233/11419 Test  #8701: mpi/renumber_z_order_02.mpirun=4.release ...............................................   Passed    2.82 sec
11234/11419 Test  #8775: mpi/tria_ghost_owners_02.mpirun=11.release .............................................   Passed   19.26 sec
            Start  8780: mpi/tria_signals_01.mpirun=11.debug
            Start  8777: mpi/tria_ghost_owners_02.mpirun=5.release
11235/11419 Test  #8777: mpi/tria_ghost_owners_02.mpirun=5.release ..............................................   Passed    3.22 sec
11236/11419 Test  #8780: mpi/tria_signals_01.mpirun=11.debug ....................................................   Passed    3.82 sec
            Start  8781: mpi/tria_signals_01.mpirun=11.release
            Start  8782: mpi/tria_signals_01.mpirun=4.debug
11237/11419 Test  #8782: mpi/tria_signals_01.mpirun=4.debug .....................................................   Passed    4.11 sec
11238/11419 Test  #8781: mpi/tria_signals_01.mpirun=11.release ..................................................   Passed    7.52 sec
            Start  8786: mpi/tria_signals_02.mpirun=11.debug
            Start  8783: mpi/tria_signals_01.mpirun=4.release
11239/11419 Test  #8774: mpi/tria_ghost_owners_02.mpirun=11.debug ...............................................   Passed   30.65 sec
            Start  8787: mpi/tria_signals_02.mpirun=11.release
11240/11419 Test  #8783: mpi/tria_signals_01.mpirun=4.release ...................................................   Passed    3.20 sec
            Start  8776: mpi/tria_ghost_owners_02.mpirun=5.debug
11241/11419 Test  #8787: mpi/tria_signals_02.mpirun=11.release ..................................................   Passed    9.11 sec
            Start  8792: mpi/tria_signals_03.mpirun=11.debug
11242/11419 Test  #8786: mpi/tria_signals_02.mpirun=11.debug ....................................................   Passed    9.20 sec
            Start  8793: mpi/tria_signals_03.mpirun=11.release
11243/11419 Test  #8776: mpi/tria_ghost_owners_02.mpirun=5.debug ................................................   Passed   17.02 sec
            Start  8788: mpi/tria_signals_02.mpirun=4.debug
11244/11419 Test  #8788: mpi/tria_signals_02.mpirun=4.debug .....................................................   Passed    6.20 sec
            Start  8789: mpi/tria_signals_02.mpirun=4.release
11245/11419 Test  #8789: mpi/tria_signals_02.mpirun=4.release ...................................................   Passed    5.87 sec
11246/11419 Test  #8793: mpi/tria_signals_03.mpirun=11.release ..................................................   Passed   26.14 sec
            Start  8798: mpi/tria_signals_04.mpirun=11.debug
            Start  8795: mpi/tria_signals_03.mpirun=4.release
11247/11419 Test  #8795: mpi/tria_signals_03.mpirun=4.release ...................................................   Passed    5.17 sec
11248/11419 Test  #8792: mpi/tria_signals_03.mpirun=11.debug ....................................................   Passed   66.76 sec
            Start  8799: mpi/tria_signals_04.mpirun=11.release
            Start  8794: mpi/tria_signals_03.mpirun=4.debug
11249/11419 Test  #8799: mpi/tria_signals_04.mpirun=11.release ..................................................   Passed   25.07 sec
            Start  8804: mpi/tria_signals_05.mpirun=11.debug
11250/11419 Test  #8798: mpi/tria_signals_04.mpirun=11.debug ....................................................   Passed   65.98 sec
            Start  8805: mpi/tria_signals_05.mpirun=11.release
11251/11419 Test  #8804: mpi/tria_signals_05.mpirun=11.debug ....................................................   Passed    4.25 sec
            Start  8814: mpi/trilinos_02.mpirun=10.debug
11252/11419 Test  #8805: mpi/tria_signals_05.mpirun=11.release ..................................................   Passed    3.92 sec
            Start  8815: mpi/trilinos_02.mpirun=10.release
11253/11419 Test  #8815: mpi/trilinos_02.mpirun=10.release ......................................................   Passed   11.65 sec
            Start  8854: mpi/trilinos_ghost_01.mpirun=10.debug
11254/11419 Test  #8814: mpi/trilinos_02.mpirun=10.debug ........................................................   Passed   13.29 sec
            Start  8855: mpi/trilinos_ghost_01.mpirun=10.release
11255/11419 Test  #8854: mpi/trilinos_ghost_01.mpirun=10.debug ..................................................   Passed   13.92 sec
            Start  8858: mpi/trilinos_ghost_02.mpirun=10.debug
11256/11419 Test  #8855: mpi/trilinos_ghost_01.mpirun=10.release ................................................   Passed   12.39 sec
            Start  8859: mpi/trilinos_ghost_02.mpirun=10.release
11257/11419 Test  #8794: mpi/tria_signals_03.mpirun=4.debug .....................................................   Passed   59.71 sec
            Start  8800: mpi/tria_signals_04.mpirun=4.debug
11258/11419 Test  #8859: mpi/trilinos_ghost_02.mpirun=10.release ................................................   Passed   12.07 sec
            Start  8862: mpi/trilinos_ghost_03.mpirun=10.debug
11259/11419 Test  #8858: mpi/trilinos_ghost_02.mpirun=10.debug ..................................................   Passed   13.62 sec
            Start  8864: mpi/trilinos_ghost_03_linfty.mpirun=10.debug
11260/11419 Test  #8862: mpi/trilinos_ghost_03.mpirun=10.debug ..................................................   Passed   13.58 sec
            Start  8866: mpi/trilinos_ghost_05.mpirun=10.debug
11261/11419 Test  #8864: mpi/trilinos_ghost_03_linfty.mpirun=10.debug ...........................................   Passed   13.59 sec
            Start  8867: mpi/trilinos_ghost_05.mpirun=10.release
11262/11419 Test  #8867: mpi/trilinos_ghost_05.mpirun=10.release ................................................   Passed   12.30 sec
            Start  9107: multigrid/transfer_matrix_free_06.mpirun=10.debug
11263/11419 Test  #8866: mpi/trilinos_ghost_05.mpirun=10.debug ..................................................   Passed   13.89 sec
            Start  9108: multigrid/transfer_matrix_free_06.mpirun=10.release
11264/11419 Test  #8800: mpi/tria_signals_04.mpirun=4.debug .....................................................   Passed   53.71 sec
            Start  8801: mpi/tria_signals_04.mpirun=4.release
11265/11419 Test  #9108: multigrid/transfer_matrix_free_06.mpirun=10.release ....................................   Passed   22.56 sec
            Start  6253: lac/diagonal_matrix_02.mpirun=7.debug
            Start  8806: mpi/tria_signals_05.mpirun=4.debug
11266/11419 Test  #8801: mpi/tria_signals_04.mpirun=4.release ...................................................   Passed    4.20 sec
            Start  8807: mpi/tria_signals_05.mpirun=4.release
11267/11419 Test  #6253: lac/diagonal_matrix_02.mpirun=7.debug ..................................................   Passed    1.46 sec
            Start  6254: lac/diagonal_matrix_02.mpirun=7.release
11268/11419 Test  #6254: lac/diagonal_matrix_02.mpirun=7.release ................................................   Passed    1.19 sec
            Start  7060: matrix_free/cell_categorization.mpirun=7.debug
11269/11419 Test  #8806: mpi/tria_signals_05.mpirun=4.debug .....................................................   Passed    3.53 sec
            Start  8816: mpi/trilinos_02.mpirun=4.debug
11270/11419 Test  #8807: mpi/tria_signals_05.mpirun=4.release ...................................................   Passed    3.10 sec
            Start  8817: mpi/trilinos_02.mpirun=4.release
11271/11419 Test  #8817: mpi/trilinos_02.mpirun=4.release .......................................................   Passed    3.99 sec
            Start  8856: mpi/trilinos_ghost_01.mpirun=4.debug
11272/11419 Test  #8816: mpi/trilinos_02.mpirun=4.debug .........................................................   Passed    4.26 sec
            Start  8857: mpi/trilinos_ghost_01.mpirun=4.release
11273/11419 Test  #7060: matrix_free/cell_categorization.mpirun=7.debug .........................................   Passed    7.38 sec
            Start  7061: matrix_free/cell_categorization.mpirun=7.release
11274/11419 Test  #8857: mpi/trilinos_ghost_01.mpirun=4.release .................................................   Passed    3.40 sec
            Start  8860: mpi/trilinos_ghost_02.mpirun=4.debug
11275/11419 Test  #8856: mpi/trilinos_ghost_01.mpirun=4.debug ...................................................   Passed    3.70 sec
            Start  8861: mpi/trilinos_ghost_02.mpirun=4.release
11276/11419 Test  #9107: multigrid/transfer_matrix_free_06.mpirun=10.debug ......................................   Passed   34.03 sec
            Start  7066: matrix_free/cell_categorization_02.mpirun=7.debug
            Start  8863: mpi/trilinos_ghost_03.mpirun=4.debug
11277/11419 Test  #7061: matrix_free/cell_categorization.mpirun=7.release .......................................   Passed    1.62 sec
            Start  7067: matrix_free/cell_categorization_02.mpirun=7.release
11278/11419 Test  #7067: matrix_free/cell_categorization_02.mpirun=7.release ....................................   Passed    2.50 sec
            Start  7096: matrix_free/dg_pbc_01.mpirun=7.debug
11279/11419 Test  #8861: mpi/trilinos_ghost_02.mpirun=4.release .................................................   Passed    3.09 sec
            Start  8865: mpi/trilinos_ghost_03_linfty.mpirun=4.debug
11280/11419 Test  #8860: mpi/trilinos_ghost_02.mpirun=4.debug ...................................................   Passed    3.27 sec
            Start  8868: mpi/trilinos_ghost_05.mpirun=4.debug
11281/11419 Test  #8863: mpi/trilinos_ghost_03.mpirun=4.debug ...................................................   Passed    3.13 sec
            Start  8869: mpi/trilinos_ghost_05.mpirun=4.release
11282/11419 Test  #7096: matrix_free/dg_pbc_01.mpirun=7.debug ...................................................   Passed    3.38 sec
            Start  7097: matrix_free/dg_pbc_01.mpirun=7.release
11283/11419 Test  #8869: mpi/trilinos_ghost_05.mpirun=4.release .................................................   Passed    3.16 sec
            Start  9109: multigrid/transfer_matrix_free_06.mpirun=5.debug
11284/11419 Test  #8865: mpi/trilinos_ghost_03_linfty.mpirun=4.debug ............................................   Passed    3.29 sec
            Start  9110: multigrid/transfer_matrix_free_06.mpirun=5.release
11285/11419 Test  #8868: mpi/trilinos_ghost_05.mpirun=4.debug ...................................................   Passed    3.31 sec
11286/11419 Test  #9110: multigrid/transfer_matrix_free_06.mpirun=5.release .....................................   Passed    5.30 sec
            Start  7100: matrix_free/dg_pbc_02.mpirun=7.debug
11287/11419 Test  #7097: matrix_free/dg_pbc_01.mpirun=7.release .................................................   Passed    8.19 sec
            Start  7101: matrix_free/dg_pbc_02.mpirun=7.release
11288/11419 Test  #7066: matrix_free/cell_categorization_02.mpirun=7.debug ......................................   Passed   14.47 sec
            Start  7447: matrix_free/parallel_multigrid.mpirun=7.debug
11289/11419 Test  #7100: matrix_free/dg_pbc_02.mpirun=7.debug ...................................................   Passed    3.72 sec
            Start  7448: matrix_free/parallel_multigrid.mpirun=7.release
11290/11419 Test  #9109: multigrid/transfer_matrix_free_06.mpirun=5.debug .......................................   Passed    9.93 sec
            Start  7451: matrix_free/parallel_multigrid_02.mpirun=7.debug
11291/11419 Test  #7101: matrix_free/dg_pbc_02.mpirun=7.release .................................................   Passed    2.03 sec
            Start  7452: matrix_free/parallel_multigrid_02.mpirun=7.release
11292/11419 Test  #7448: matrix_free/parallel_multigrid.mpirun=7.release ........................................   Passed    2.75 sec
            Start  7455: matrix_free/parallel_multigrid_adaptive_01.mpirun=7.debug
11293/11419 Test  #7452: matrix_free/parallel_multigrid_02.mpirun=7.release .....................................   Passed   44.71 sec
            Start  7456: matrix_free/parallel_multigrid_adaptive_01.mpirun=7.release
11294/11419 Test  #7451: matrix_free/parallel_multigrid_02.mpirun=7.debug .......................................   Passed   62.94 sec
            Start  7459: matrix_free/parallel_multigrid_adaptive_02.mpirun=7.debug
11295/11419 Test  #7447: matrix_free/parallel_multigrid.mpirun=7.debug ..........................................   Passed   95.63 sec
            Start  7460: matrix_free/parallel_multigrid_adaptive_02.mpirun=7.release
11296/11419 Test  #7456: matrix_free/parallel_multigrid_adaptive_01.mpirun=7.release ............................   Passed   58.48 sec
            Start  7477: matrix_free/parallel_multigrid_mf.mpirun=7.debug
11297/11419 Test  #7460: matrix_free/parallel_multigrid_adaptive_02.mpirun=7.release ............................   Passed   28.19 sec
            Start  7478: matrix_free/parallel_multigrid_mf.mpirun=7.release
11298/11419 Test  #7455: matrix_free/parallel_multigrid_adaptive_01.mpirun=7.debug ..............................   Passed  139.39 sec
            Start  7911: mpi/derivative_approximation_02.mpirun=7.debug
11299/11419 Test  #7911: mpi/derivative_approximation_02.mpirun=7.debug .........................................   Passed    3.14 sec
            Start  7912: mpi/derivative_approximation_02.mpirun=7.release
11300/11419 Test  #7912: mpi/derivative_approximation_02.mpirun=7.release .......................................   Passed    2.96 sec
            Start  8003: mpi/has_hanging_nodes.mpirun=7.debug
11301/11419 Test  #8003: mpi/has_hanging_nodes.mpirun=7.debug ...................................................   Passed    4.50 sec
            Start  8004: mpi/has_hanging_nodes.mpirun=7.release
11302/11419 Test  #8004: mpi/has_hanging_nodes.mpirun=7.release .................................................   Passed    3.22 sec
            Start  8081: mpi/hp_unify_dof_indices_08.mpirun=7.debug
11303/11419 Test  #7459: matrix_free/parallel_multigrid_adaptive_02.mpirun=7.debug ..............................   Passed   92.29 sec
            Start  8082: mpi/hp_unify_dof_indices_08.mpirun=7.release
11304/11419 Test  #8082: mpi/hp_unify_dof_indices_08.mpirun=7.release ...........................................   Passed    4.42 sec
            Start  8187: mpi/mg_06.mpirun=7.debug
11305/11419 Test  #7477: matrix_free/parallel_multigrid_mf.mpirun=7.debug .......................................   Passed   75.26 sec
            Start  8188: mpi/mg_06.mpirun=7.release
11306/11419 Test  #8187: mpi/mg_06.mpirun=7.debug ...............................................................   Passed   25.19 sec
            Start  8191: mpi/mg_ghost_dofs_periodic_01.mpirun=7.debug
11307/11419 Test  #8191: mpi/mg_ghost_dofs_periodic_01.mpirun=7.debug ...........................................   Passed    3.70 sec
            Start  8192: mpi/mg_ghost_dofs_periodic_01.mpirun=7.release
11308/11419 Test  #8192: mpi/mg_ghost_dofs_periodic_01.mpirun=7.release .........................................   Passed    3.27 sec
            Start  8203: mpi/mg_ghost_dofs_periodic_06.mpirun=7.debug
11309/11419 Test  #8188: mpi/mg_06.mpirun=7.release .............................................................   Passed   19.65 sec
            Start  8204: mpi/mg_ghost_dofs_periodic_06.mpirun=7.release
11310/11419 Test  #8081: mpi/hp_unify_dof_indices_08.mpirun=7.debug .............................................   Passed   43.68 sec
            Start  8217: mpi/muelu_periodicity.mpirun=7.debug
11311/11419 Test  #7478: matrix_free/parallel_multigrid_mf.mpirun=7.release .....................................   Passed   79.36 sec
            Start  8218: mpi/muelu_periodicity.mpirun=7.release
11312/11419 Test  #8217: mpi/muelu_periodicity.mpirun=7.debug ...................................................   Passed    4.13 sec
            Start  8574: mpi/periodicity_02.mpirun=7.debug
11313/11419 Test  #8218: mpi/muelu_periodicity.mpirun=7.release .................................................   Passed    3.43 sec
            Start  8575: mpi/periodicity_02.mpirun=7.release
11314/11419 Test  #8574: mpi/periodicity_02.mpirun=7.debug ......................................................   Passed    3.82 sec
            Start  8582: mpi/periodicity_04.mpirun=7.debug
11315/11419 Test  #8575: mpi/periodicity_02.mpirun=7.release ....................................................   Passed    3.31 sec
            Start  8583: mpi/periodicity_04.mpirun=7.release
11316/11419 Test  #8583: mpi/periodicity_04.mpirun=7.release ....................................................   Passed    4.03 sec
            Start  8604: mpi/point_value_01.mpirun=6.debug
11317/11419 Test  #8203: mpi/mg_ghost_dofs_periodic_06.mpirun=7.debug ...........................................   Passed   23.37 sec
            Start  8605: mpi/point_value_01.mpirun=6.release
11318/11419 Test  #8604: mpi/point_value_01.mpirun=6.debug ......................................................   Passed    3.21 sec
            Start  8742: mpi/step-37.mpirun=7.debug
11319/11419 Test  #8204: mpi/mg_ghost_dofs_periodic_06.mpirun=7.release .........................................   Passed   19.27 sec
            Start  8743: mpi/step-37.mpirun=7.release
11320/11419 Test  #8605: mpi/point_value_01.mpirun=6.release ....................................................   Passed    3.13 sec
            Start  8750: mpi/step-39.mpirun=6.debug
11321/11419 Test  #8743: mpi/step-37.mpirun=7.release ...........................................................   Passed   31.57 sec
            Start  8751: mpi/step-39.mpirun=6.release
11322/11419 Test  #8750: mpi/step-39.mpirun=6.debug .............................................................   Passed   65.76 sec
            Start  8772: mpi/tria_ghost_owners_01.mpirun=7.debug
11323/11419 Test  #8742: mpi/step-37.mpirun=7.debug .............................................................   Passed   72.14 sec
            Start  8773: mpi/tria_ghost_owners_01.mpirun=7.release
11324/11419 Test  #8751: mpi/step-39.mpirun=6.release ...........................................................   Passed   39.20 sec
            Start  9035: multigrid/step-16-50-mpi.mpirun=7.debug
11325/11419 Test  #8582: mpi/periodicity_04.mpirun=7.debug ......................................................   Passed   85.35 sec
            Start  9036: multigrid/step-16-50-mpi.mpirun=7.release
11326/11419 Test  #9035: multigrid/step-16-50-mpi.mpirun=7.debug ................................................   Passed    4.10 sec
            Start  9085: multigrid/transfer_matrix_free_01.mpirun=7.debug
11327/11419 Test  #9036: multigrid/step-16-50-mpi.mpirun=7.release ..............................................   Passed    1.37 sec
            Start  9086: multigrid/transfer_matrix_free_01.mpirun=7.release
11328/11419 Test  #9086: multigrid/transfer_matrix_free_01.mpirun=7.release .....................................   Passed    1.85 sec
            Start  9101: multigrid/transfer_matrix_free_04.mpirun=7.debug
11329/11419 Test  #8773: mpi/tria_ghost_owners_01.mpirun=7.release ..............................................   Passed   50.51 sec
            Start  9102: multigrid/transfer_matrix_free_04.mpirun=7.release
11330/11419 Test  #9085: multigrid/transfer_matrix_free_01.mpirun=7.debug .......................................   Passed   65.30 sec
11331/11419 Test  #8772: mpi/tria_ghost_owners_01.mpirun=7.debug ................................................   Passed   87.43 sec
            Start  7364: matrix_free/matrix_vector_faces_16.mpirun=11.debug
11332/11419 Test  #9102: multigrid/transfer_matrix_free_04.mpirun=7.release .....................................   Passed   33.64 sec
            Start  7627: mpi/attach_data_01.mpirun=8.debug
11333/11419 Test  #7627: mpi/attach_data_01.mpirun=8.debug ......................................................   Passed    3.04 sec
            Start  7628: mpi/attach_data_01.mpirun=8.release
11334/11419 Test  #7628: mpi/attach_data_01.mpirun=8.release ....................................................   Passed    2.95 sec
            Start  7633: mpi/attach_data_02.mpirun=8.debug
11335/11419 Test  #9101: multigrid/transfer_matrix_free_04.mpirun=7.debug .......................................   Passed   82.76 sec
11336/11419 Test  #7633: mpi/attach_data_02.mpirun=8.debug ......................................................   Passed    2.98 sec
            Start  7365: matrix_free/matrix_vector_faces_16.mpirun=11.release
11337/11419 Test  #7364: matrix_free/matrix_vector_faces_16.mpirun=11.debug .....................................   Passed   35.86 sec
            Start  7634: mpi/attach_data_02.mpirun=8.release
11338/11419 Test  #7634: mpi/attach_data_02.mpirun=8.release ....................................................   Passed    2.92 sec
            Start  7645: mpi/cell_data_transfer_01.mpirun=8.debug
11339/11419 Test  #7645: mpi/cell_data_transfer_01.mpirun=8.debug ...............................................   Passed    3.28 sec
            Start  7646: mpi/cell_data_transfer_01.mpirun=8.release
11340/11419 Test  #7365: matrix_free/matrix_vector_faces_16.mpirun=11.release ...................................   Passed   33.02 sec
            Start  7649: mpi/cell_data_transfer_02.mpirun=8.debug
            Start  7650: mpi/cell_data_transfer_02.mpirun=8.release
11341/11419 Test  #7646: mpi/cell_data_transfer_01.mpirun=8.release .............................................   Passed    2.86 sec
            Start  7653: mpi/cell_data_transfer_03.mpirun=8.debug
11342/11419 Test  #7650: mpi/cell_data_transfer_02.mpirun=8.release .............................................   Passed    3.00 sec
            Start  7654: mpi/cell_data_transfer_03.mpirun=8.release
11343/11419 Test  #7649: mpi/cell_data_transfer_02.mpirun=8.debug ...............................................   Passed    3.21 sec
            Start  7917: mpi/distort_random_01.mpirun=8.debug
11344/11419 Test  #7653: mpi/cell_data_transfer_03.mpirun=8.debug ...............................................   Passed    3.24 sec
            Start  7918: mpi/distort_random_01.mpirun=8.release
11345/11419 Test  #7654: mpi/cell_data_transfer_03.mpirun=8.release .............................................   Passed    3.02 sec
            Start  7923: mpi/distort_random_02.mpirun=8.debug
11346/11419 Test  #7917: mpi/distort_random_01.mpirun=8.debug ...................................................   Passed    3.68 sec
            Start  7924: mpi/distort_random_02.mpirun=8.release
11347/11419 Test  #7918: mpi/distort_random_01.mpirun=8.release .................................................   Passed    3.75 sec
            Start  8007: mpi/hp_active_fe_indices_transfer_01.mpirun=8.debug
11348/11419 Test  #7923: mpi/distort_random_02.mpirun=8.debug ...................................................   Passed    4.22 sec
            Start  8008: mpi/hp_active_fe_indices_transfer_01.mpirun=8.release
11349/11419 Test  #7924: mpi/distort_random_02.mpirun=8.release .................................................   Passed    3.65 sec
            Start  8011: mpi/hp_active_fe_indices_transfer_02.mpirun=8.debug
11350/11419 Test  #8007: mpi/hp_active_fe_indices_transfer_01.mpirun=8.debug ....................................   Passed    3.55 sec
            Start  8012: mpi/hp_active_fe_indices_transfer_02.mpirun=8.release
11351/11419 Test  #8008: mpi/hp_active_fe_indices_transfer_01.mpirun=8.release ..................................   Passed    3.06 sec
            Start  8015: mpi/hp_active_fe_indices_transfer_03.mpirun=8.debug
11352/11419 Test  #8011: mpi/hp_active_fe_indices_transfer_02.mpirun=8.debug ....................................   Passed    3.53 sec
            Start  8016: mpi/hp_active_fe_indices_transfer_03.mpirun=8.release
11353/11419 Test  #8012: mpi/hp_active_fe_indices_transfer_02.mpirun=8.release ..................................   Passed    3.07 sec
            Start  8227: mpi/no_flux_constraints.mpirun=9.debug
11354/11419 Test  #8015: mpi/hp_active_fe_indices_transfer_03.mpirun=8.debug ....................................   Passed    3.45 sec
            Start  8228: mpi/no_flux_constraints.mpirun=9.release
11355/11419 Test  #8016: mpi/hp_active_fe_indices_transfer_03.mpirun=8.release ..................................   Passed    2.98 sec
            Start  8231: mpi/no_flux_constraints_02.mpirun=9.debug
11356/11419 Test  #8231: mpi/no_flux_constraints_02.mpirun=9.debug ..............................................   Passed    9.77 sec
            Start  8232: mpi/no_flux_constraints_02.mpirun=9.release
11357/11419 Test  #8232: mpi/no_flux_constraints_02.mpirun=9.release ............................................   Passed    4.18 sec
            Start  8235: mpi/no_flux_constraints_03.mpirun=9.debug
11358/11419 Test  #8235: mpi/no_flux_constraints_03.mpirun=9.debug ..............................................   Passed    4.93 sec
            Start  8236: mpi/no_flux_constraints_03.mpirun=9.release
11359/11419 Test  #8228: mpi/no_flux_constraints.mpirun=9.release ...............................................   Passed   22.60 sec
            Start  8237: mpi/normal_flux_constraints.mpirun=9.debug
11360/11419 Test  #8236: mpi/no_flux_constraints_03.mpirun=9.release ............................................   Passed    3.99 sec
            Start  8238: mpi/normal_flux_constraints.mpirun=9.release
11361/11419 Test  #8227: mpi/no_flux_constraints.mpirun=9.debug .................................................   Passed   32.01 sec
            Start  8382: mpi/p_adaptivity_fixed_number.mpirun=8.debug
11362/11419 Test  #8382: mpi/p_adaptivity_fixed_number.mpirun=8.debug ...........................................   Passed    3.04 sec
            Start  8383: mpi/p_adaptivity_fixed_number.mpirun=8.release
11363/11419 Test  #8383: mpi/p_adaptivity_fixed_number.mpirun=8.release .........................................   Passed    2.87 sec
            Start  8388: mpi/p_refinement_and_coarsening.mpirun=8.debug
11364/11419 Test  #8388: mpi/p_refinement_and_coarsening.mpirun=8.debug .........................................   Passed    3.21 sec
            Start  8389: mpi/p_refinement_and_coarsening.mpirun=8.release
11365/11419 Test  #8389: mpi/p_refinement_and_coarsening.mpirun=8.release .......................................   Passed    2.76 sec
            Start  8584: mpi/periodicity_05.mpirun=9.debug
11366/11419 Test  #8238: mpi/normal_flux_constraints.mpirun=9.release ...........................................   Passed   22.90 sec
            Start  8585: mpi/periodicity_05.mpirun=9.release
11367/11419 Test  #8237: mpi/normal_flux_constraints.mpirun=9.debug .............................................   Passed   32.59 sec
            Start  8926: multigrid/constrained_dofs_02.mpirun=8.debug
11368/11419 Test  #8926: multigrid/constrained_dofs_02.mpirun=8.debug ...........................................   Passed    0.96 sec
            Start  8927: multigrid/constrained_dofs_02.mpirun=8.release
11369/11419 Test  #8927: multigrid/constrained_dofs_02.mpirun=8.release .........................................   Passed    0.64 sec
            Start  9055: multigrid/step-50_01.mpirun=8.debug
11370/11419 Test  #9055: multigrid/step-50_01.mpirun=8.debug ....................................................   Passed    1.58 sec
            Start  9056: multigrid/step-50_01.mpirun=8.release
11371/11419 Test  #9056: multigrid/step-50_01.mpirun=8.release ..................................................   Passed    0.94 sec
            Start 10114: remote_point_evaluation/remote_point_evaluation_03.mpirun=8.debug
11372/11419 Test  #8585: mpi/periodicity_05.mpirun=9.release ....................................................   Passed   21.70 sec
            Start 10115: remote_point_evaluation/remote_point_evaluation_03.mpirun=8.release
11373/11419 Test  #8584: mpi/periodicity_05.mpirun=9.debug ......................................................   Passed   27.46 sec
            Start 10116: remote_point_evaluation/vector_tools_evaluate_at_points_01.mpirun=8.debug
11374/11419 Test #10114: remote_point_evaluation/remote_point_evaluation_03.mpirun=8.debug ......................   Passed   40.43 sec
            Start 10117: remote_point_evaluation/vector_tools_evaluate_at_points_01.mpirun=8.release
11375/11419 Test #10116: remote_point_evaluation/vector_tools_evaluate_at_points_01.mpirun=8.debug ..............   Passed   30.35 sec
            Start 10118: remote_point_evaluation/vector_tools_evaluate_at_points_02.mpirun=8.debug
11376/11419 Test #10115: remote_point_evaluation/remote_point_evaluation_03.mpirun=8.release ....................   Passed   34.38 sec
            Start 10119: remote_point_evaluation/vector_tools_evaluate_at_points_02.mpirun=8.release
11377/11419 Test #10117: remote_point_evaluation/vector_tools_evaluate_at_points_01.mpirun=8.release ............   Passed   27.95 sec
            Start 10958: trilinos/n_nonzeros_02_parallel.mpirun=9.debug
11378/11419 Test #10119: remote_point_evaluation/vector_tools_evaluate_at_points_02.mpirun=8.release ............***Failed   38.71 sec
            Start 10959: trilinos/n_nonzeros_02_parallel.mpirun=9.release
11379/11419 Test #10118: remote_point_evaluation/vector_tools_evaluate_at_points_02.mpirun=8.debug ..............***Failed   40.90 sec
11380/11419 Test #10958: trilinos/n_nonzeros_02_parallel.mpirun=9.debug .........................................   Passed   19.57 sec
            Start  7991: mpi/fe_tools_extrapolate_06.mpirun=10.debug
11381/11419 Test  #7991: mpi/fe_tools_extrapolate_06.mpirun=10.debug ............................................   Passed    6.38 sec
            Start  7992: mpi/fe_tools_extrapolate_06.mpirun=10.release
11382/11419 Test  #7992: mpi/fe_tools_extrapolate_06.mpirun=10.release ..........................................   Passed    3.10 sec
            Start  7997: mpi/has_active_dofs_01.mpirun=10.debug
11383/11419 Test #10959: trilinos/n_nonzeros_02_parallel.mpirun=9.release .......................................   Passed   17.16 sec
            Start  7998: mpi/has_active_dofs_01.mpirun=10.release
11384/11419 Test  #7998: mpi/has_active_dofs_01.mpirun=10.release ...............................................   Passed   18.98 sec
            Start  7999: mpi/has_active_dofs_02.mpirun=10.debug
11385/11419 Test  #7997: mpi/has_active_dofs_01.mpirun=10.debug .................................................   Passed   21.15 sec
            Start  8000: mpi/has_active_dofs_02.mpirun=10.release
11386/11419 Test  #8000: mpi/has_active_dofs_02.mpirun=10.release ...............................................   Passed   15.73 sec
            Start  8083: mpi/hp_unify_dof_indices_09.mpirun=10.debug
11387/11419 Test  #7999: mpi/has_active_dofs_02.mpirun=10.debug .................................................   Passed   18.73 sec
            Start  8084: mpi/hp_unify_dof_indices_09.mpirun=10.release
11388/11419 Test  #8084: mpi/hp_unify_dof_indices_09.mpirun=10.release ..........................................   Passed   17.19 sec
            Start  8185: mpi/mg_05.mpirun=10.debug
11389/11419 Test  #8083: mpi/hp_unify_dof_indices_09.mpirun=10.debug ............................................   Passed   21.16 sec
            Start  8186: mpi/mg_05.mpirun=10.release
11390/11419 Test  #8186: mpi/mg_05.mpirun=10.release ............................................................   Passed   17.64 sec
            Start  8434: mpi/parallel_block_vector_13.mpirun=10.debug
11391/11419 Test  #8185: mpi/mg_05.mpirun=10.debug ..............................................................   Passed   21.27 sec
            Start  8435: mpi/parallel_block_vector_13.mpirun=10.release
11392/11419 Test  #8434: mpi/parallel_block_vector_13.mpirun=10.debug ...........................................   Passed   13.73 sec
            Start  8588: mpi/periodicity_07.mpirun=13.debug
11393/11419 Test  #8435: mpi/parallel_block_vector_13.mpirun=10.release .........................................   Passed   12.25 sec
            Start  8589: mpi/periodicity_07.mpirun=13.release
11394/11419 Test  #8589: mpi/periodicity_07.mpirun=13.release ...................................................   Passed   26.59 sec
            Start  8812: mpi/trilinos_01.mpirun=10.debug
11395/11419 Test  #8812: mpi/trilinos_01.mpirun=10.debug ........................................................   Passed    4.73 sec
            Start  8813: mpi/trilinos_01.mpirun=10.release
11396/11419 Test  #8588: mpi/periodicity_07.mpirun=13.debug .....................................................   Passed   32.13 sec
11397/11419 Test  #8813: mpi/trilinos_01.mpirun=10.release ......................................................   Passed    5.93 sec
            Start  8199: mpi/mg_ghost_dofs_periodic_05.mpirun=28.debug
11398/11419 Test  #8199: mpi/mg_ghost_dofs_periodic_05.mpirun=28.debug ..........................................   Passed   42.27 sec
            Start  8200: mpi/mg_ghost_dofs_periodic_05.mpirun=28.release
11399/11419 Test  #8200: mpi/mg_ghost_dofs_periodic_05.mpirun=28.release ........................................   Passed   23.23 sec
            Start  8351: mpi/p4est_3d_refine_04.mpirun=24.debug
11400/11419 Test  #8351: mpi/p4est_3d_refine_04.mpirun=24.debug .................................................   Passed    9.23 sec
            Start  8352: mpi/p4est_3d_refine_04.mpirun=24.release
11401/11419 Test  #8352: mpi/p4est_3d_refine_04.mpirun=24.release ...............................................   Passed    3.21 sec
            Start  8672: mpi/refinement_listener_01.mpirun=20.debug
            Start  8353: mpi/p4est_3d_refine_04.mpirun=4.debug
11402/11419 Test  #8672: mpi/refinement_listener_01.mpirun=20.debug .............................................   Passed    3.73 sec
            Start  8673: mpi/refinement_listener_01.mpirun=20.release
11403/11419 Test  #8673: mpi/refinement_listener_01.mpirun=20.release ...........................................   Passed    3.15 sec
            Start  8678: mpi/refinement_listener_02.mpirun=20.debug
11404/11419 Test  #8353: mpi/p4est_3d_refine_04.mpirun=4.debug ..................................................   Passed    8.59 sec
            Start  8354: mpi/p4est_3d_refine_04.mpirun=4.release
11405/11419 Test  #8678: mpi/refinement_listener_02.mpirun=20.debug .............................................   Passed    3.88 sec
            Start  8679: mpi/refinement_listener_02.mpirun=20.release
11406/11419 Test  #8354: mpi/p4est_3d_refine_04.mpirun=4.release ................................................   Passed    3.24 sec
            Start  8674: mpi/refinement_listener_01.mpirun=4.debug
11407/11419 Test  #8679: mpi/refinement_listener_02.mpirun=20.release ...........................................   Passed    3.17 sec
            Start  8943: multigrid/distribute_bug_01.mpirun=20.debug
11408/11419 Test  #8674: mpi/refinement_listener_01.mpirun=4.debug ..............................................   Passed    4.48 sec
            Start  8675: mpi/refinement_listener_01.mpirun=4.release
11409/11419 Test  #8943: multigrid/distribute_bug_01.mpirun=20.debug ............................................   Passed    4.83 sec
            Start  8944: multigrid/distribute_bug_01.mpirun=20.release
11410/11419 Test  #8675: mpi/refinement_listener_01.mpirun=4.release ............................................   Passed    3.49 sec
            Start  8680: mpi/refinement_listener_02.mpirun=4.debug
11411/11419 Test  #8944: multigrid/distribute_bug_01.mpirun=20.release ..........................................   Passed    1.42 sec
            Start  8201: mpi/mg_ghost_dofs_periodic_05.mpirun=6.debug
            Start  8202: mpi/mg_ghost_dofs_periodic_05.mpirun=6.release
            Start  8681: mpi/refinement_listener_02.mpirun=4.release
11412/11419 Test  #8680: mpi/refinement_listener_02.mpirun=4.debug ..............................................   Passed    3.36 sec
            Start  8945: multigrid/distribute_bug_01.mpirun=6.debug
11413/11419 Test  #8681: mpi/refinement_listener_02.mpirun=4.release ............................................   Passed    2.99 sec
            Start  8946: multigrid/distribute_bug_01.mpirun=6.release
11414/11419 Test  #8202: mpi/mg_ghost_dofs_periodic_05.mpirun=6.release .........................................   Passed    3.79 sec
11415/11419 Test  #8946: multigrid/distribute_bug_01.mpirun=6.release ...........................................   Passed    2.09 sec
11416/11419 Test  #8945: multigrid/distribute_bug_01.mpirun=6.debug .............................................   Passed    4.31 sec
11417/11419 Test  #8201: mpi/mg_ghost_dofs_periodic_05.mpirun=6.debug ...........................................   Passed   21.76 sec
            Start  8207: mpi/mg_ghost_dofs_periodic_07.mpirun=43.debug
11418/11419 Test  #8207: mpi/mg_ghost_dofs_periodic_07.mpirun=43.debug ..........................................   Passed    7.55 sec
            Start  8208: mpi/mg_ghost_dofs_periodic_07.mpirun=43.release
11419/11419 Test  #8208: mpi/mg_ghost_dofs_periodic_07.mpirun=43.release ........................................   Passed    3.89 sec

99% tests passed, 17 tests failed out of 11419

Total Test time (real) = 23316.25 sec

The following tests FAILED:
	2795 - cuda/array_view_access_data.debug (Failed)
	2796 - cuda/array_view_wrong_memory.debug (Failed)
	2817 - cuda/cuda_vector_05.debug (Failed)
	2818 - cuda/cuda_vector_05.release (Failed)
	2905 - cuda/precondition_03.mpirun=2.debug (Failed)
	3153 - distributed_grids/3d_coarse_grid_02.debug (Failed)
	5224 - grid/grid_tools_cache_04.mpirun=4.debug (Failed)
	5225 - grid/grid_tools_cache_04.mpirun=4.release (Failed)
	5625 - hp/distribute_dofs_linear_time.debug (Timeout)
	10108 - remote_point_evaluation/remote_point_evaluation_01.mpirun=4.debug (Failed)
	10109 - remote_point_evaluation/remote_point_evaluation_01.mpirun=4.release (Failed)
	10112 - remote_point_evaluation/remote_point_evaluation_02.mpirun=5.debug (Failed)
	10113 - remote_point_evaluation/remote_point_evaluation_02.mpirun=5.release (Failed)
	10118 - remote_point_evaluation/vector_tools_evaluate_at_points_02.mpirun=8.debug (Failed)
	10119 - remote_point_evaluation/vector_tools_evaluate_at_points_02.mpirun=8.release (Failed)
	10240 - sharedtria/limit_p_level_difference_04.mpirun=4.debug (Failed)
	10241 - sharedtria/limit_p_level_difference_04.mpirun=4.release (Failed)
-- Running CTEST_SUBMIT()
	Add file: /home/build/revision.log
	Add file: /home/build/summary.log
	Add file: /home/build/detailed.log
	Add file: /home/build/include/deal.II/base/config.h
Submit files
   Send to group: Continuous
   SubmitURL: https://cdash.43-1.org/submit.php?project=deal.II
   Uploaded: /home/build/Testing/20210602-0405/Update.xml
   Uploaded: /home/build/Testing/20210602-0405/Configure.xml
   Uploaded: /home/build/Testing/20210602-0405/Build.xml
   Error when uploading file: /home/build/Testing/20210602-0405/Test.xml
   Error message was: Operation too slow. Less than 1 bytes/sec transferred the last 120 seconds
   Problems when submitting via HTTP
rm: cannot remove '/var/jenkins/workspace/deal.II-CUDA11.0/build': No such file or directory
+ docker stop cuda11_deal_ci
cuda11_deal_ci
+ docker rm -f cuda11_deal_ci
cuda11_deal_ci
INFO: Processing CTest-Version 3.x (default)
INFO: [CTest-Version 3.x (default)] - 1 test report file(s) were found with the pattern 'build/Testing/**/Test.xml' relative to '/var/jenkins/workspace/deal.II-CUDA11.0' for the testing framework 'CTest-Version 3.x (default)'.
INFO: Check 'Failed Tests' threshold.
INFO: The total number of tests for the threshold 'Failed Tests' exceeds the specified "failure threshold" value.
INFO: Setting the build status to FAILURE
Build step 'Publish xUnit test result report' changed build result to FAILURE
Finished: FAILURE