Console Output

Skipping 2,198 KB.. Full Log
11098/11217 Test  #8758: mpi/tria_signals_05.mpirun=4.debug .....................................................   Passed    3.12 sec
            Start  8759: mpi/tria_signals_05.mpirun=4.release
11099/11217 Test  #8759: mpi/tria_signals_05.mpirun=4.release ...................................................   Passed    2.82 sec
            Start  8768: mpi/trilinos_02.mpirun=4.debug
11100/11217 Test  #9060: multigrid/transfer_matrix_free_06.mpirun=10.release ....................................   Passed   23.15 sec
            Start  7340: matrix_free/matrix_vector_faces_16.mpirun=11.debug
11101/11217 Test  #8768: mpi/trilinos_02.mpirun=4.debug .........................................................   Passed    2.83 sec
            Start  8769: mpi/trilinos_02.mpirun=4.release
11102/11217 Test  #8769: mpi/trilinos_02.mpirun=4.release .......................................................   Passed    2.89 sec
            Start  8808: mpi/trilinos_ghost_01.mpirun=4.debug
11103/11217 Test  #8808: mpi/trilinos_ghost_01.mpirun=4.debug ...................................................   Passed    2.95 sec
            Start  8809: mpi/trilinos_ghost_01.mpirun=4.release
11104/11217 Test  #9059: multigrid/transfer_matrix_free_06.mpirun=10.debug ......................................   Passed   33.01 sec
            Start  7341: matrix_free/matrix_vector_faces_16.mpirun=11.release
11105/11217 Test  #8809: mpi/trilinos_ghost_01.mpirun=4.release .................................................   Passed    2.85 sec
            Start  8812: mpi/trilinos_ghost_02.mpirun=4.debug
11106/11217 Test  #8812: mpi/trilinos_ghost_02.mpirun=4.debug ...................................................   Passed    2.91 sec
            Start  8813: mpi/trilinos_ghost_02.mpirun=4.release
11107/11217 Test  #8813: mpi/trilinos_ghost_02.mpirun=4.release .................................................   Passed    2.79 sec
            Start  8815: mpi/trilinos_ghost_03.mpirun=4.debug
11108/11217 Test  #8815: mpi/trilinos_ghost_03.mpirun=4.debug ...................................................   Passed    2.78 sec
            Start  8817: mpi/trilinos_ghost_03_linfty.mpirun=4.debug
11109/11217 Test  #8817: mpi/trilinos_ghost_03_linfty.mpirun=4.debug ............................................   Passed    2.82 sec
            Start  8820: mpi/trilinos_ghost_05.mpirun=4.debug
11110/11217 Test  #8820: mpi/trilinos_ghost_05.mpirun=4.debug ...................................................   Passed    2.81 sec
            Start  8821: mpi/trilinos_ghost_05.mpirun=4.release
11111/11217 Test  #8821: mpi/trilinos_ghost_05.mpirun=4.release .................................................   Passed    2.69 sec
            Start  9061: multigrid/transfer_matrix_free_06.mpirun=5.debug
11112/11217 Test  #9061: multigrid/transfer_matrix_free_06.mpirun=5.debug .......................................   Passed    7.60 sec
            Start  9062: multigrid/transfer_matrix_free_06.mpirun=5.release
11113/11217 Test  #9062: multigrid/transfer_matrix_free_06.mpirun=5.release .....................................   Passed    1.42 sec
11114/11217 Test  #7340: matrix_free/matrix_vector_faces_16.mpirun=11.debug .....................................   Passed   38.65 sec
            Start  7869: mpi/distort_random_01.mpirun=8.debug
            Start  8033: mpi/hp_unify_dof_indices_08.mpirun=7.debug
11115/11217 Test  #7869: mpi/distort_random_01.mpirun=8.debug ...................................................   Passed    3.80 sec
            Start  7870: mpi/distort_random_01.mpirun=8.release
11116/11217 Test  #7341: matrix_free/matrix_vector_faces_16.mpirun=11.release ...................................   Passed   39.75 sec
            Start  7875: mpi/distort_random_02.mpirun=8.debug
11117/11217 Test  #7870: mpi/distort_random_01.mpirun=8.release .................................................   Passed    6.89 sec
            Start  7876: mpi/distort_random_02.mpirun=8.release
11118/11217 Test  #7875: mpi/distort_random_02.mpirun=8.debug ...................................................   Passed    7.58 sec
            Start  7943: mpi/fe_tools_extrapolate_06.mpirun=10.debug
11119/11217 Test  #7876: mpi/distort_random_02.mpirun=8.release .................................................   Passed    7.30 sec
            Start  7959: mpi/hp_active_fe_indices_transfer_01.mpirun=8.debug
11120/11217 Test  #7959: mpi/hp_active_fe_indices_transfer_01.mpirun=8.debug ....................................   Passed    9.32 sec
            Start  7960: mpi/hp_active_fe_indices_transfer_01.mpirun=8.release
11121/11217 Test  #7960: mpi/hp_active_fe_indices_transfer_01.mpirun=8.release ..................................   Passed    7.29 sec
            Start  7963: mpi/hp_active_fe_indices_transfer_02.mpirun=8.debug
11122/11217 Test  #7963: mpi/hp_active_fe_indices_transfer_02.mpirun=8.debug ....................................   Passed   10.85 sec
            Start  7964: mpi/hp_active_fe_indices_transfer_02.mpirun=8.release
11123/11217 Test  #7943: mpi/fe_tools_extrapolate_06.mpirun=10.debug ............................................   Passed   28.52 sec
            Start  7944: mpi/fe_tools_extrapolate_06.mpirun=10.release
11124/11217 Test  #7964: mpi/hp_active_fe_indices_transfer_02.mpirun=8.release ..................................   Passed    3.09 sec
            Start  7967: mpi/hp_active_fe_indices_transfer_03.mpirun=8.debug
11125/11217 Test  #7944: mpi/fe_tools_extrapolate_06.mpirun=10.release ..........................................   Passed    5.17 sec
            Start  7949: mpi/has_active_dofs_01.mpirun=10.debug
11126/11217 Test  #7967: mpi/hp_active_fe_indices_transfer_03.mpirun=8.debug ....................................   Passed    3.88 sec
            Start  7968: mpi/hp_active_fe_indices_transfer_03.mpirun=8.release
11127/11217 Test  #7968: mpi/hp_active_fe_indices_transfer_03.mpirun=8.release ..................................   Passed    2.99 sec
            Start  8034: mpi/hp_unify_dof_indices_08.mpirun=7.release
11128/11217 Test  #8033: mpi/hp_unify_dof_indices_08.mpirun=7.debug .............................................   Passed   59.78 sec
            Start  8139: mpi/mg_06.mpirun=7.debug
11129/11217 Test  #8034: mpi/hp_unify_dof_indices_08.mpirun=7.release ...........................................   Passed    4.64 sec
            Start  8140: mpi/mg_06.mpirun=7.release
11130/11217 Test  #7949: mpi/has_active_dofs_01.mpirun=10.debug .................................................   Passed   22.17 sec
            Start  7950: mpi/has_active_dofs_01.mpirun=10.release
11131/11217 Test  #8140: mpi/mg_06.mpirun=7.release .............................................................   Passed   18.33 sec
            Start  8143: mpi/mg_ghost_dofs_periodic_01.mpirun=7.debug
11132/11217 Test  #8143: mpi/mg_ghost_dofs_periodic_01.mpirun=7.debug ...........................................   Passed    3.75 sec
            Start  8144: mpi/mg_ghost_dofs_periodic_01.mpirun=7.release
11133/11217 Test  #8139: mpi/mg_06.mpirun=7.debug ...............................................................   Passed   23.27 sec
            Start  8155: mpi/mg_ghost_dofs_periodic_06.mpirun=7.debug
11134/11217 Test  #8144: mpi/mg_ghost_dofs_periodic_01.mpirun=7.release .........................................   Passed    2.89 sec
            Start  8156: mpi/mg_ghost_dofs_periodic_06.mpirun=7.release
11135/11217 Test  #7950: mpi/has_active_dofs_01.mpirun=10.release ...............................................   Passed   19.83 sec
            Start  7951: mpi/has_active_dofs_02.mpirun=10.debug
11136/11217 Test  #8156: mpi/mg_ghost_dofs_periodic_06.mpirun=7.release .........................................   Passed   18.56 sec
            Start  8169: mpi/muelu_periodicity.mpirun=7.debug
11137/11217 Test  #8155: mpi/mg_ghost_dofs_periodic_06.mpirun=7.debug ...........................................   Passed   21.86 sec
            Start  8170: mpi/muelu_periodicity.mpirun=7.release
11138/11217 Test  #8169: mpi/muelu_periodicity.mpirun=7.debug ...................................................   Passed    4.01 sec
            Start  8179: mpi/no_flux_constraints.mpirun=9.debug
11139/11217 Test  #8170: mpi/muelu_periodicity.mpirun=7.release .................................................   Passed    3.49 sec
            Start  8526: mpi/periodicity_02.mpirun=7.debug
11140/11217 Test  #7951: mpi/has_active_dofs_02.mpirun=10.debug .................................................   Passed   19.50 sec
            Start  7952: mpi/has_active_dofs_02.mpirun=10.release
11141/11217 Test  #8526: mpi/periodicity_02.mpirun=7.debug ......................................................   Passed    4.74 sec
            Start  8527: mpi/periodicity_02.mpirun=7.release
11142/11217 Test  #8527: mpi/periodicity_02.mpirun=7.release ....................................................   Passed    3.37 sec
            Start  8534: mpi/periodicity_04.mpirun=7.debug
11143/11217 Test  #7952: mpi/has_active_dofs_02.mpirun=10.release ...............................................   Passed   15.81 sec
            Start  8035: mpi/hp_unify_dof_indices_09.mpirun=10.debug
11144/11217 Test  #8179: mpi/no_flux_constraints.mpirun=9.debug .................................................   Passed   31.06 sec
            Start  8180: mpi/no_flux_constraints.mpirun=9.release
11145/11217 Test  #8035: mpi/hp_unify_dof_indices_09.mpirun=10.debug ............................................   Passed   25.72 sec
            Start  8036: mpi/hp_unify_dof_indices_09.mpirun=10.release
11146/11217 Test  #8180: mpi/no_flux_constraints.mpirun=9.release ...............................................   Passed   22.48 sec
            Start  8183: mpi/no_flux_constraints_02.mpirun=9.debug
11147/11217 Test  #8183: mpi/no_flux_constraints_02.mpirun=9.debug ..............................................   Passed   13.84 sec
            Start  8184: mpi/no_flux_constraints_02.mpirun=9.release
11148/11217 Test  #8534: mpi/periodicity_04.mpirun=7.debug ......................................................   Passed   58.49 sec
            Start  8535: mpi/periodicity_04.mpirun=7.release
11149/11217 Test  #8036: mpi/hp_unify_dof_indices_09.mpirun=10.release ..........................................   Passed   20.79 sec
            Start  8137: mpi/mg_05.mpirun=10.debug
11150/11217 Test  #8184: mpi/no_flux_constraints_02.mpirun=9.release ............................................   Passed    4.43 sec
            Start  8187: mpi/no_flux_constraints_03.mpirun=9.debug
11151/11217 Test  #8535: mpi/periodicity_04.mpirun=7.release ....................................................   Passed    4.41 sec
            Start  8556: mpi/point_value_01.mpirun=6.debug
11152/11217 Test  #8556: mpi/point_value_01.mpirun=6.debug ......................................................   Passed    2.98 sec
            Start  8557: mpi/point_value_01.mpirun=6.release
11153/11217 Test  #8187: mpi/no_flux_constraints_03.mpirun=9.debug ..............................................   Passed    5.04 sec
            Start  8188: mpi/no_flux_constraints_03.mpirun=9.release
11154/11217 Test  #8557: mpi/point_value_01.mpirun=6.release ....................................................   Passed    2.80 sec
            Start  8694: mpi/step-37.mpirun=7.debug
11155/11217 Test  #8188: mpi/no_flux_constraints_03.mpirun=9.release ............................................   Passed    3.95 sec
            Start  8189: mpi/normal_flux_constraints.mpirun=9.debug
11156/11217 Test  #8137: mpi/mg_05.mpirun=10.debug ..............................................................   Passed   25.99 sec
            Start  8138: mpi/mg_05.mpirun=10.release
11157/11217 Test  #8189: mpi/normal_flux_constraints.mpirun=9.debug .............................................   Passed   32.38 sec
            Start  8190: mpi/normal_flux_constraints.mpirun=9.release
11158/11217 Test  #8138: mpi/mg_05.mpirun=10.release ............................................................   Passed   20.62 sec
            Start  8334: mpi/p_adaptivity_fixed_number.mpirun=8.debug
11159/11217 Test  #8694: mpi/step-37.mpirun=7.debug .............................................................   Passed   36.85 sec
            Start  8335: mpi/p_adaptivity_fixed_number.mpirun=8.release
11160/11217 Test  #8335: mpi/p_adaptivity_fixed_number.mpirun=8.release .........................................   Passed    2.91 sec
            Start  8340: mpi/p_refinement_and_coarsening.mpirun=8.debug
11161/11217 Test  #8334: mpi/p_adaptivity_fixed_number.mpirun=8.debug ...........................................   Passed    3.13 sec
            Start  8341: mpi/p_refinement_and_coarsening.mpirun=8.release
11162/11217 Test  #8341: mpi/p_refinement_and_coarsening.mpirun=8.release .......................................   Passed    3.09 sec
            Start  8536: mpi/periodicity_05.mpirun=9.debug
11163/11217 Test  #8340: mpi/p_refinement_and_coarsening.mpirun=8.debug .........................................   Passed    3.44 sec
            Start  8537: mpi/periodicity_05.mpirun=9.release
11164/11217 Test  #8190: mpi/normal_flux_constraints.mpirun=9.release ...........................................   Passed   19.55 sec
            Start  8695: mpi/step-37.mpirun=7.release
11165/11217 Test  #8695: mpi/step-37.mpirun=7.release ...........................................................   Passed    3.72 sec
            Start  8702: mpi/step-39.mpirun=6.debug
11166/11217 Test  #8702: mpi/step-39.mpirun=6.debug .............................................................   Passed    4.82 sec
            Start  8703: mpi/step-39.mpirun=6.release
11167/11217 Test  #8537: mpi/periodicity_05.mpirun=9.release ....................................................   Passed   20.71 sec
            Start  8386: mpi/parallel_block_vector_13.mpirun=10.debug
11168/11217 Test  #8703: mpi/step-39.mpirun=6.release ...........................................................   Passed    4.38 sec
            Start  8724: mpi/tria_ghost_owners_01.mpirun=7.debug
11169/11217 Test  #8536: mpi/periodicity_05.mpirun=9.debug ......................................................   Passed   25.64 sec
            Start  8725: mpi/tria_ghost_owners_01.mpirun=7.release
11170/11217 Test  #8386: mpi/parallel_block_vector_13.mpirun=10.debug ...........................................   Passed   14.34 sec
            Start  8387: mpi/parallel_block_vector_13.mpirun=10.release
11171/11217 Test  #8725: mpi/tria_ghost_owners_01.mpirun=7.release ..............................................   Passed   20.14 sec
            Start  8878: multigrid/constrained_dofs_02.mpirun=8.debug
11172/11217 Test  #8878: multigrid/constrained_dofs_02.mpirun=8.debug ...........................................***Failed    2.06 sec
            Start  8879: multigrid/constrained_dofs_02.mpirun=8.release
11173/11217 Test  #8387: mpi/parallel_block_vector_13.mpirun=10.release .........................................   Passed   13.36 sec
            Start  8764: mpi/trilinos_01.mpirun=10.debug
11174/11217 Test  #8879: multigrid/constrained_dofs_02.mpirun=8.release .........................................***Failed    2.03 sec
            Start  8987: multigrid/step-16-50-mpi.mpirun=7.debug
11175/11217 Test  #8764: mpi/trilinos_01.mpirun=10.debug ........................................................   Passed    7.38 sec
            Start  8540: mpi/periodicity_07.mpirun=13.debug
11176/11217 Test  #8987: multigrid/step-16-50-mpi.mpirun=7.debug ................................................   Passed    8.46 sec
            Start  8988: multigrid/step-16-50-mpi.mpirun=7.release
11177/11217 Test  #8988: multigrid/step-16-50-mpi.mpirun=7.release ..............................................   Passed    1.32 sec
            Start  9037: multigrid/transfer_matrix_free_01.mpirun=7.debug
11178/11217 Test  #8540: mpi/periodicity_07.mpirun=13.debug .....................................................   Passed   44.19 sec
            Start  8541: mpi/periodicity_07.mpirun=13.release
11179/11217 Test  #9037: multigrid/transfer_matrix_free_01.mpirun=7.debug .......................................   Passed   44.14 sec
            Start  9038: multigrid/transfer_matrix_free_01.mpirun=7.release
11180/11217 Test  #9038: multigrid/transfer_matrix_free_01.mpirun=7.release .....................................   Passed    2.33 sec
            Start  9053: multigrid/transfer_matrix_free_04.mpirun=7.debug
11181/11217 Test  #8724: mpi/tria_ghost_owners_01.mpirun=7.debug ................................................   Passed   93.10 sec
            Start  9054: multigrid/transfer_matrix_free_04.mpirun=7.release
11182/11217 Test  #9054: multigrid/transfer_matrix_free_04.mpirun=7.release .....................................   Passed    2.21 sec
11183/11217 Test  #8541: mpi/periodicity_07.mpirun=13.release ...................................................   Passed   31.77 sec
            Start  8765: mpi/trilinos_01.mpirun=10.release
            Start  9007: multigrid/step-50_01.mpirun=8.debug
11184/11217 Test  #9007: multigrid/step-50_01.mpirun=8.debug ....................................................   Passed    1.73 sec
            Start  9008: multigrid/step-50_01.mpirun=8.release
11185/11217 Test  #9008: multigrid/step-50_01.mpirun=8.release ..................................................   Passed    1.04 sec
            Start 10044: remote_point_evaluation/remote_point_evaluation_03.mpirun=8.debug
11186/11217 Test  #8765: mpi/trilinos_01.mpirun=10.release ......................................................   Passed    4.23 sec
            Start 10045: remote_point_evaluation/remote_point_evaluation_03.mpirun=8.release
11187/11217 Test  #9053: multigrid/transfer_matrix_free_04.mpirun=7.debug .......................................   Passed   36.83 sec
            Start 10046: remote_point_evaluation/vector_tools_evaluate_at_points_01.mpirun=8.debug
11188/11217 Test #10045: remote_point_evaluation/remote_point_evaluation_03.mpirun=8.release ....................   Passed   42.41 sec
            Start 10047: remote_point_evaluation/vector_tools_evaluate_at_points_01.mpirun=8.release
11189/11217 Test #10046: remote_point_evaluation/vector_tools_evaluate_at_points_01.mpirun=8.debug ..............   Passed   35.60 sec
            Start 10048: remote_point_evaluation/vector_tools_evaluate_at_points_02.mpirun=8.debug
11190/11217 Test #10047: remote_point_evaluation/vector_tools_evaluate_at_points_01.mpirun=8.release ............   Passed   30.15 sec
            Start 10049: remote_point_evaluation/vector_tools_evaluate_at_points_02.mpirun=8.release
11191/11217 Test #10048: remote_point_evaluation/vector_tools_evaluate_at_points_02.mpirun=8.debug ..............***Failed   49.81 sec
            Start 10756: trilinos/n_nonzeros_02_parallel.mpirun=9.debug
11192/11217 Test #10756: trilinos/n_nonzeros_02_parallel.mpirun=9.debug .........................................   Passed   20.19 sec
            Start 10757: trilinos/n_nonzeros_02_parallel.mpirun=9.release
11193/11217 Test #10049: remote_point_evaluation/vector_tools_evaluate_at_points_02.mpirun=8.release ............***Failed   45.52 sec
11194/11217 Test #10757: trilinos/n_nonzeros_02_parallel.mpirun=9.release .......................................   Passed   18.11 sec
11195/11217 Test #10044: remote_point_evaluation/remote_point_evaluation_03.mpirun=8.debug ......................   Passed  164.70 sec
            Start  8151: mpi/mg_ghost_dofs_periodic_05.mpirun=28.debug
11196/11217 Test  #8151: mpi/mg_ghost_dofs_periodic_05.mpirun=28.debug ..........................................   Passed   62.18 sec
            Start  8152: mpi/mg_ghost_dofs_periodic_05.mpirun=28.release
11197/11217 Test  #8152: mpi/mg_ghost_dofs_periodic_05.mpirun=28.release ........................................   Passed   23.63 sec
            Start  8303: mpi/p4est_3d_refine_04.mpirun=24.debug
11198/11217 Test  #8303: mpi/p4est_3d_refine_04.mpirun=24.debug .................................................   Passed    8.57 sec
            Start  8304: mpi/p4est_3d_refine_04.mpirun=24.release
11199/11217 Test  #8304: mpi/p4est_3d_refine_04.mpirun=24.release ...............................................   Passed    3.28 sec
            Start  8624: mpi/refinement_listener_01.mpirun=20.debug
            Start  8305: mpi/p4est_3d_refine_04.mpirun=4.debug
11200/11217 Test  #8624: mpi/refinement_listener_01.mpirun=20.debug .............................................   Passed    3.86 sec
            Start  8625: mpi/refinement_listener_01.mpirun=20.release
11201/11217 Test  #8625: mpi/refinement_listener_01.mpirun=20.release ...........................................   Passed    3.06 sec
            Start  8630: mpi/refinement_listener_02.mpirun=20.debug
11202/11217 Test  #8305: mpi/p4est_3d_refine_04.mpirun=4.debug ..................................................   Passed    8.43 sec
            Start  8306: mpi/p4est_3d_refine_04.mpirun=4.release
11203/11217 Test  #8630: mpi/refinement_listener_02.mpirun=20.debug .............................................   Passed    3.89 sec
            Start  8631: mpi/refinement_listener_02.mpirun=20.release
11204/11217 Test  #8306: mpi/p4est_3d_refine_04.mpirun=4.release ................................................   Passed    3.14 sec
            Start  8626: mpi/refinement_listener_01.mpirun=4.debug
11205/11217 Test  #8631: mpi/refinement_listener_02.mpirun=20.release ...........................................   Passed    3.13 sec
            Start  8895: multigrid/distribute_bug_01.mpirun=20.debug
11206/11217 Test  #8626: mpi/refinement_listener_01.mpirun=4.debug ..............................................   Passed    3.44 sec
            Start  8627: mpi/refinement_listener_01.mpirun=4.release
11207/11217 Test  #8627: mpi/refinement_listener_01.mpirun=4.release ............................................   Passed    4.97 sec
            Start  8632: mpi/refinement_listener_02.mpirun=4.debug
11208/11217 Test  #8895: multigrid/distribute_bug_01.mpirun=20.debug ............................................   Passed    7.86 sec
            Start  8896: multigrid/distribute_bug_01.mpirun=20.release
11209/11217 Test  #8896: multigrid/distribute_bug_01.mpirun=20.release ..........................................   Passed    1.29 sec
            Start  8153: mpi/mg_ghost_dofs_periodic_05.mpirun=6.debug
            Start  8154: mpi/mg_ghost_dofs_periodic_05.mpirun=6.release
            Start  8633: mpi/refinement_listener_02.mpirun=4.release
11210/11217 Test  #8632: mpi/refinement_listener_02.mpirun=4.debug ..............................................   Passed    3.93 sec
            Start  8897: multigrid/distribute_bug_01.mpirun=6.debug
11211/11217 Test  #8633: mpi/refinement_listener_02.mpirun=4.release ............................................   Passed    3.50 sec
            Start  8898: multigrid/distribute_bug_01.mpirun=6.release
11212/11217 Test  #8154: mpi/mg_ghost_dofs_periodic_05.mpirun=6.release .........................................   Passed    5.35 sec
11213/11217 Test  #8898: multigrid/distribute_bug_01.mpirun=6.release ...........................................   Passed    2.06 sec
11214/11217 Test  #8897: multigrid/distribute_bug_01.mpirun=6.debug .............................................   Passed    5.69 sec
11215/11217 Test  #8153: mpi/mg_ghost_dofs_periodic_05.mpirun=6.debug ...........................................   Passed   40.46 sec
            Start  8159: mpi/mg_ghost_dofs_periodic_07.mpirun=43.debug
11216/11217 Test  #8159: mpi/mg_ghost_dofs_periodic_07.mpirun=43.debug ..........................................   Passed    9.26 sec
            Start  8160: mpi/mg_ghost_dofs_periodic_07.mpirun=43.release
11217/11217 Test  #8160: mpi/mg_ghost_dofs_periodic_07.mpirun=43.release ........................................   Passed    3.96 sec

99% tests passed, 29 tests failed out of 11217

Total Test time (real) = 22701.85 sec

The following tests FAILED:
	1240 - base/aligned_vector_replicate_02.mpirun=3.release (Failed)
	1242 - base/aligned_vector_replicate_03.mpirun=3.release (Failed)
	2779 - cuda/array_view_access_data.debug (Failed)
	2780 - cuda/array_view_wrong_memory.debug (Failed)
	2801 - cuda/cuda_vector_05.debug (Failed)
	2802 - cuda/cuda_vector_05.release (Failed)
	2889 - cuda/precondition_03.mpirun=2.debug (Failed)
	2905 - cuda/solver_08.debug (Failed)
	3137 - distributed_grids/3d_coarse_grid_02.debug (Failed)
	4834 - grid/build_global_description_tree.mpirun=1.debug (Failed)
	4835 - grid/build_global_description_tree.mpirun=1.release (Failed)
	4836 - grid/build_global_description_tree.mpirun=2.debug (Failed)
	4837 - grid/build_global_description_tree.mpirun=2.release (Failed)
	5206 - grid/grid_tools_cache_04.mpirun=4.debug (Failed)
	5207 - grid/grid_tools_cache_04.mpirun=4.release (Failed)
	5463 - grid/twisted_parallelepiped_02.release (Failed)
	5605 - hp/distribute_dofs_linear_time.debug (Timeout)
	8878 - multigrid/constrained_dofs_02.mpirun=8.debug (Failed)
	8879 - multigrid/constrained_dofs_02.mpirun=8.release (Failed)
	8979 - multigrid/step-16-50-mpi-linear-operator.mpirun=3.debug (Failed)
	8980 - multigrid/step-16-50-mpi-linear-operator.mpirun=3.release (Failed)
	10038 - remote_point_evaluation/remote_point_evaluation_01.mpirun=4.debug (Failed)
	10039 - remote_point_evaluation/remote_point_evaluation_01.mpirun=4.release (Failed)
	10042 - remote_point_evaluation/remote_point_evaluation_02.mpirun=5.debug (Failed)
	10043 - remote_point_evaluation/remote_point_evaluation_02.mpirun=5.release (Failed)
	10048 - remote_point_evaluation/vector_tools_evaluate_at_points_02.mpirun=8.debug (Failed)
	10049 - remote_point_evaluation/vector_tools_evaluate_at_points_02.mpirun=8.release (Failed)
	10170 - sharedtria/limit_p_level_difference_04.mpirun=4.debug (Failed)
	10171 - sharedtria/limit_p_level_difference_04.mpirun=4.release (Failed)
-- Running CTEST_SUBMIT()
	Add file: /home/build/revision.log
	Add file: /home/build/summary.log
	Add file: /home/build/detailed.log
	Add file: /home/build/include/deal.II/base/config.h
Submit files
   Send to group: Continuous
   SubmitURL: https://cdash.43-1.org/submit.php?project=deal.II
   Uploaded: /home/build/Testing/20210501-0404/Update.xml
   Uploaded: /home/build/Testing/20210501-0404/Configure.xml
   Uploaded: /home/build/Testing/20210501-0404/Build.xml
   Error when uploading file: /home/build/Testing/20210501-0404/Test.xml
   Error message was: Operation too slow. Less than 1 bytes/sec transferred the last 120 seconds
   Problems when submitting via HTTP
mv: error writing '/var/jenkins/workspace/deal.II-CUDA11.0/build/tests/dofs/CMakeFiles/dofs.extract_dofs_by_component_02_hp.debug.dir/extract_dofs_by_component_02_hp.cc.o': No space left on device
mv: cannot create directory '/var/jenkins/workspace/deal.II-CUDA11.0/build/tests/dofs/CMakeFiles/dofs.extract_dofs_by_component_02_hp.debug.dir/extract_dofs_by_component_02_hp.debug': No space left on device
mv: cannot create directory '/var/jenkins/workspace/deal.II-CUDA11.0/build/tests/dofs/CMakeFiles/dofs.sparsity_pattern_07.mpirun1.debug.diff.dir': No space left on device
mv: cannot create directory '/var/jenkins/workspace/deal.II-CUDA11.0/build/tests/dofs/CMakeFiles/dofs.locally_relevant_dofs_per_subdomain_01_hp.release.dir': No space left on device
mv: cannot create directory '/var/jenkins/workspace/deal.II-CUDA11.0/build/tests/dofs/CMakeFiles/dofs.extract_dofs_by_component_02_hp.release.dir': No space left on device
mv: cannot create directory '/var/jenkins/workspace/deal.II-CUDA11.0/build/tests/dofs/CMakeFiles/dofs.extract_dofs_by_component_01.release.diff.dir': No space left on device
mv: cannot create directory '/var/jenkins/workspace/deal.II-CUDA11.0/build/tests/dofs/CMakeFiles/dofs.interpolate_q_system_mask_01.debug.diff.dir': No space left on device
mv: cannot create directory '/var/jenkins/workspace/deal.II-CUDA11.0/build/tests/dofs/CMakeFiles/dofs.dof_accessor_01.debug.diff.dir': No space left on device
mv: cannot create directory '/var/jenkins/workspace/deal.II-CUDA11.0/build/tests/dofs/CMakeFiles/dofs.interpolate_boundary_values_01.debug.dir': No space left on device
mv: cannot create directory '/var/jenkins/workspace/deal.II-CUDA11.0/build/tests/dofs/CMakeFiles/dofs.dof_tools_write_gnuplot_dof_support_point_info_01.release.dir': No space left on device
mv: cannot create directory '/var/jenkins/workspace/deal.II-CUDA11.0/build/tests/dofs/CMakeFiles/dofs.invalid_iterators_01.release.dir': No space left on device
mv: cannot create directory '/var/jenkins/workspace/deal.II-CUDA11.0/build/tests/dofs/CMakeFiles/dofs.dof_tools_02d.release.diff.dir': No space left on device
mv: cannot create directory '/var/jenkins/workspace/deal.II-CUDA11.0/build/tests/dofs/CMakeFiles/dofs.block_list_parallel_01.release.dir': No space left on device
mv: cannot create directory '/var/jenkins/workspace/deal.II-CUDA11.0/build/tests/dofs/CMakeFiles/dofs.dof_tools_02b.debug.dir': No space left on device
mv: cannot create directory '/var/jenkins/workspace/deal.II-CUDA11.0/build/tests/dofs/CMakeFiles/dofs.dof_tools_write_gnuplot_dof_support_point_info_01.release.diff.dir': No space left on device
mv: cannot create directory '/var/jenkins/workspace/deal.II-CUDA11.0/build/tests/dofs/CMakeFiles/dofs.dof_test.release.dir': No space left on device
mv: cannot create directory '/var/jenkins/workspace/deal.II-CUDA11.0/build/tests/dofs/CMakeFiles/dofs.clear_signal.debug.dir': No space left on device
mv: cannot create directory '/var/jenkins/workspace/deal.II-CUDA11.0/build/tests/dofs/CMakeFiles/dofs.extract_dofs_by_component_06.debug.diff.dir': No space left on device
mv: cannot create directory '/var/jenkins/workspace/deal.II-CUDA11.0/build/tests/dofs/CMakeFiles/dofs.block_list_02.release.diff.dir': No space left on device
mv: cannot create directory '/var/jenkins/workspace/deal.II-CUDA11.0/build/tests/dofs/CMakeFiles/dofs.dof_tools_06.debug.diff.dir': No space left on device
mv: cannot create directory '/var/jenkins/workspace/deal.II-CUDA11.0/build/tests/dofs/CMakeFiles/dofs.dof_tools_16d.release.diff.dir': No space left on device
mv: cannot create directory '/var/jenkins/workspace/deal.II-CUDA11.0/build/tests/dofs/CMakeFiles/dofs.interpolate_q_system_01.release.diff.dir': No space left on device
mv: cannot create directory '/var/jenkins/workspace/deal.II-CUDA11.0/build/tests/dofs/CMakeFiles/dofs.dof_renumbering_06.release.diff.dir': No space left on device
mv: cannot create directory '/var/jenkins/workspace/deal.II-CUDA11.0/build/tests/dofs/CMakeFiles/dofs.dof_constraints_07.release.diff.dir': No space left on device
mv: cannot create directory '/var/jenkins/workspace/deal.II-CUDA11.0/build/tests/dofs/CMakeFiles/dofs.sparsity_pattern_06.mpirun2.release.diff.dir': No space left on device
mv: cannot create directory '/var/jenkins/workspace/deal.II-CUDA11.0/build/tests/dofs/CMakeFiles/dofs.extract_dofs_by_component_01.release.dir': No space left on device
mv: cannot create directory '/var/jenkins/workspace/deal.II-CUDA11.0/build/tests/dofs/CMakeFiles/dofs.dof_tools_19.release.dir': No space left on device
mv: cannot create directory '/var/jenkins/workspace/deal.II-CUDA11.0/build/tests/dofs/CMakeFiles/dofs.dof_tools_21_b_x_q3.release.diff.dir': No space left on device
mv: cannot create directory '/var/jenkins/workspace/deal.II-CUDA11.0/build/tests/dofs/CMakeFiles/dofs.dof_renumbering.debug.dir': No space left on device
mv: cannot create directory '/var/jenkins/workspace/deal.II-CUDA11.0/build/tests/dofs/CMakeFiles/dofs.dof_tools_15a.debug.diff.dir': No space left on device
mv: cannot create directory '/var/jenkins/workspace/deal.II-CUDA11.0/build/tests/dofs/CMakeFiles/dofs.dof_tools_01c.release.diff.dir': No space left on device
mv: cannot create directory '/var/jenkins/workspace/deal.II-CUDA11.0/build/tests/dofs/CMakeFiles/dofs.sparsity_pattern_04.debug.diff.dir': No space left on device
mv: cannot create directory '/var/jenkins/workspace/deal.II-CUDA11.0/build/tests/dofs/CMakeFiles/dofs.dof_tools_extract_dofs_with_support_contained_within_04.mpirun2.release.diff.dir': No space left on device
mv: cannot create directory '/var/jenkins/workspace/deal.II-CUDA11.0/build/tests/dofs/CMakeFiles/dofs.extract_dofs_by_component_02_mg.release.diff.dir': No space left on device
mv: cannot create directory '/var/jenkins/workspace/deal.II-CUDA11.0/build/tests/dofs/CMakeFiles/dofs.dof_renumbering_06.debug.diff.dir': No space left on device
mv: cannot create directory '/var/jenkins/workspace/deal.II-CUDA11.0/build/tests/dofs/CMakeFiles/dofs.dof_tools_18c.release.diff.dir': No space left on device
mv: cannot create directory '/var/jenkins/workspace/deal.II-CUDA11.0/build/tests/dofs/CMakeFiles/dofs.block_info_02.debug.diff.dir': No space left on device
mv: cannot create directory '/var/jenkins/workspace/deal.II-CUDA11.0/build/tests/dofs/CMakeFiles/dofs.accessor_01.debug.diff.dir': No space left on device
mv: cannot create directory '/var/jenkins/workspace/deal.II-CUDA11.0/build/tests/dofs/CMakeFiles/dofs.dof_handler_number_cache_02.release.diff.dir': No space left on device
mv: cannot create directory '/var/jenkins/workspace/deal.II-CUDA11.0/build/tests/dofs/CMakeFiles/dofs.dof_tools_17b.release.diff.dir': No space left on device
mv: cannot create directory '/var/jenkins/workspace/deal.II-CUDA11.0/build/tests/dofs/CMakeFiles/dofs.dof_tools_19.debug.diff.dir': No space left on device
mv: cannot create directory '/var/jenkins/workspace/deal.II-CUDA11.0/build/tests/dofs/CMakeFiles/dofs.dof_tools_02c.debug.diff.dir': No space left on device
mv: cannot create directory '/var/jenkins/workspace/deal.II-CUDA11.0/build/tests/dofs/CMakeFiles/dofs.dof_tools_07.release.diff.dir': No space left on device
mv: cannot create directory '/var/jenkins/workspace/deal.II-CUDA11.0/build/tests/dofs/CMakeFiles/dofs.dof_tools_17c.debug.dir': No space left on device
mv: cannot create directory '/var/jenkins/workspace/deal.II-CUDA11.0/build/tests/dofs/CMakeFiles/dofs.sparsity_pattern_02.debug.diff.dir': No space left on device
mv: cannot create directory '/var/jenkins/workspace/deal.II-CUDA11.0/build/tests/dofs/CMakeFiles/dofs.dof_tools_09.release.dir': No space left on device
mv: cannot create directory '/var/jenkins/workspace/deal.II-CUDA11.0/build/tests/dofs/CMakeFiles/dofs.dof_tools_17a.debug.diff.dir': No space left on device
mv: cannot create directory '/var/jenkins/workspace/deal.II-CUDA11.0/build/tests/dofs/CMakeFiles/dofs.count_dofs_on_patch.debug.diff.dir': No space left on device
mv: cannot create directory '/var/jenkins/workspace/deal.II-CUDA11.0/build/tests/dofs/CMakeFiles/dofs.mg_dof_handler.release.diff.dir': No space left on device
mv: cannot create directory '/var/jenkins/workspace/deal.II-CUDA11.0/build/tests/dofs/CMakeFiles/dofs.dof_tools_19.debug.dir': No space left on device
mv: cannot create directory '/var/jenkins/workspace/deal.II-CUDA11.0/build/tests/dofs/CMakeFiles/dofs.dof_tools_01d.debug.diff.dir': No space left on device
mv: cannot create directory '/var/jenkins/workspace/deal.II-CUDA11.0/build/tests/dofs/CMakeFiles/dofs.dof_tools_extract_dofs_with_support_contained_within_04.mpirun1.release.diff.dir': No space left on device
mv: cannot create directory '/var/jenkins/workspace/deal.II-CUDA11.0/build/tests/dofs/CMakeFiles/dofs.dof_tools_01a_constraints_false.debug.diff.dir': No space left on device
mv: cannot create directory '/var/jenkins/workspace/deal.II-CUDA11.0/build/tests/dofs/CMakeFiles/dofs.dof_tools_write_gnuplot_dof_support_point_info_03.release.dir': No space left on device
mv: cannot create directory '/var/jenkins/workspace/deal.II-CUDA11.0/build/tests/dofs/CMakeFiles/dofs.dof_tools_02a_constraints_false.debug.diff.dir': No space left on device
mv: cannot create directory '/var/jenkins/workspace/deal.II-CUDA11.0/build/tests/dofs/CMakeFiles/dofs.dof_renumbering_10.mpirun3.release.diff.dir': No space left on device
mv: cannot create directory '/var/jenkins/workspace/deal.II-CUDA11.0/build/tests/dofs/CMakeFiles/dofs.dof_renumbering.release.dir': No space left on device
mv: cannot create directory '/var/jenkins/workspace/deal.II-CUDA11.0/build/tests/dofs/CMakeFiles/dofs.dof_renumbering_05.release.diff.dir': No space left on device
mv: cannot create directory '/var/jenkins/workspace/deal.II-CUDA11.0/build/tests/dofs/CMakeFiles/dofs.sparsity_pattern.debug.dir': No space left on device
mv: cannot create directory '/var/jenkins/workspace/deal.II-CUDA11.0/build/tests/dofs/CMakeFiles/dofs.dof_tools_09.release.diff.dir': No space left on device
mv: cannot create directory '/var/jenkins/workspace/deal.II-CUDA11.0/build/tests/dofs/CMakeFiles/dofs.dof_tools_21_c.release.diff.dir': No space left on device
mv: cannot create directory '/var/jenkins/workspace/deal.II-CUDA11.0/build/tests/dofs/CMakeFiles/dofs.dof_tools_12a.mpirun1.debug.diff.dir': No space left on device
mv: cannot create directory '/var/jenkins/workspace/deal.II-CUDA11.0/build/tests/dofs/CMakeFiles/dofs.dof_renumbering_05.release.dir': No space left on device
mv: cannot create directory '/var/jenkins/workspace/deal.II-CUDA11.0/build/tests/dofs/CMakeFiles/dofs.dof_renumbering_03.debug.dir': No space left on device
mv: cannot create directory '/var/jenkins/workspace/deal.II-CUDA11.0/build/tests/dofs/CMakeFiles/dofs.interpolate_dgq_01.release.dir': No space left on device
mv: cannot create directory '/var/jenkins/workspace/deal.II-CUDA11.0/build/tests/dofs/CMakeFiles/dofs.dof_constraints_05.debug.diff.dir': No space left on device
mv: cannot create directory '/var/jenkins/workspace/deal.II-CUDA11.0/build/tests/dofs/CMakeFiles/dofs.dof_tools_02a.debug.dir': No space left on device
mv: cannot create directory '/var/jenkins/workspace/deal.II-CUDA11.0/build/tests/dofs/CMakeFiles/dofs.dof_tools_04a.mpirun1.debug.diff.dir': No space left on device
mv: cannot create directory '/var/jenkins/workspace/deal.II-CUDA11.0/build/tests/dofs/CMakeFiles/dofs.sparsity_pattern_04.debug.dir': No space left on device
mv: cannot create directory '/var/jenkins/workspace/deal.II-CUDA11.0/build/tests/dofs/CMakeFiles/dofs.invalid_iterators_02.debug.diff.dir': No space left on device
mv: cannot create directory '/var/jenkins/workspace/deal.II-CUDA11.0/build/tests/dofs/CMakeFiles/dofs.dof_tools_17b.debug.dir': No space left on device
mv: cannot create directory '/var/jenkins/workspace/deal.II-CUDA11.0/build/tests/dofs/CMakeFiles/dofs.block_info_02.debug.dir': No space left on device
mv: cannot create directory '/var/jenkins/workspace/deal.II-CUDA11.0/build/tests/dofs/CMakeFiles/dofs.dof_renumbering_03.debug.diff.dir': No space left on device
mv: cannot create directory '/var/jenkins/workspace/deal.II-CUDA11.0/build/tests/dofs/CMakeFiles/dofs.dof_renumbering_07.release.diff.dir': No space left on device
mv: cannot create directory '/var/jenkins/workspace/deal.II-CUDA11.0/build/tests/dofs/CMakeFiles/dofs.block_list_02.debug.dir': No space left on device
mv: cannot create directory '/var/jenkins/workspace/deal.II-CUDA11.0/build/tests/dofs/CMakeFiles/dofs.dof_tools_21_b_x_q3.debug.diff.dir': No space left on device
mv: cannot create directory '/var/jenkins/workspace/deal.II-CUDA11.0/build/tests/dofs/CMakeFiles/dofs.dof_tools_10.debug.diff.dir': No space left on device
mv: cannot create directory '/var/jenkins/workspace/deal.II-CUDA11.0/build/tests/dofs/CMakeFiles/dofs.dof_tools_15d.debug.dir': No space left on device
mv: cannot create directory '/var/jenkins/workspace/deal.II-CUDA11.0/build/tests/dofs/CMakeFiles/dofs.dof_tools_17d.release.diff.dir': No space left on device
mv: cannot create directory '/var/jenkins/workspace/deal.II-CUDA11.0/build/tests/dofs/CMakeFiles/dofs.dof_tools_18b.release.diff.dir': No space left on device
mv: cannot create directory '/var/jenkins/workspace/deal.II-CUDA11.0/build/tests/dofs/CMakeFiles/dofs.dof_tools_22a.mpirun5.release.diff.dir': No space left on device
mv: cannot create directory '/var/jenkins/workspace/deal.II-CUDA11.0/build/tests/dofs/CMakeFiles/dofs.locally_relevant_dofs_per_subdomain_01.debug.dir': No space left on device
mv: cannot create directory '/var/jenkins/workspace/deal.II-CUDA11.0/build/tests/dofs/CMakeFiles/dofs.extract_dofs_by_component_05_hp.release.dir': No space left on device
mv: cannot create directory '/var/jenkins/workspace/deal.II-CUDA11.0/build/tests/dofs/CMakeFiles/dofs.dof_tools_14.release.diff.dir': No space left on device
mv: cannot create directory '/var/jenkins/workspace/deal.II-CUDA11.0/build/tests/dofs/CMakeFiles/dofs.interpolate_q_system_mask_01.release.diff.dir': No space left on device
mv: cannot create directory '/var/jenkins/workspace/deal.II-CUDA11.0/build/tests/dofs/CMakeFiles/dofs.dof_tools_21.debug.diff.dir': No space left on device
mv: cannot create directory '/var/jenkins/workspace/deal.II-CUDA11.0/build/tests/dofs/CMakeFiles/dofs.sparsity_pattern_06.mpirun2.debug.diff.dir': No space left on device
mv: cannot create directory '/var/jenkins/workspace/deal.II-CUDA11.0/build/tests/dofs/CMakeFiles/dofs.dof_tools_extract_dofs_with_support_contained_within_04.release.dir': No space left on device
mv: cannot create directory '/var/jenkins/workspace/deal.II-CUDA11.0/build/tests/dofs/CMakeFiles/dofs.sparsity_pattern_01.debug.diff.dir': No space left on device
mv: cannot create directory '/var/jenkins/workspace/deal.II-CUDA11.0/build/tests/dofs/CMakeFiles/dofs.dof_renumbering_09.release.diff.dir': No space left on device
mv: cannot create directory '/var/jenkins/workspace/deal.II-CUDA11.0/build/tests/dofs/CMakeFiles/dofs.dof_renumbering_08.debug.dir': No space left on device
mv: cannot create directory '/var/jenkins/workspace/deal.II-CUDA11.0/build/tests/dofs/CMakeFiles/dofs.dof_tools_write_gnuplot_dof_support_point_info_03.debug.diff.dir': No space left on device
mv: cannot create directory '/var/jenkins/workspace/deal.II-CUDA11.0/build/tests/dofs/CMakeFiles/dofs.dof_tools_21_b_x_q3.release.dir': No space left on device
mv: cannot create directory '/var/jenkins/workspace/deal.II-CUDA11.0/build/tests/dofs/CMakeFiles/dofs.range_based_for_tria.debug.dir': No space left on device
mv: cannot create directory '/var/jenkins/workspace/deal.II-CUDA11.0/build/tests/dofs/CMakeFiles/dofs.dof_tools_02d.debug.dir': No space left on device
mv: cannot create directory '/var/jenkins/workspace/deal.II-CUDA11.0/build/tests/dofs/CMakeFiles/dofs.dof_tools_10.release.dir': No space left on device
mv: cannot create directory '/var/jenkins/workspace/deal.II-CUDA11.0/build/tests/dofs/CMakeFiles/dofs.dof_tools_15d.debug.diff.dir': No space left on device
mv: cannot create directory '/var/jenkins/workspace/deal.II-CUDA11.0/build/tests/dofs/CMakeFiles/dofs.dof_tools_16c.debug.diff.dir': No space left on device
mv: cannot create directory '/var/jenkins/workspace/deal.II-CUDA11.0/build/tests/dofs/CMakeFiles/dofs.sparsity_pattern_07.mpirun2.release.diff.dir': No space left on device
mv: cannot create directory '/var/jenkins/workspace/deal.II-CUDA11.0/build/tests/dofs/CMakeFiles/dofs.sparsity_pattern_06.mpirun1.release.diff.dir': No space left on device
mv: cannot create directory '/var/jenkins/workspace/deal.II-CUDA11.0/build/tests/dofs/CMakeFiles/dofs.interpolate_q_system_mask_01.debug.dir': No space left on device
mv: cannot create directory '/var/jenkins/workspace/deal.II-CUDA11.0/build/tests/dofs/CMakeFiles/dofs.dof_tools_01d.release.dir': No space left on device
mv: cannot create directory '/var/jenkins/workspace/deal.II-CUDA11.0/build/tests/dofs/CMakeFiles/dofs.dof_constraints_03.release.diff.dir': No space left on device
mv: cannot create directory '/var/jenkins/workspace/deal.II-CUDA11.0/build/tests/dofs/CMakeFiles/dofs.dof_tools_03.release.dir': No space left on device
mv: cannot create directory '/var/jenkins/workspace/deal.II-CUDA11.0/build/tests/dofs/CMakeFiles/dofs.dof_tools_13.debug.dir': No space left on device
mv: cannot create directory '/var/jenkins/workspace/deal.II-CUDA11.0/build/tests/dofs/CMakeFiles/dofs.dof_tools_22a.mpirun3.debug.diff.dir': No space left on device
mv: cannot create directory '/var/jenkins/workspace/deal.II-CUDA11.0/build/tests/dofs/CMakeFiles/dofs.dof_handler_redistributed_dofs_02.release.diff.dir': No space left on device
mv: cannot create directory '/var/jenkins/workspace/deal.II-CUDA11.0/build/tests/dofs/CMakeFiles/dofs.dof_tools_01a_constraints_true.debug.dir': No space left on device
mv: cannot create directory '/var/jenkins/workspace/deal.II-CUDA11.0/build/tests/dofs/CMakeFiles/dofs.dof_constraints_03.debug.dir': No space left on device
mv: cannot create directory '/var/jenkins/workspace/deal.II-CUDA11.0/build/tests/dofs/CMakeFiles/dofs.invalid_iterators_01.debug.diff.dir': No space left on device
mv: cannot create directory '/var/jenkins/workspace/deal.II-CUDA11.0/build/tests/dofs/CMakeFiles/dofs.dof_tools_21.debug.dir': No space left on device
mv: cannot create directory '/var/jenkins/workspace/deal.II-CUDA11.0/build/tests/dofs/CMakeFiles/dofs.dof_tools_15d.release.dir': No space left on device
mv: cannot create directory '/var/jenkins/workspace/deal.II-CUDA11.0/build/tests/dofs/CMakeFiles/dofs.dof_renumbering_10.debug.dir': No space left on device
mv: cannot create directory '/var/jenkins/workspace/deal.II-CUDA11.0/build/tests/dofs/CMakeFiles/dofs.dof_constraints_04.release.diff.dir': No space left on device
mv: cannot create directory '/var/jenkins/workspace/deal.II-CUDA11.0/build/tests/dofs/CMakeFiles/dofs.dof_tools_17d.debug.diff.dir': No space left on device
mv: cannot create directory '/var/jenkins/workspace/deal.II-CUDA11.0/build/tests/dofs/CMakeFiles/dofs.n_boundary_dofs_01.mpirun2.release.diff.dir': No space left on device
mv: cannot create directory '/var/jenkins/workspace/deal.II-CUDA11.0/build/tests/dofs/CMakeFiles/dofs.sparsity_pattern_06.release.dir': No space left on device
mv: cannot create directory '/var/jenkins/workspace/deal.II-CUDA11.0/build/tests/dofs/CMakeFiles/dofs.n_dofs_per_object.debug.diff.dir': No space left on device
mv: cannot create directory '/var/jenkins/workspace/deal.II-CUDA11.0/build/tests/dofs/CMakeFiles/dofs.extract_dofs_per_component_01.debug.dir': No space left on device
mv: cannot create directory '/var/jenkins/workspace/deal.II-CUDA11.0/build/tests/dofs/CMakeFiles/dofs.extract_dofs_by_component_06.release.dir': No space left on device
mv: cannot create directory '/var/jenkins/workspace/deal.II-CUDA11.0/build/tests/dofs/CMakeFiles/dofs.dof_tools_01a_constraints_true.debug.diff.dir': No space left on device
mv: cannot create directory '/var/jenkins/workspace/deal.II-CUDA11.0/build/tests/dofs/CMakeFiles/dofs.dof_tools_16d.release.dir': No space left on device
mv: cannot create directory '/var/jenkins/workspace/deal.II-CUDA11.0/build/tests/dofs/CMakeFiles/dofs.dof_tools_13.debug.diff.dir': No space left on device
mv: cannot create directory '/var/jenkins/workspace/deal.II-CUDA11.0/build/tests/dofs/CMakeFiles/dofs.dof_tools_18d.debug.diff.dir': No space left on device
mv: cannot create directory '/var/jenkins/workspace/deal.II-CUDA11.0/build/tests/dofs/CMakeFiles/dofs.dof_tools_22a.mpirun3.release.diff.dir': No space left on device
mv: cannot create directory '/var/jenkins/workspace/deal.II-CUDA11.0/build/tests/dofs/CMakeFiles/dofs.extract_dofs_by_component_03.debug.dir': No space left on device
mv: cannot create directory '/var/jenkins/workspace/deal.II-CUDA11.0/build/tests/dofs/CMakeFiles/dofs.extract_dofs_by_component_02_mg.debug.diff.dir': No space left on device
mv: cannot create directory '/var/jenkins/workspace/deal.II-CUDA11.0/build/tests/dofs/CMakeFiles/dofs.clear_signal.release.dir': No space left on device
mv: cannot create directory '/var/jenkins/workspace/deal.II-CUDA11.0/build/tests/dofs/CMakeFiles/dofs.dof_tools_15b.release.diff.dir': No space left on device
mv: cannot create directory '/var/jenkins/workspace/deal.II-CUDA11.0/build/tests/dofs/CMakeFiles/dofs.dof_tools_02a_subdomain.debug.dir': No space left on device
mv: cannot create directory '/var/jenkins/workspace/deal.II-CUDA11.0/build/tests/dofs/CMakeFiles/dofs.dof_tools_13a.release.diff.dir': No space left on device
mv: cannot create directory '/var/jenkins/workspace/deal.II-CUDA11.0/build/tests/dofs/CMakeFiles/dofs.range_based_for_step-6.release.diff.dir': No space left on device
mv: cannot create directory '/var/jenkins/workspace/deal.II-CUDA11.0/build/tests/dofs/CMakeFiles/dofs.interpolate_dgq_02.debug.dir': No space left on device
mv: cannot create directory '/var/jenkins/workspace/deal.II-CUDA11.0/build/tests/dofs/CMakeFiles/dofs.dof_tools_01a.release.diff.dir': No space left on device
mv: cannot create directory '/var/jenkins/workspace/deal.II-CUDA11.0/build/tests/dofs/CMakeFiles/dofs.dof_renumbering.release.diff.dir': No space left on device
mv: cannot create directory '/var/jenkins/workspace/deal.II-CUDA11.0/build/tests/dofs/CMakeFiles/dofs.dof_tools_25.release.dir': No space left on device
mv: cannot create directory '/var/jenkins/workspace/deal.II-CUDA11.0/build/tests/dofs/CMakeFiles/dofs.dof_renumbering_04a.release.diff.dir': No space left on device
mv: cannot create directory '/var/jenkins/workspace/deal.II-CUDA11.0/build/tests/dofs/CMakeFiles/dofs.dof_tools_16b.release.dir': No space left on device
mv: cannot create directory '/var/jenkins/workspace/deal.II-CUDA11.0/build/tests/dofs/CMakeFiles/dofs.dof_tools_extract_dofs_with_support_contained_within_03.release.dir': No space left on device
mv: cannot create directory '/var/jenkins/workspace/deal.II-CUDA11.0/build/tests/dofs/CMakeFiles/dofs.dof_tools_17d.debug.dir': No space left on device
mv: cannot create directory '/var/jenkins/workspace/deal.II-CUDA11.0/build/tests/dofs/CMakeFiles/dofs.dof_tools_21_b.release.dir': No space left on device
mv: cannot create directory '/var/jenkins/workspace/deal.II-CUDA11.0/build/tests/dofs/CMakeFiles/dofs.dof_tools_23.debug.diff.dir': No space left on device
mv: cannot create directory '/var/jenkins/workspace/deal.II-CUDA11.0/build/tests/dofs/CMakeFiles/dofs.range_based_for_step-6.release.dir': No space left on device
mv: cannot create directory '/var/jenkins/workspace/deal.II-CUDA11.0/build/tests/dofs/CMakeFiles/dofs.hp_constraints_are_implemented.debug.diff.dir': No space left on device
mv: cannot create directory '/var/jenkins/workspace/deal.II-CUDA11.0/build/tests/dofs/CMakeFiles/dofs.dof_tools_24.release.diff.dir': No space left on device
mv: cannot create directory '/var/jenkins/workspace/deal.II-CUDA11.0/build/tests/dofs/CMakeFiles/dofs.dof_tools_write_gnuplot_dof_support_point_info_01.debug.diff.dir': No space left on device
mv: cannot create directory '/var/jenkins/workspace/deal.II-CUDA11.0/build/tests/dofs/CMakeFiles/dofs.dof_tools_21_b_y.debug.dir': No space left on device
mv: cannot create directory '/var/jenkins/workspace/deal.II-CUDA11.0/build/tests/dofs/CMakeFiles/dofs.dof_renumbering_06.debug.dir': No space left on device
mv: cannot create directory '/var/jenkins/workspace/deal.II-CUDA11.0/build/tests/dofs/CMakeFiles/dofs.dof_tools_18a.debug.dir': No space left on device
mv: cannot create directory '/var/jenkins/workspace/deal.II-CUDA11.0/build/tests/dofs/CMakeFiles/dofs.n_dofs_per_object.debug.dir': No space left on device
mv: cannot create directory '/var/jenkins/workspace/deal.II-CUDA11.0/build/tests/dofs/CMakeFiles/dofs.dof_tools_24.release.dir': No space left on device
mv: cannot create directory '/var/jenkins/workspace/deal.II-CUDA11.0/build/tests/dofs/CMakeFiles/dofs.dof_renumbering_02.release.diff.dir': No space left on device
mv: cannot create directory '/var/jenkins/workspace/deal.II-CUDA11.0/build/tests/dofs/CMakeFiles/dofs.dof_handler_number_cache_02.release.dir': No space left on device
mv: cannot create directory '/var/jenkins/workspace/deal.II-CUDA11.0/build/tests/dofs/CMakeFiles/dofs.sparsity_pattern_05.release.dir': No space left on device
mv: cannot create directory '/var/jenkins/workspace/deal.II-CUDA11.0/build/tests/dofs/CMakeFiles/dofs.interpolate_q_01.release.diff.dir': No space left on device
mv: cannot create directory '/var/jenkins/workspace/deal.II-CUDA11.0/build/tests/dofs/CMakeFiles/dofs.mg_dof_handler.release.dir': No space left on device
mv: cannot create directory '/var/jenkins/workspace/deal.II-CUDA11.0/build/tests/dofs/CMakeFiles/dofs.dof_tools_write_gnuplot_dof_support_point_info_04.release.diff.dir': No space left on device
mv: cannot create directory '/var/jenkins/workspace/deal.II-CUDA11.0/build/tests/dofs/CMakeFiles/dofs.dof_constraints_04.debug.diff.dir': No space left on device
mv: cannot create directory '/var/jenkins/workspace/deal.II-CUDA11.0/build/tests/dofs/CMakeFiles/dofs.dof_renumbering_zorder_02.debug.diff.dir': No space left on device
mv: cannot create directory '/var/jenkins/workspace/deal.II-CUDA11.0/build/tests/dofs/CMakeFiles/dofs.dof_tools_00a.debug.dir': No space left on device
mv: cannot create directory '/var/jenkins/workspace/deal.II-CUDA11.0/build/tests/dofs/CMakeFiles/dofs.interpolate_q_system_01.debug.diff.dir': No space left on device
mv: cannot create directory '/var/jenkins/workspace/deal.II-CUDA11.0/build/tests/dofs/CMakeFiles/dofs.hp_constraints_are_implemented.debug.dir': No space left on device
mv: cannot create directory '/var/jenkins/workspace/deal.II-CUDA11.0/build/tests/dofs/CMakeFiles/dofs.get_dofs_on_patch.debug.dir': No space left on device
mv: cannot create directory '/var/jenkins/workspace/deal.II-CUDA11.0/build/tests/dofs/CMakeFiles/dofs.extract_dofs_by_component_04.debug.diff.dir': No space left on device
mv: cannot create directory '/var/jenkins/workspace/deal.II-CUDA11.0/build/tests/dofs/CMakeFiles/dofs.dof_renumbering_07.release.dir': No space left on device
mv: cannot create directory '/var/jenkins/workspace/deal.II-CUDA11.0/build/tests/dofs/CMakeFiles/dofs.range_based_for_tria.debug.diff.dir': No space left on device
mv: cannot create directory '/var/jenkins/workspace/deal.II-CUDA11.0/build/tests/dofs/CMakeFiles/dofs.dof_renumbering.debug.diff.dir': No space left on device
mv: cannot create directory '/var/jenkins/workspace/deal.II-CUDA11.0/build/tests/dofs/CMakeFiles/dofs.dof_handler_number_cache.debug.dir': No space left on device
mv: cannot create directory '/var/jenkins/workspace/deal.II-CUDA11.0/build/tests/dofs/CMakeFiles/dofs.dof_constraints_08.release.dir': No space left on device
mv: cannot create directory '/var/jenkins/workspace/deal.II-CUDA11.0/build/tests/dofs/CMakeFiles/dofs.dof_tools_01d.debug.dir': No space left on device
mv: cannot create directory '/var/jenkins/workspace/deal.II-CUDA11.0/build/tests/dofs/CMakeFiles/dofs.dof_tools_14.debug.dir': No space left on device
mv: cannot create directory '/var/jenkins/workspace/deal.II-CUDA11.0/build/tests/dofs/CMakeFiles/dofs.dof_tools_17c.release.dir': No space left on device
mv: cannot create directory '/var/jenkins/workspace/deal.II-CUDA11.0/build/tests/dofs/CMakeFiles/dofs.locally_relevant_dofs_per_subdomain_01_hp.mpirun3.debug.diff.dir': No space left on device
mv: cannot create directory '/var/jenkins/workspace/deal.II-CUDA11.0/build/tests/dofs/CMakeFiles/dofs.dof_tools_write_gnuplot_dof_support_point_info_04.debug.diff.dir': No space left on device
mv: cannot create directory '/var/jenkins/workspace/deal.II-CUDA11.0/build/tests/dofs/CMakeFiles/dofs.dof_constraints_11_x.release.dir': No space left on device
mv: cannot create directory '/var/jenkins/workspace/deal.II-CUDA11.0/build/tests/dofs/CMakeFiles/dofs.dof_tools_04a.mpirun1.release.diff.dir': No space left on device
mv: cannot create directory '/var/jenkins/workspace/deal.II-CUDA11.0/build/tests/dofs/CMakeFiles/dofs.extract_dofs_by_component_04.debug.dir': No space left on device
mv: cannot create directory '/var/jenkins/workspace/deal.II-CUDA11.0/build/tests/dofs/CMakeFiles/dofs.dof_handler_redistributed_dofs_01.debug.dir': No space left on device
mv: cannot create directory '/var/jenkins/workspace/deal.II-CUDA11.0/build/tests/dofs/CMakeFiles/dofs.dof_tools_15b.release.dir': No space left on device
mv: cannot create directory '/var/jenkins/workspace/deal.II-CUDA11.0/build/tests/dofs/CMakeFiles/dofs.dof_handler_number_cache.debug.diff.dir': No space left on device
mv: cannot create directory '/var/jenkins/workspace/deal.II-CUDA11.0/build/tests/dofs/CMakeFiles/dofs.dof_constraints_06.release.dir': No space left on device
mv: cannot create directory '/var/jenkins/workspace/deal.II-CUDA11.0/build/tests/dofs/CMakeFiles/dofs.locally_relevant_dofs_per_subdomain_01.mpirun3.release.diff.dir': No space left on device
mv: cannot create directory '/var/jenkins/workspace/deal.II-CUDA11.0/build/tests/dofs/CMakeFiles/dofs.interpolate_q_system_01.debug.dir': No space left on device
mv: cannot create directory '/var/jenkins/workspace/deal.II-CUDA11.0/build/tests/dofs/CMakeFiles/dofs.extract_dofs_by_component_05.debug.diff.dir': No space left on device
mv: cannot create directory '/var/jenkins/workspace/deal.II-CUDA11.0/build/tests/dofs/CMakeFiles/dofs.extract_dofs_by_component_01y.debug.diff.dir': No space left on device
mv: cannot create directory '/var/jenkins/workspace/deal.II-CUDA11.0/build/tests/dofs/CMakeFiles/dofs.extract_dofs_by_component_01_hp.release.diff.dir': No space left on device
mv: cannot create directory '/var/jenkins/workspace/deal.II-CUDA11.0/build/tests/dofs/CMakeFiles/dofs.dof_tools_extract_dofs_with_support_contained_within_01.release.diff.dir': No space left on device
mv: cannot create directory '/var/jenkins/workspace/deal.II-CUDA11.0/build/tests/dofs/CMakeFiles/dofs.dof_tools_13.release.dir': No space left on device
mv: cannot create directory '/var/jenkins/workspace/deal.II-CUDA11.0/build/tests/dofs/CMakeFiles/dofs.interpolate_boundary_values_01.release.dir': No space left on device
mv: cannot create directory '/var/jenkins/workspace/deal.II-CUDA11.0/build/tests/dofs/CMakeFiles/dofs.dof_tools_write_gnuplot_dof_support_point_info_03.release.diff.dir': No space left on device
mv: cannot create directory '/var/jenkins/workspace/deal.II-CUDA11.0/build/tests/dofs/CMakeFiles/dofs.dof_tools_extract_dofs_with_support_contained_within_01.debug.diff.dir': No space left on device
mv: cannot create directory '/var/jenkins/workspace/deal.II-CUDA11.0/build/tests/dofs/CMakeFiles/dofs.dof_constraints_11.release.diff.dir': No space left on device
mv: cannot create directory '/var/jenkins/workspace/deal.II-CUDA11.0/build/tests/dofs/CMakeFiles/dofs.block_relaxation_01.release.diff.dir': No space left on device
mv: cannot create directory '/var/jenkins/workspace/deal.II-CUDA11.0/build/tests/dofs/CMakeFiles/dofs.dof_constraints_08.debug.dir': No space left on device
mv: cannot create directory '/var/jenkins/workspace/deal.II-CUDA11.0/build/tests/dofs/CMakeFiles/dofs.block_list_01.debug.diff.dir': No space left on device
mv: cannot create directory '/var/jenkins/workspace/deal.II-CUDA11.0/build/tests/dofs/CMakeFiles/dofs.dof_tools_18a_1d.release.dir': No space left on device
mv: cannot create directory '/var/jenkins/workspace/deal.II-CUDA11.0/build/tests/dofs/CMakeFiles/dofs.extract_dofs_by_component_01x.debug.diff.dir': No space left on device
mv: cannot create directory '/var/jenkins/workspace/deal.II-CUDA11.0/build/tests/dofs/CMakeFiles/dofs.interpolate_boundary_values_02.release.dir': No space left on device
mv: cannot create directory '/var/jenkins/workspace/deal.II-CUDA11.0/build/tests/dofs/CMakeFiles/dofs.clear_signal.mpirun1.release.diff.dir': No space left on device
mv: cannot create directory '/var/jenkins/workspace/deal.II-CUDA11.0/build/tests/dofs/CMakeFiles/dofs.dof_renumbering_zorder_02.debug.dir': No space left on device
mv: cannot create directory '/var/jenkins/workspace/deal.II-CUDA11.0/build/tests/dofs/CMakeFiles/dofs.dof_tools_21_c.debug.diff.dir': No space left on device
mv: cannot create directory '/var/jenkins/workspace/deal.II-CUDA11.0/build/tests/dofs/CMakeFiles/dofs.sparsity_pattern_02.release.diff.dir': No space left on device
mv: cannot create directory '/var/jenkins/workspace/deal.II-CUDA11.0/build/tests/dofs/CMakeFiles/dofs.extract_dofs_by_component_05.debug.dir': No space left on device
mv: cannot create directory '/var/jenkins/workspace/deal.II-CUDA11.0/build/tests/dofs/CMakeFiles/dofs.dof_renumbering_zorder_01.release.dir': No space left on device
mv: cannot create directory '/var/jenkins/workspace/deal.II-CUDA11.0/build/tests/dofs/CMakeFiles/dofs.dof_tools_16a.debug.diff.dir': No space left on device
mv: cannot create directory '/var/jenkins/workspace/deal.II-CUDA11.0/build/tests/dofs/CMakeFiles/dofs.dof_tools_04a.mpirun3.debug.diff.dir': No space left on device
mv: cannot create directory '/var/jenkins/workspace/deal.II-CUDA11.0/build/tests/dofs/CMakeFiles/dofs.locally_relevant_dofs_per_subdomain_01.release.dir': No space left on device
mv: cannot create directory '/var/jenkins/workspace/deal.II-CUDA11.0/build/tests/dofs/CMakeFiles/dofs.range_based_for_step-6.debug.diff.dir': No space left on device
mv: cannot create directory '/var/jenkins/workspace/deal.II-CUDA11.0/build/tests/dofs/CMakeFiles/dofs.dof_tools_extract_dofs_with_support_contained_within_01.debug.dir': No space left on device
mv: cannot create directory '/var/jenkins/workspace/deal.II-CUDA11.0/build/tests/dofs/CMakeFiles/dofs.dof_renumbering_02.debug.dir': No space left on device
mv: cannot create directory '/var/jenkins/workspace/deal.II-CUDA11.0/build/tests/dofs/CMakeFiles/dofs.dof_tools_16b.debug.diff.dir': No space left on device
mv: cannot create directory '/var/jenkins/workspace/deal.II-CUDA11.0/build/tests/dofs/CMakeFiles/dofs.dof_tools_21_c.release.dir': No space left on device
mv: cannot create directory '/var/jenkins/workspace/deal.II-CUDA11.0/build/tests/dofs/CMakeFiles/dofs.extract_dofs_by_component_01x.debug.dir': No space left on device
mv: cannot create directory '/var/jenkins/workspace/deal.II-CUDA11.0/build/tests/dofs/CMakeFiles/dofs.dof_tools_06.debug.dir': No space left on device
mv: cannot create directory '/var/jenkins/workspace/deal.II-CUDA11.0/build/tests/dofs/CMakeFiles/dofs.dof_tools_02a.release.diff.dir': No space left on device
mv: cannot create directory '/var/jenkins/workspace/deal.II-CUDA11.0/build/tests/dofs/CMakeFiles/dofs.dof_tools_15d.release.diff.dir': No space left on device
mv: cannot create directory '/var/jenkins/workspace/deal.II-CUDA11.0/build/tests/dofs/CMakeFiles/dofs.dof_tools_02d.debug.diff.dir': No space left on device
mv: cannot create directory '/var/jenkins/workspace/deal.II-CUDA11.0/build/tests/dofs/CMakeFiles/dofs.dof_tools_08.debug.dir': No space left on device
mv: cannot create directory '/var/jenkins/workspace/deal.II-CUDA11.0/build/tests/dofs/CMakeFiles/dofs.sparsity_pattern_02.release.dir': No space left on device
mv: cannot create directory '/var/jenkins/workspace/deal.II-CUDA11.0/build/tests/dofs/CMakeFiles/dofs.sparsity_pattern_07.debug.dir': No space left on device
mv: cannot create directory '/var/jenkins/workspace/deal.II-CUDA11.0/build/tests/dofs/CMakeFiles/dofs.dof_tools_extract_dofs_with_support_contained_within_02.mpirun5.release.diff.dir': No space left on device
mv: cannot create directory '/var/jenkins/workspace/deal.II-CUDA11.0/build/tests/dofs/CMakeFiles/dofs.block_list_04.release.diff.dir': No space left on device
mv: cannot create directory '/var/jenkins/workspace/deal.II-CUDA11.0/build/tests/dofs/CMakeFiles/dofs.dof_tools_02a_subdomain.debug.diff.dir': No space left on device
mv: cannot create directory '/var/jenkins/workspace/deal.II-CUDA11.0/build/tests/dofs/CMakeFiles/dofs.dof_tools_15c.debug.dir': No space left on device
mv: cannot create directory '/var/jenkins/workspace/deal.II-CUDA11.0/build/tests/dofs/CMakeFiles/dofs.extract_dofs_by_component_01_hp.release.dir': No space left on device
mv: cannot create directory '/var/jenkins/workspace/deal.II-CUDA11.0/build/tests/dofs/CMakeFiles/dofs.dof_renumbering_10.mpirun1.debug.diff.dir': No space left on device
mv: cannot create directory '/var/jenkins/workspace/deal.II-CUDA11.0/build/tests/dofs/CMakeFiles/dofs.dof_tools_02c.release.diff.dir': No space left on device
mv: cannot create directory '/var/jenkins/workspace/deal.II-CUDA11.0/build/tests/dofs/CMakeFiles/dofs.dof_renumbering_04.release.diff.dir': No space left on device
mv: cannot create directory '/var/jenkins/workspace/deal.II-CUDA11.0/build/tests/dofs/CMakeFiles/dofs.dof_tools_09.debug.dir': No space left on device
mv: cannot create directory '/var/jenkins/workspace/deal.II-CUDA11.0/build/tests/dofs/CMakeFiles/dofs.dof_tools_02a_constraints_true.debug.diff.dir': No space left on device
mv: cannot create directory '/var/jenkins/workspace/deal.II-CUDA11.0/build/tests/dofs/CMakeFiles/dofs.dof_tools_02a_subdomain.release.dir': No space left on device
mv: cannot create directory '/var/jenkins/workspace/deal.II-CUDA11.0/build/tests/dofs/CMakeFiles/dofs.dof_tools_02b.release.dir': No space left on device
mv: cannot create directory '/var/jenkins/workspace/deal.II-CUDA11.0/build/tests/dofs/CMakeFiles/dofs.extract_dofs_per_component_01.mpirun3.debug.diff.dir': No space left on device
mv: cannot create directory '/var/jenkins/workspace/deal.II-CUDA11.0/build/tests/dofs/CMakeFiles/dofs.count_dofs_on_patch.debug.dir': No space left on device
mv: cannot create directory '/var/jenkins/workspace/deal.II-CUDA11.0/build/tests/dofs/CMakeFiles/dofs.dof_tools_20.debug.diff.dir': No space left on device
mv: cannot create directory '/var/jenkins/workspace/deal.II-CUDA11.0/build/tests/dofs/CMakeFiles/dofs.dof_tools_21_b_y.debug.diff.dir': No space left on device
mv: cannot create directory '/var/jenkins/workspace/deal.II-CUDA11.0/build/tests/dofs/CMakeFiles/dofs.dof_tools_05.release.diff.dir': No space left on device
mv: cannot create directory '/var/jenkins/workspace/deal.II-CUDA11.0/build/tests/dofs/CMakeFiles/dofs.dof_constraints_10.debug.diff.dir': No space left on device
mv: cannot create directory '/var/jenkins/workspace/deal.II-CUDA11.0/build/tests/dofs/CMakeFiles/dofs.extract_dofs_per_component_01.mpirun1.debug.diff.dir': No space left on device
mv: cannot create directory '/var/jenkins/workspace/deal.II-CUDA11.0/build/tests/dofs/CMakeFiles/dofs.dof_handler_redistributed_dofs_01.release.dir': No space left on device
mv: cannot create directory '/var/jenkins/workspace/deal.II-CUDA11.0/build/tests/dofs/CMakeFiles/dofs.dof_tools_03.debug.diff.dir': No space left on device
mv: cannot create directory '/var/jenkins/workspace/deal.II-CUDA11.0/build/tests/dofs/CMakeFiles/dofs.dof_renumbering_08.release.dir': No space left on device
mv: cannot create directory '/var/jenkins/workspace/deal.II-CUDA11.0/build/tests/dofs/CMakeFiles/dofs.dof_tools_22a.mpirun1.debug.diff.dir': No space left on device
mv: cannot create directory '/var/jenkins/workspace/deal.II-CUDA11.0/build/tests/dofs/CMakeFiles/dofs.interpolate_q_system_mask_02.release.diff.dir': No space left on device
mv: cannot create directory '/var/jenkins/workspace/deal.II-CUDA11.0/build/tests/dofs/CMakeFiles/dofs.dof_tools_extract_dofs_with_support_contained_within_02.mpirun3.release.diff.dir': No space left on device
mv: cannot create directory '/var/jenkins/workspace/deal.II-CUDA11.0/build/tests/dofs/CMakeFiles/dofs.dof_renumbering_02.release.dir': No space left on device
mv: cannot create directory '/var/jenkins/workspace/deal.II-CUDA11.0/build/tests/dofs/CMakeFiles/dofs.dof_tools_04.release.diff.dir': No space left on device
mv: cannot create directory '/var/jenkins/workspace/deal.II-CUDA11.0/build/tests/dofs/CMakeFiles/dofs.dof_constraints_11.debug.dir': No space left on device
mv: cannot create directory '/var/jenkins/workspace/deal.II-CUDA11.0/build/tests/dofs/CMakeFiles/dofs.dof_handler_redistributed_dofs_02.debug.dir': No space left on device
mv: cannot create directory '/var/jenkins/workspace/deal.II-CUDA11.0/build/tests/dofs/CMakeFiles/dofs.dof_tools_22a.mpirun5.debug.diff.dir': No space left on device
mv: cannot create directory '/var/jenkins/workspace/deal.II-CUDA11.0/build/tests/dofs/CMakeFiles/dofs.dof_tools_02a_constraints_true.release.dir': No space left on device
mv: cannot create directory '/var/jenkins/workspace/deal.II-CUDA11.0/build/tests/dofs/CMakeFiles/dofs.extract_dofs_by_component_02_hp.debug.diff.dir': No space left on device
mv: cannot create directory '/var/jenkins/workspace/deal.II-CUDA11.0/build/tests/dofs/CMakeFiles/dofs.sparsity_pattern_06.debug.dir': No space left on device
mv: cannot create directory '/var/jenkins/workspace/deal.II-CUDA11.0/build/tests/dofs/CMakeFiles/dofs.dof_renumbering_04.release.dir': No space left on device
mv: cannot create directory '/var/jenkins/workspace/deal.II-CUDA11.0/build/tests/dofs/CMakeFiles/dofs.dof_renumbering_04.debug.diff.dir': No space left on device
mv: cannot create directory '/var/jenkins/workspace/deal.II-CUDA11.0/build/tests/dofs/CMakeFiles/dofs.clear_signal.mpirun1.debug.diff.dir': No space left on device
mv: cannot create directory '/var/jenkins/workspace/deal.II-CUDA11.0/build/tests/dofs/CMakeFiles/dofs.dof_test.debug.diff.dir': No space left on device
mv: cannot create directory '/var/jenkins/workspace/deal.II-CUDA11.0/build/tests/dofs/CMakeFiles/dofs.dof_constraints_02.release.diff.dir': No space left on device
mv: cannot create directory '/var/jenkins/workspace/deal.II-CUDA11.0/build/tests/dofs/CMakeFiles/dofs.extract_dofs_by_component_05_hp.debug.dir': No space left on device
mv: cannot create directory '/var/jenkins/workspace/deal.II-CUDA11.0/build/tests/dofs/CMakeFiles/dofs.dof_tools_20.release.diff.dir': No space left on device
mv: cannot create directory '/var/jenkins/workspace/deal.II-CUDA11.0/build/tests/dofs/CMakeFiles/dofs.dof_tools_21_b_y.release.diff.dir': No space left on device
mv: cannot create directory '/var/jenkins/workspace/deal.II-CUDA11.0/build/tests/dofs/CMakeFiles/dofs.dof_constraints_07.debug.dir': No space left on device
mv: cannot create directory '/var/jenkins/workspace/deal.II-CUDA11.0/build/tests/dofs/CMakeFiles/dofs.block_relaxation_01.debug.dir': No space left on device
mv: cannot create directory '/var/jenkins/workspace/deal.II-CUDA11.0/build/tests/dofs/CMakeFiles/dofs.dof_tools_12.debug.dir': No space left on device
mv: cannot create directory '/var/jenkins/workspace/deal.II-CUDA11.0/build/tests/dofs/CMakeFiles/dofs.dof_renumbering_04a.debug.diff.dir': No space left on device
mv: cannot create directory '/var/jenkins/workspace/deal.II-CUDA11.0/build/tests/dofs/CMakeFiles/dofs.sparsity_pattern_05.debug.dir': No space left on device
mv: cannot create directory '/var/jenkins/workspace/deal.II-CUDA11.0/build/tests/dofs/CMakeFiles/dofs.dof_tools_01b.release.dir': No space left on device
mv: cannot create directory '/var/jenkins/workspace/deal.II-CUDA11.0/build/tests/dofs/CMakeFiles/dofs.extract_dofs_by_component_02_mg.release.dir': No space left on device
mv: cannot create directory '/var/jenkins/workspace/deal.II-CUDA11.0/build/tests/dofs/CMakeFiles/dofs.dof_tools_18a_1d.debug.diff.dir': No space left on device
mv: cannot create directory '/var/jenkins/workspace/deal.II-CUDA11.0/build/tests/dofs/CMakeFiles/dofs.dof_tools_02a.debug.diff.dir': No space left on device
mv: cannot create directory '/var/jenkins/workspace/deal.II-CUDA11.0/build/tests/dofs/CMakeFiles/dofs.dof_tools_08.debug.diff.dir': No space left on device
mv: cannot create directory '/var/jenkins/workspace/deal.II-CUDA11.0/build/tests/dofs/CMakeFiles/dofs.n_boundary_dofs_01.mpirun1.debug.diff.dir': No space left on device
mv: cannot create directory '/var/jenkins/workspace/deal.II-CUDA11.0/build/tests/dofs/CMakeFiles/dofs.dof_tools_extract_dofs_with_support_contained_within_02.debug.dir': No space left on device
mv: cannot create directory '/var/jenkins/workspace/deal.II-CUDA11.0/build/tests/dofs/CMakeFiles/dofs.dof_renumbering_08.debug.diff.dir': No space left on device
mv: cannot create directory '/var/jenkins/workspace/deal.II-CUDA11.0/build/tests/dofs/CMakeFiles/dofs.dof_constraints_06.debug.dir': No space left on device
mv: cannot create directory '/var/jenkins/workspace/deal.II-CUDA11.0/build/tests/dofs/CMakeFiles/dofs.dof_constraints_11_x.debug.dir': No space left on device
mv: cannot create directory '/var/jenkins/workspace/deal.II-CUDA11.0/build/tests/dofs/CMakeFiles/dofs.dof_tools_21_b_x.release.dir': No space left on device
mv: cannot create directory '/var/jenkins/workspace/deal.II-CUDA11.0/build/tests/dofs/CMakeFiles/dofs.dof_tools_13a.release.dir': No space left on device
mv: cannot create directory '/var/jenkins/workspace/deal.II-CUDA11.0/build/tests/dofs/CMakeFiles/dofs.extract_dofs_per_component_02.mpirun1.debug.diff.dir': No space left on device
mv: cannot create directory '/var/jenkins/workspace/deal.II-CUDA11.0/build/tests/dofs/CMakeFiles/dofs.extract_dofs_by_component_01.debug.diff.dir': No space left on device
mv: cannot create directory '/var/jenkins/workspace/deal.II-CUDA11.0/build/tests/dofs/CMakeFiles/dofs.dof_renumbering_zorder_01.debug.diff.dir': No space left on device
mv: cannot create directory '/var/jenkins/workspace/deal.II-CUDA11.0/build/tests/dofs/CMakeFiles/dofs.locally_relevant_dofs_per_subdomain_01_hp.mpirun3.release.diff.dir': No space left on device
mv: cannot create directory '/var/jenkins/workspace/deal.II-CUDA11.0/build/tests/dofs/CMakeFiles/dofs.block_list_01.release.diff.dir': No space left on device
mv: cannot create directory '/var/jenkins/workspace/deal.II-CUDA11.0/build/tests/dofs/CMakeFiles/dofs.dof_tools_15c.debug.diff.dir': No space left on device
mv: cannot create directory '/var/jenkins/workspace/deal.II-CUDA11.0/build/tests/dofs/CMakeFiles/dofs.dof_tools_21_b.debug.dir': No space left on device
mv: cannot create directory '/var/jenkins/workspace/deal.II-CUDA11.0/build/tests/dofs/CMakeFiles/dofs.dof_test.debug.dir': No space left on device
mv: cannot create directory '/var/jenkins/workspace/deal.II-CUDA11.0/build/tests/dofs/CMakeFiles/dofs.dof_renumbering_04.debug.dir': No space left on device
mv: cannot create directory '/var/jenkins/workspace/deal.II-CUDA11.0/build/tests/dofs/CMakeFiles/dofs.dof_tools_01a_subdomain.release.dir': No space left on device
mv: cannot create directory '/var/jenkins/workspace/deal.II-CUDA11.0/build/tests/dofs/CMakeFiles/dofs.dof_handler_number_cache.release.dir': No space left on device
mv: cannot create directory '/var/jenkins/workspace/deal.II-CUDA11.0/build/tests/dofs/CMakeFiles/dofs.interpolate_q_system_mask_02.release.dir': No space left on device
mv: cannot create directory '/var/jenkins/workspace/deal.II-CUDA11.0/build/tests/dofs/CMakeFiles/dofs.dof_tools_08.release.dir': No space left on device
mv: cannot create directory '/var/jenkins/workspace/deal.II-CUDA11.0/build/tests/dofs/CMakeFiles/dofs.sparsity_pattern.release.dir': No space left on device
mv: cannot create directory '/var/jenkins/workspace/deal.II-CUDA11.0/build/tests/dofs/CMakeFiles/dofs.range_based_for_tria_face.release.dir': No space left on device
mv: cannot create directory '/var/jenkins/workspace/deal.II-CUDA11.0/build/tests/dofs/CMakeFiles/dofs.extract_dofs_by_component_02.release.diff.dir': No space left on device
mv: cannot create directory '/var/jenkins/workspace/deal.II-CUDA11.0/build/tests/dofs/CMakeFiles/dofs.dof_constraints_05.debug.dir': No space left on device
mv: cannot create directory '/var/jenkins/workspace/deal.II-CUDA11.0/build/tests/dofs/CMakeFiles/dofs.n_boundary_dofs_02.debug.diff.dir': No space left on device
mv: cannot create directory '/var/jenkins/workspace/deal.II-CUDA11.0/build/tests/dofs/CMakeFiles/dofs.dof_tools_01d.release.diff.dir': No space left on device
mv: cannot create directory '/var/jenkins/workspace/deal.II-CUDA11.0/build/tests/dofs/CMakeFiles/dofs.dof_renumbering_06.release.dir': No space left on device
mv: cannot create directory '/var/jenkins/workspace/deal.II-CUDA11.0/build/tests/dofs/CMakeFiles/dofs.map_dofs_to_support_points_01.release.dir': No space left on device
mv: cannot create directory '/var/jenkins/workspace/deal.II-CUDA11.0/build/tests/dofs/CMakeFiles/dofs.dof_tools_02a.release.dir': No space left on device
mv: cannot create directory '/var/jenkins/workspace/deal.II-CUDA11.0/build/tests/dofs/CMakeFiles/dofs.dof_tools_16a.release.dir': No space left on device
mv: cannot create directory '/var/jenkins/workspace/deal.II-CUDA11.0/build/tests/dofs/CMakeFiles/dofs.sparsity_pattern_07.mpirun1.release.diff.dir': No space left on device
mv: cannot create directory '/var/jenkins/workspace/deal.II-CUDA11.0/build/tests/dofs/CMakeFiles/dofs.map_dofs_to_support_points_01.debug.dir': No space left on device
mv: cannot create directory '/var/jenkins/workspace/deal.II-CUDA11.0/build/tests/dofs/CMakeFiles/dofs.dof_tools_24.debug.dir': No space left on device
mv: cannot create directory '/var/jenkins/workspace/deal.II-CUDA11.0/build/tests/dofs/CMakeFiles/dofs.dof_tools_05.debug.dir': No space left on device
mv: cannot create directory '/var/jenkins/workspace/deal.II-CUDA11.0/build/tests/dofs/CMakeFiles/dofs.interpolate_dgq_01.debug.diff.dir': No space left on device
mv: cannot create directory '/var/jenkins/workspace/deal.II-CUDA11.0/build/tests/dofs/CMakeFiles/dofs.interpolate_q_system_mask_02.debug.diff.dir': No space left on device
mv: cannot create directory '/var/jenkins/workspace/deal.II-CUDA11.0/build/tests/dofs/CMakeFiles/dofs.extract_dofs_by_component_02.release.dir': No space left on device
mv: cannot create directory '/var/jenkins/workspace/deal.II-CUDA11.0/build/tests/dofs/CMakeFiles/dofs.dof_tools_16a.release.diff.dir': No space left on device
mv: cannot create directory '/var/jenkins/workspace/deal.II-CUDA11.0/build/tests/dofs/CMakeFiles/dofs.extract_dofs_per_component_02.mpirun3.debug.diff.dir': No space left on device
mv: cannot create directory '/var/jenkins/workspace/deal.II-CUDA11.0/build/tests/dofs/CMakeFiles/dofs.dof_tools_10.release.diff.dir': No space left on device
mv: cannot create directory '/var/jenkins/workspace/deal.II-CUDA11.0/build/tests/dofs/CMakeFiles/dofs.invalid_iterators_01.release.diff.dir': No space left on device
mv: cannot create directory '/var/jenkins/workspace/deal.II-CUDA11.0/build/tests/dofs/CMakeFiles/dofs.dof_tools_15c.release.diff.dir': No space left on device
mv: cannot create directory '/var/jenkins/workspace/deal.II-CUDA11.0/build/tests/dofs/CMakeFiles/dofs.dof_tools_18b.debug.diff.dir': No space left on device
mv: cannot create directory '/var/jenkins/workspace/deal.II-CUDA11.0/build/tests/dofs/CMakeFiles/dofs.interpolate_q_system_02.debug.dir': No space left on device
mv: cannot create directory '/var/jenkins/workspace/deal.II-CUDA11.0/build/tests/dofs/CMakeFiles/dofs.map_dofs_to_support_points_01.mpirun3.release.diff.dir': No space left on device
mv: cannot create directory '/var/jenkins/workspace/deal.II-CUDA11.0/build/tests/dofs/CMakeFiles/dofs.sparsity_pattern_07.release.dir': No space left on device
mv: cannot create directory '/var/jenkins/workspace/deal.II-CUDA11.0/build/tests/dofs/CMakeFiles/dofs.extract_dofs_by_component_06_hp.release.diff.dir': No space left on device
mv: cannot create directory '/var/jenkins/workspace/deal.II-CUDA11.0/build/tests/dofs/CMakeFiles/dofs.extract_dofs_by_component_06.release.diff.dir': No space left on device
mv: cannot create directory '/var/jenkins/workspace/deal.II-CUDA11.0/build/tests/dofs/CMakeFiles/dofs.dof_accessor_01.release.diff.dir': No space left on device
mv: cannot create directory '/var/jenkins/workspace/deal.II-CUDA11.0/build/tests/dofs/CMakeFiles/dofs.interpolate_q_system_02.release.dir': No space left on device
mv: cannot create directory '/var/jenkins/workspace/deal.II-CUDA11.0/build/tests/dofs/CMakeFiles/dofs.get_dofs_on_patch.release.dir': No space left on device
mv: cannot create directory '/var/jenkins/workspace/deal.II-CUDA11.0/build/tests/dofs/CMakeFiles/dofs.dof_tools_01a.debug.diff.dir': No space left on device
mv: cannot create directory '/var/jenkins/workspace/deal.II-CUDA11.0/build/tests/dofs/CMakeFiles/dofs.dof_constraints_09.debug.dir': No space left on device
mv: cannot create directory '/var/jenkins/workspace/deal.II-CUDA11.0/build/tests/dofs/CMakeFiles/dofs.dof_tools_12a.mpirun3.debug.diff.dir': No space left on device
mv: cannot create directory '/var/jenkins/workspace/deal.II-CUDA11.0/build/tests/dofs/CMakeFiles/dofs.dof_tools_21_b_x.debug.dir': No space left on device
mv: cannot create directory '/var/jenkins/workspace/deal.II-CUDA11.0/build/tests/dofs/CMakeFiles/dofs.dof_tools_23.debug.dir': No space left on device
mv: cannot create directory '/var/jenkins/workspace/deal.II-CUDA11.0/build/tests/dofs/CMakeFiles/dofs.extract_dofs_by_component_05_hp.release.diff.dir': No space left on device
mv: cannot create directory '/var/jenkins/workspace/deal.II-CUDA11.0/build/tests/dofs/CMakeFiles/dofs.dof_tools_15c.release.dir': No space left on device
mv: cannot create directory '/var/jenkins/workspace/deal.II-CUDA11.0/build/tests/dofs/CMakeFiles/dofs.dof_tools_03.release.diff.dir': No space left on device
mv: cannot create directory '/var/jenkins/workspace/deal.II-CUDA11.0/build/tests/dofs/CMakeFiles/dofs.dof_tools_write_gnuplot_dof_support_point_info_04.release.dir': No space left on device
mv: cannot create directory '/var/jenkins/workspace/deal.II-CUDA11.0/build/tests/dofs/CMakeFiles/dofs.dof_handler_redistributed_dofs_02.release.dir': No space left on device
mv: cannot create directory '/var/jenkins/workspace/deal.II-CUDA11.0/build/tests/dofs/CMakeFiles/dofs.interpolate_based_on_material_id_01.debug.dir': No space left on device
mv: cannot create directory '/var/jenkins/workspace/deal.II-CUDA11.0/build/tests/dofs/CMakeFiles/dofs.dof_tools_18b.release.dir': No space left on device
mv: cannot create directory '/var/jenkins/workspace/deal.II-CUDA11.0/build/tests/dofs/CMakeFiles/dofs.interpolate_q_02.debug.diff.dir': No space left on device
mv: cannot create directory '/var/jenkins/workspace/deal.II-CUDA11.0/build/tests/dofs/CMakeFiles/dofs.interpolate_boundary_values_01.debug.diff.dir': No space left on device
mv: cannot create directory '/var/jenkins/workspace/deal.II-CUDA11.0/build/tests/dofs/CMakeFiles/dofs.extract_dofs_by_component_06_hp.release.dir': No space left on device
mv: cannot create directory '/var/jenkins/workspace/deal.II-CUDA11.0/build/tests/dofs/CMakeFiles/dofs.interpolate_dgq_01.debug.dir': No space left on device
mv: cannot create directory '/var/jenkins/workspace/deal.II-CUDA11.0/build/tests/dofs/CMakeFiles/dofs.dof_renumbering_zorder_01.release.diff.dir': No space left on device
mv: cannot create directory '/var/jenkins/workspace/deal.II-CUDA11.0/build/tests/dofs/CMakeFiles/dofs.n_boundary_dofs_01.debug.dir': No space left on device
mv: cannot create directory '/var/jenkins/workspace/deal.II-CUDA11.0/build/tests/dofs/CMakeFiles/dofs.dof_tools_18b.debug.dir': No space left on device
mv: cannot create directory '/var/jenkins/workspace/deal.II-CUDA11.0/build/tests/dofs/CMakeFiles/dofs.dof_constraints_08.release.diff.dir': No space left on device
mv: cannot create directory '/var/jenkins/workspace/deal.II-CUDA11.0/build/tests/dofs/CMakeFiles/dofs.extract_dofs_by_component_03.debug.diff.dir': No space left on device
mv: cannot create directory '/var/jenkins/workspace/deal.II-CUDA11.0/build/tests/dofs/CMakeFiles/dofs.n_boundary_dofs_02.release.dir': No space left on device
mv: cannot create directory '/var/jenkins/workspace/deal.II-CUDA11.0/build/tests/dofs/CMakeFiles/dofs.interpolate_q_02.debug.dir': No space left on device
mv: cannot create directory '/var/jenkins/workspace/deal.II-CUDA11.0/build/tests/dofs/CMakeFiles/dofs.dof_tools_01a_constraints_true.release.dir': No space left on device
mv: cannot create directory '/var/jenkins/workspace/deal.II-CUDA11.0/build/tests/dofs/CMakeFiles/dofs.block_relaxation_01.debug.diff.dir': No space left on device
mv: cannot create directory '/var/jenkins/workspace/deal.II-CUDA11.0/build/tests/dofs/CMakeFiles/dofs.dof_constraints_11.debug.diff.dir': No space left on device
mv: cannot create directory '/var/jenkins/workspace/deal.II-CUDA11.0/build/tests/dofs/CMakeFiles/dofs.dof_tools_02d.release.dir': No space left on device
mv: cannot create directory '/var/jenkins/workspace/deal.II-CUDA11.0/build/tests/dofs/CMakeFiles/dofs.dof_tools_12.release.dir': No space left on device
mv: cannot create directory '/var/jenkins/workspace/deal.II-CUDA11.0/build/tests/dofs/CMakeFiles/dofs.n_boundary_dofs_03.release.diff.dir': No space left on device
mv: cannot create directory '/var/jenkins/workspace/deal.II-CUDA11.0/build/tests/dofs/CMakeFiles/dofs.range_based_for_tria_face.debug.dir': No space left on device
mv: cannot create directory '/var/jenkins/workspace/deal.II-CUDA11.0/build/tests/dofs/CMakeFiles/dofs.dof_renumbering_07.debug.diff.dir': No space left on device
mv: cannot create directory '/var/jenkins/workspace/deal.II-CUDA11.0/build/tests/dofs/CMakeFiles/dofs.dof_handler_number_cache_02.debug.dir': No space left on device
mv: cannot create directory '/var/jenkins/workspace/deal.II-CUDA11.0/build/tests/dofs/CMakeFiles/dofs.dof_tools_00a.release.diff.dir': No space left on device
mv: cannot create directory '/var/jenkins/workspace/deal.II-CUDA11.0/build/tests/dofs/CMakeFiles/regenerate.dir': No space left on device
mv: cannot create directory '/var/jenkins/workspace/deal.II-CUDA11.0/build/tests/dofs/CMakeFiles/dofs.dof_tools_04.debug.dir': No space left on device
mv: cannot create directory '/var/jenkins/workspace/deal.II-CUDA11.0/build/tests/dofs/CMakeFiles/dofs.dof_tools_14.release.dir': No space left on device
mv: cannot create directory '/var/jenkins/workspace/deal.II-CUDA11.0/build/tests/dofs/CMakeFiles/dofs.dof_tools_17a.debug.dir': No space left on device
mv: cannot create directory '/var/jenkins/workspace/deal.II-CUDA11.0/build/tests/dofs/CMakeFiles/dofs.sparsity_pattern_03.release.dir': No space left on device
mv: cannot create directory '/var/jenkins/workspace/deal.II-CUDA11.0/build/tests/dofs/CMakeFiles/dofs.range_based_for_step-6.debug.dir': No space left on device
mv: cannot create directory '/var/jenkins/workspace/deal.II-CUDA11.0/build/tests/dofs/CMakeFiles/dofs.interpolate_based_on_material_id_01.release.diff.dir': No space left on device
mv: cannot create directory '/var/jenkins/workspace/deal.II-CUDA11.0/build/tests/dofs/CMakeFiles/dofs.dof_tools_extract_dofs_with_support_contained_within_04.mpirun1.debug.diff.dir': No space left on device
mv: cannot create directory '/var/jenkins/workspace/deal.II-CUDA11.0/build/tests/dofs/CMakeFiles/dofs.accessor_01.debug.dir': No space left on device
mv: cannot create directory '/var/jenkins/workspace/deal.II-CUDA11.0/build/tests/dofs/CMakeFiles/dofs.dof_constraints_11_x.debug.diff.dir': No space left on device
mv: cannot create directory '/var/jenkins/workspace/deal.II-CUDA11.0/build/tests/dofs/CMakeFiles/dofs.dof_constraints_01.release.dir': No space left on device
mv: cannot create directory '/var/jenkins/workspace/deal.II-CUDA11.0/build/tests/dofs/CMakeFiles/dofs.dof_tools_extract_dofs_with_support_contained_within_04.debug.dir': No space left on device
mv: cannot create directory '/var/jenkins/workspace/deal.II-CUDA11.0/build/tests/dofs/CMakeFiles/dofs.dof_renumbering_05.debug.dir': No space left on device
mv: cannot create directory '/var/jenkins/workspace/deal.II-CUDA11.0/build/tests/dofs/CMakeFiles/dofs.dof_tools_21_b.debug.diff.dir': No space left on device
mv: cannot create directory '/var/jenkins/workspace/deal.II-CUDA11.0/build/tests/dofs/CMakeFiles/dofs.dof_tools_18a_1d.release.diff.dir': No space left on device
mv: cannot create directory '/var/jenkins/workspace/deal.II-CUDA11.0/build/tests/dofs/CMakeFiles/dofs.dof_constraints_09.debug.diff.dir': No space left on device
mv: cannot create directory '/var/jenkins/workspace/deal.II-CUDA11.0/build/tests/dofs/CMakeFiles/dofs.n_boundary_dofs_03.debug.dir': No space left on device
mv: cannot create directory '/var/jenkins/workspace/deal.II-CUDA11.0/build/tests/dofs/CMakeFiles/dofs.interpolate_based_on_material_id_01.debug.diff.dir': No space left on device
mv: cannot create directory '/var/jenkins/workspace/deal.II-CUDA11.0/build/tests/dofs/CMakeFiles/dofs.dof_accessor_01.debug.dir': No space left on device
mv: cannot create directory '/var/jenkins/workspace/deal.II-CUDA11.0/build/tests/dofs/CMakeFiles/dofs.block_list_04.debug.diff.dir': No space left on device
mv: cannot create directory '/var/jenkins/workspace/deal.II-CUDA11.0/build/tests/dofs/CMakeFiles/dofs.block_list_05.release.dir': No space left on device
mv: cannot create directory '/var/jenkins/workspace/deal.II-CUDA11.0/build/tests/dofs/CMakeFiles/dofs.dof_constraints_02.debug.dir': No space left on device
mv: cannot create directory '/var/jenkins/workspace/deal.II-CUDA11.0/build/tests/dofs/CMakeFiles/dofs.dof_constraints_10.release.diff.dir': No space left on device
mv: cannot create directory '/var/jenkins/workspace/deal.II-CUDA11.0/build/tests/dofs/CMakeFiles/dofs.dof_tools_15a.release.dir': No space left on device
mv: cannot create directory '/var/jenkins/workspace/deal.II-CUDA11.0/build/tests/dofs/CMakeFiles/dofs.dof_renumbering_03.release.diff.dir': No space left on device
mv: cannot create directory '/var/jenkins/workspace/deal.II-CUDA11.0/build/tests/dofs/CMakeFiles/dofs.dof_tools_17a.release.diff.dir': No space left on device
mv: cannot create directory '/var/jenkins/workspace/deal.II-CUDA11.0/build/tests/dofs/CMakeFiles/dofs.dof_constraints_01.release.diff.dir': No space left on device
mv: cannot create directory '/var/jenkins/workspace/deal.II-CUDA11.0/build/tests/dofs/CMakeFiles/dofs.dof_constraints_05.release.dir': No space left on device
mv: cannot create directory '/var/jenkins/workspace/deal.II-CUDA11.0/build/tests/dofs/CMakeFiles/dofs.dof_tools_01b.debug.diff.dir': No space left on device
mv: cannot create directory '/var/jenkins/workspace/deal.II-CUDA11.0/build/tests/dofs/CMakeFiles/dofs.mg_dof_handler.debug.diff.dir': No space left on device
mv: cannot create directory '/var/jenkins/workspace/deal.II-CUDA11.0/build/tests/dofs/CMakeFiles/dofs.n_boundary_dofs_02.debug.dir': No space left on device
mv: cannot create directory '/var/jenkins/workspace/deal.II-CUDA11.0/build/tests/dofs/CMakeFiles/dofs.extract_dofs_by_component_01_mg.release.diff.dir': No space left on device
mv: cannot create directory '/var/jenkins/workspace/deal.II-CUDA11.0/build/tests/dofs/CMakeFiles/dofs.extract_dofs_per_component_02.debug.dir': No space left on device
mv: cannot create directory '/var/jenkins/workspace/deal.II-CUDA11.0/build/tests/dofs/CMakeFiles/dofs.dof_renumbering_08.release.diff.dir': No space left on device
mv: cannot create directory '/var/jenkins/workspace/deal.II-CUDA11.0/build/tests/dofs/CMakeFiles/dofs.dof_tools_18a.debug.diff.dir': No space left on device
mv: cannot create directory '/var/jenkins/workspace/deal.II-CUDA11.0/build/tests/dofs/CMakeFiles/dofs.dof_tools_07.debug.dir': No space left on device
mv: cannot create directory '/var/jenkins/workspace/deal.II-CUDA11.0/build/tests/dofs/CMakeFiles/dofs.interpolate_q_02.release.dir': No space left on device
mv: cannot create directory '/var/jenkins/workspace/deal.II-CUDA11.0/build/tests/dofs/CMakeFiles/dofs.dof_tools_write_gnuplot_dof_support_point_info_02.debug.diff.dir': No space left on device
mv: cannot create directory '/var/jenkins/workspace/deal.II-CUDA11.0/build/tests/dofs/CMakeFiles/dofs.dof_constraints_01.debug.diff.dir': No space left on device
mv: cannot create directory '/var/jenkins/workspace/deal.II-CUDA11.0/build/tests/dofs/CMakeFiles/dofs.dof_tools_02a_subdomain.release.diff.dir': No space left on device
mv: cannot create directory '/var/jenkins/workspace/deal.II-CUDA11.0/build/tests/dofs/CMakeFiles/dofs.dof_tools_01c.debug.dir': No space left on device
mv: cannot create directory '/var/jenkins/workspace/deal.II-CUDA11.0/build/tests/dofs/CMakeFiles/dofs.mg_dof_handler.debug.dir': No space left on device
mv: cannot create directory '/var/jenkins/workspace/deal.II-CUDA11.0/build/tests/dofs/CMakeFiles/dofs.extract_dofs_by_component_01_mg.release.dir': No space left on device
mv: cannot create directory '/var/jenkins/workspace/deal.II-CUDA11.0/build/tests/dofs/CMakeFiles/dofs.dof_tools_write_gnuplot_dof_support_point_info_02.debug.dir': No space left on device
mv: cannot create directory '/var/jenkins/workspace/deal.II-CUDA11.0/build/tests/dofs/CMakeFiles/dofs.invalid_iterators_01.debug.dir': No space left on device
mv: cannot create directory '/var/jenkins/workspace/deal.II-CUDA11.0/build/tests/dofs/CMakeFiles/dofs.dof_constraints_01.debug.dir': No space left on device
mv: cannot create directory '/var/jenkins/workspace/deal.II-CUDA11.0/build/tests/dofs/CMakeFiles/dofs.dof_tools_01a_constraints_true.release.diff.dir': No space left on device
mv: cannot create directory '/var/jenkins/workspace/deal.II-CUDA11.0/build/tests/dofs/CMakeFiles/dofs.dof_tools_08.release.diff.dir': No space left on device
mv: cannot create directory '/var/jenkins/workspace/deal.II-CUDA11.0/build/tests/dofs/CMakeFiles/dofs.sparsity_pattern_06.mpirun1.debug.diff.dir': No space left on device
mv: cannot create directory '/var/jenkins/workspace/deal.II-CUDA11.0/build/tests/dofs/CMakeFiles/dofs.dof_tools_18c.debug.dir': No space left on device
mv: cannot create directory '/var/jenkins/workspace/deal.II-CUDA11.0/build/tests/dofs/CMakeFiles/dofs.block_info.release.diff.dir': No space left on device
mv: cannot create directory '/var/jenkins/workspace/deal.II-CUDA11.0/build/tests/dofs/CMakeFiles/dofs.dof_tools_12a.mpirun3.release.diff.dir': No space left on device
mv: cannot create directory '/var/jenkins/workspace/deal.II-CUDA11.0/build/tests/dofs/CMakeFiles/dofs.extract_dofs_by_component_03.release.diff.dir': No space left on device
mv: cannot create directory '/var/jenkins/workspace/deal.II-CUDA11.0/build/tests/dofs/CMakeFiles/dofs.dof_renumbering_09.debug.diff.dir': No space left on device
mv: cannot create directory '/var/jenkins/workspace/deal.II-CUDA11.0/build/tests/dofs/CMakeFiles/dofs.dof_tools_22a.mpirun1.release.diff.dir': No space left on device
mv: cannot create directory '/var/jenkins/workspace/deal.II-CUDA11.0/build/tests/dofs/CMakeFiles/dofs.locally_relevant_dofs_per_subdomain_01_hp.debug.dir': No space left on device
mv: cannot create directory '/var/jenkins/workspace/deal.II-CUDA11.0/build/tests/dofs/CMakeFiles/dofs.dof_constraints_06.debug.diff.dir': No space left on device
mv: cannot create directory '/var/jenkins/workspace/deal.II-CUDA11.0/build/tests/dofs/CMakeFiles/dofs.dof_handler_number_cache.release.diff.dir': No space left on device
mv: cannot create directory '/var/jenkins/workspace/deal.II-CUDA11.0/build/tests/dofs/CMakeFiles/dofs.dof_constraints_02.debug.diff.dir': No space left on device
mv: cannot create directory '/var/jenkins/workspace/deal.II-CUDA11.0/build/tests/dofs/CMakeFiles/dofs.dof_tools_extract_dofs_with_support_contained_within_01.release.dir': No space left on device
mv: cannot create directory '/var/jenkins/workspace/deal.II-CUDA11.0/build/tests/dofs/CMakeFiles/dofs.n_dofs_per_object.release.dir': No space left on device
mv: cannot create directory '/var/jenkins/workspace/deal.II-CUDA11.0/build/tests/dofs/CMakeFiles/dofs.dof_handler_redistributed_dofs_01.release.diff.dir': No space left on device
mv: cannot create directory '/var/jenkins/workspace/deal.II-CUDA11.0/build/tests/dofs/CMakeFiles/dofs.extract_dofs_by_component_01x.release.diff.dir': No space left on device
mv: cannot create directory '/var/jenkins/workspace/deal.II-CUDA11.0/build/tests/dofs/CMakeFiles/dofs.sparsity_pattern_05.release.diff.dir': No space left on device
mv: cannot create directory '/var/jenkins/workspace/deal.II-CUDA11.0/build/tests/dofs/CMakeFiles/dofs.sparsity_pattern_02.debug.dir': No space left on device
mv: cannot create directory '/var/jenkins/workspace/deal.II-CUDA11.0/build/tests/dofs/CMakeFiles/dofs.dof_tools_01a_subdomain.debug.dir': No space left on device
mv: cannot create directory '/var/jenkins/workspace/deal.II-CUDA11.0/build/tests/dofs/CMakeFiles/dofs.dof_renumbering_04a.debug.dir': No space left on device
mv: cannot create directory '/var/jenkins/workspace/deal.II-CUDA11.0/build/tests/dofs/CMakeFiles/dofs.dof_tools_18d.release.dir': No space left on device
mv: cannot create directory '/var/jenkins/workspace/deal.II-CUDA11.0/build/tests/dofs/CMakeFiles/dofs.range_based_for_tria_face.debug.diff.dir': No space left on device
mv: cannot create directory '/var/jenkins/workspace/deal.II-CUDA11.0/build/tests/dofs/CMakeFiles/dofs.dof_tools_01a_constraints_false.release.dir': No space left on device
mv: cannot create directory '/var/jenkins/workspace/deal.II-CUDA11.0/build/tests/dofs/CMakeFiles/dofs.dof_tools_18c.release.dir': No space left on device
mv: cannot create directory '/var/jenkins/workspace/deal.II-CUDA11.0/build/tests/dofs/CMakeFiles/dofs.block_list_parallel_01.debug.dir': No space left on device
mv: cannot create directory '/var/jenkins/workspace/deal.II-CUDA11.0/build/tests/dofs/CMakeFiles/dofs.block_list_04.release.dir': No space left on device
mv: cannot create directory '/var/jenkins/workspace/deal.II-CUDA11.0/build/tests/dofs/CMakeFiles/dofs.sparsity_pattern.debug.diff.dir': No space left on device
mv: cannot create directory '/var/jenkins/workspace/deal.II-CUDA11.0/build/tests/dofs/CMakeFiles/dofs.dof_tools_17c.debug.diff.dir': No space left on device
mv: cannot create directory '/var/jenkins/workspace/deal.II-CUDA11.0/build/tests/dofs/CMakeFiles/dofs.interpolate_boundary_values_01.release.diff.dir': No space left on device
mv: cannot create directory '/var/jenkins/workspace/deal.II-CUDA11.0/build/tests/dofs/CMakeFiles/dofs.dof_tools_06.release.diff.dir': No space left on device
mv: cannot create directory '/var/jenkins/workspace/deal.II-CUDA11.0/build/tests/dofs/CMakeFiles/dofs.dof_tools_05.debug.diff.dir': No space left on device
mv: cannot create directory '/var/jenkins/workspace/deal.II-CUDA11.0/build/tests/dofs/CMakeFiles/dofs.get_dofs_on_patch.debug.diff.dir': No space left on device
mv: cannot create directory '/var/jenkins/workspace/deal.II-CUDA11.0/build/tests/dofs/CMakeFiles/dofs.extract_dofs_by_component_02_mg.debug.dir': No space left on device
mv: cannot create directory '/var/jenkins/workspace/deal.II-CUDA11.0/build/tests/dofs/CMakeFiles/dofs.extract_dofs_by_component_01_hp.debug.diff.dir': No space left on device
mv: cannot create directory '/var/jenkins/workspace/deal.II-CUDA11.0/build/tests/dofs/CMakeFiles/dofs.dof_tools_17a.release.dir': No space left on device
mv: cannot create directory '/var/jenkins/workspace/deal.II-CUDA11.0/build/tests/dofs/CMakeFiles/dofs.dof_handler_redistributed_dofs_02.debug.diff.dir': No space left on device
mv: cannot create directory '/var/jenkins/workspace/deal.II-CUDA11.0/build/tests/dofs/CMakeFiles/dofs.range_based_for_dof_face.debug.diff.dir': No space left on device
mv: cannot create directory '/var/jenkins/workspace/deal.II-CUDA11.0/build/tests/dofs/CMakeFiles/dofs.dof_tools_09.debug.diff.dir': No space left on device
mv: cannot create directory '/var/jenkins/workspace/deal.II-CUDA11.0/build/tests/dofs/CMakeFiles/dofs.dof_tools_16d.debug.dir': No space left on device
mv: cannot create directory '/var/jenkins/workspace/deal.II-CUDA11.0/build/tests/dofs/CMakeFiles/dofs.dof_tools_25.release.diff.dir': No space left on device
mv: cannot create directory '/var/jenkins/workspace/deal.II-CUDA11.0/build/tests/dofs/CMakeFiles/dofs.dof_tools_18a.release.dir': No space left on device
mv: cannot create directory '/var/jenkins/workspace/deal.II-CUDA11.0/build/tests/dofs/CMakeFiles/dofs.block_list_01.release.dir': No space left on device
mv: cannot create directory '/var/jenkins/workspace/deal.II-CUDA11.0/build/tests/dofs/CMakeFiles/dofs.sparsity_pattern_05.debug.diff.dir': No space left on device
mv: cannot create directory '/var/jenkins/workspace/deal.II-CUDA11.0/build/tests/dofs/CMakeFiles/dofs.invalid_iterators_02.release.dir': No space left on device
mv: cannot create directory '/var/jenkins/workspace/deal.II-CUDA11.0/build/tests/dofs/CMakeFiles/dofs.dof_tools_00a.release.dir': No space left on device
mv: cannot create directory '/var/jenkins/workspace/deal.II-CUDA11.0/build/tests/dofs/CMakeFiles/dofs.block_info.release.dir': No space left on device
mv: cannot create directory '/var/jenkins/workspace/deal.II-CUDA11.0/build/tests/dofs/CMakeFiles/dofs.dof_tools_06.release.dir': No space left on device
mv: cannot create directory '/var/jenkins/workspace/deal.II-CUDA11.0/build/tests/dofs/CMakeFiles/dofs.dof_renumbering_02.debug.diff.dir': No space left on device
mv: cannot create directory '/var/jenkins/workspace/deal.II-CUDA11.0/build/tests/dofs/CMakeFiles/dofs.interpolate_q_01.debug.diff.dir': No space left on device
mv: cannot create directory '/var/jenkins/workspace/deal.II-CUDA11.0/build/tests/dofs/CMakeFiles/dofs.extract_dofs_by_component_01_hp.debug.dir': No space left on device
mv: cannot create directory '/var/jenkins/workspace/deal.II-CUDA11.0/build/tests/dofs/CMakeFiles/dofs.dof_renumbering_09.debug.dir': No space left on device
mv: cannot create directory '/var/jenkins/workspace/deal.II-CUDA11.0/build/tests/dofs/CMakeFiles/dofs.dof_constraints_07.debug.diff.dir': No space left on device
mv: cannot create directory '/var/jenkins/workspace/deal.II-CUDA11.0/build/tests/dofs/CMakeFiles/dofs.dof_tools_15b.debug.diff.dir': No space left on device
mv: cannot create directory '/var/jenkins/workspace/deal.II-CUDA11.0/build/tests/dofs/CMakeFiles/dofs.dof_tools_02b.release.diff.dir': No space left on device
mv: cannot create directory '/var/jenkins/workspace/deal.II-CUDA11.0/build/tests/dofs/CMakeFiles/dofs.dof_constraints_06.release.diff.dir': No space left on device
mv: cannot create directory '/var/jenkins/workspace/deal.II-CUDA11.0/build/tests/dofs/CMakeFiles/dofs.dof_tools_10.debug.dir': No space left on device
mv: cannot create directory '/var/jenkins/workspace/deal.II-CUDA11.0/build/tests/dofs/CMakeFiles/dofs.dof_tools_21_b.release.diff.dir': No space left on device
mv: cannot create directory '/var/jenkins/workspace/deal.II-CUDA11.0/build/tests/dofs/CMakeFiles/dofs.sparsity_pattern_04.release.diff.dir': No space left on device
mv: cannot create directory '/var/jenkins/workspace/deal.II-CUDA11.0/build/tests/dofs/CMakeFiles/dofs.block_list_05.debug.diff.dir': No space left on device
mv: cannot create directory '/var/jenkins/workspace/deal.II-CUDA11.0/build/tests/dofs/CMakeFiles/dofs.count_dofs_on_patch.release.diff.dir': No space left on device
mv: cannot create directory '/var/jenkins/workspace/deal.II-CUDA11.0/build/tests/dofs/CMakeFiles/dofs.dof_tools_extract_dofs_with_support_contained_within_04.mpirun2.debug.diff.dir': No space left on device
mv: cannot create directory '/var/jenkins/workspace/deal.II-CUDA11.0/build/tests/dofs/CMakeFiles/dofs.dof_tools_12.debug.diff.dir': No space left on device
mv: cannot create directory '/var/jenkins/workspace/deal.II-CUDA11.0/build/tests/dofs/CMakeFiles/dofs.dof_renumbering_10.mpirun1.release.diff.dir': No space left on device
mv: cannot create directory '/var/jenkins/workspace/deal.II-CUDA11.0/build/tests/dofs/CMakeFiles/dofs.dof_tools_25.debug.dir': No space left on device
mv: cannot create directory '/var/jenkins/workspace/deal.II-CUDA11.0/build/tests/dofs/CMakeFiles/dofs.dof_tools_17c.release.diff.dir': No space left on device
mv: cannot create directory '/var/jenkins/workspace/deal.II-CUDA11.0/build/tests/dofs/CMakeFiles/dofs.extract_dofs_per_component_02.mpirun3.release.diff.dir': No space left on device
mv: cannot create directory '/var/jenkins/workspace/deal.II-CUDA11.0/build/tests/dofs/CMakeFiles/dofs.extract_dofs_by_component_02.debug.diff.dir': No space left on device
mv: cannot create directory '/var/jenkins/workspace/deal.II-CUDA11.0/build/tests/dofs/CMakeFiles/dofs.dof_tools_25.debug.diff.dir': No space left on device
mv: cannot create directory '/var/jenkins/workspace/deal.II-CUDA11.0/build/tests/dofs/CMakeFiles/dofs.sparsity_pattern_04.release.dir': No space left on device
mv: cannot create directory '/var/jenkins/workspace/deal.II-CUDA11.0/build/tests/dofs/CMakeFiles/dofs.interpolate_q_02.release.diff.dir': No space left on device
mv: cannot create directory '/var/jenkins/workspace/deal.II-CUDA11.0/build/tests/dofs/CMakeFiles/dofs.extract_dofs_by_component_02.debug.dir': No space left on device
mv: cannot create directory '/var/jenkins/workspace/deal.II-CUDA11.0/build/tests/dofs/CMakeFiles/dofs.distribute_dofs_01.debug.diff.dir': No space left on device
mv: cannot create directory '/var/jenkins/workspace/deal.II-CUDA11.0/build/tests/dofs/CMakeFiles/dofs.block_relaxation_01.release.dir': No space left on device
mv: cannot create directory '/var/jenkins/workspace/deal.II-CUDA11.0/build/tests/dofs/CMakeFiles/dofs.block_list_parallel_01.mpirun2.release.diff.dir': No space left on device
mv: cannot create directory '/var/jenkins/workspace/deal.II-CUDA11.0/build/tests/dofs/CMakeFiles/dofs.dof_tools_01a_subdomain.debug.diff.dir': No space left on device
mv: cannot create directory '/var/jenkins/workspace/deal.II-CUDA11.0/build/tests/dofs/CMakeFiles/dofs.dof_tools_02a_constraints_false.debug.dir': No space left on device
mv: cannot create directory '/var/jenkins/workspace/deal.II-CUDA11.0/build/tests/dofs/CMakeFiles/dofs.dof_tools_14.debug.diff.dir': No space left on device
mv: cannot create directory '/var/jenkins/workspace/deal.II-CUDA11.0/build/tests/dofs/CMakeFiles/dofs.dof_tools_18a.release.diff.dir': No space left on device
mv: cannot create directory '/var/jenkins/workspace/deal.II-CUDA11.0/build/tests/dofs/CMakeFiles/dofs.interpolate_q_system_mask_01.release.dir': No space left on device
mv: cannot create directory '/var/jenkins/workspace/deal.II-CUDA11.0/build/tests/dofs/CMakeFiles/dofs.dof_constraints_09.release.dir': No space left on device
mv: cannot create directory '/var/jenkins/workspace/deal.II-CUDA11.0/build/tests/dofs/CMakeFiles/dofs.dof_tools_17b.release.dir': No space left on device
mv: cannot create directory '/var/jenkins/workspace/deal.II-CUDA11.0/build/tests/dofs/CMakeFiles/dofs.extract_dofs_per_component_02.mpirun1.release.diff.dir': No space left on device
mv: cannot create directory '/var/jenkins/workspace/deal.II-CUDA11.0/build/tests/dofs/CMakeFiles/dofs.dof_tools_extract_dofs_with_support_contained_within_02.mpirun3.debug.diff.dir': No space left on device
mv: cannot create directory '/var/jenkins/workspace/deal.II-CUDA11.0/build/tests/dofs/CMakeFiles/dofs.block_info_02.release.dir': No space left on device
mv: cannot create directory '/var/jenkins/workspace/deal.II-CUDA11.0/build/tests/dofs/CMakeFiles/dofs.dof_constraints_10.debug.dir': No space left on device
mv: cannot create directory '/var/jenkins/workspace/deal.II-CUDA11.0/build/tests/dofs/CMakeFiles/dofs.sparsity_pattern_01.release.diff.dir': No space left on device
mv: cannot create directory '/var/jenkins/workspace/deal.II-CUDA11.0/build/tests/dofs/CMakeFiles/dofs.dof_tools_17d.release.dir': No space left on device
mv: cannot create directory '/var/jenkins/workspace/deal.II-CUDA11.0/build/tests/dofs/CMakeFiles/dofs.block_list_03.release.diff.dir': No space left on device
mv: cannot create directory '/var/jenkins/workspace/deal.II-CUDA11.0/build/tests/dofs/CMakeFiles/dofs.dof_tools_18a_1d.debug.dir': No space left on device
mv: cannot create directory '/var/jenkins/workspace/deal.II-CUDA11.0/build/tests/dofs/CMakeFiles/dofs.dof_renumbering_05.debug.diff.dir': No space left on device
mv: cannot create directory '/var/jenkins/workspace/deal.II-CUDA11.0/build/tests/dofs/CMakeFiles/dofs.block_list_03.release.dir': No space left on device
mv: cannot create directory '/var/jenkins/workspace/deal.II-CUDA11.0/build/tests/dofs/CMakeFiles/dofs.distribute_dofs_01.debug.dir': No space left on device
mv: cannot create directory '/var/jenkins/workspace/deal.II-CUDA11.0/build/tests/dofs/CMakeFiles/dofs.dof_tools_07.release.dir': No space left on device
mv: cannot create directory '/var/jenkins/workspace/deal.II-CUDA11.0/build/tests/dofs/CMakeFiles/dofs.dof_tools_13a.debug.diff.dir': No space left on device
mv: cannot create directory '/var/jenkins/workspace/deal.II-CUDA11.0/build/tests/dofs/CMakeFiles/dofs.dof_renumbering_10.release.dir': No space left on device
mv: cannot create directory '/var/jenkins/workspace/deal.II-CUDA11.0/build/tests/dofs/CMakeFiles/dofs.interpolate_q_system_mask_02.debug.dir': No space left on device
mv: cannot create directory '/var/jenkins/workspace/deal.II-CUDA11.0/build/tests/dofs/CMakeFiles/dofs.sparsity_pattern_03.release.diff.dir': No space left on device
mv: cannot create directory '/var/jenkins/workspace/deal.II-CUDA11.0/build/tests/dofs/CMakeFiles/dofs.dof_tools_12a.mpirun1.release.diff.dir': No space left on device
mv: cannot create directory '/var/jenkins/workspace/deal.II-CUDA11.0/build/tests/dofs/CMakeFiles/dofs.dof_tools_23.release.dir': No space left on device
mv: cannot create directory '/var/jenkins/workspace/deal.II-CUDA11.0/build/tests/dofs/CMakeFiles/dofs.extract_dofs_per_component_01.mpirun3.release.diff.dir': No space left on device
mv: cannot create directory '/var/jenkins/workspace/deal.II-CUDA11.0/build/tests/dofs/CMakeFiles/dofs.interpolate_dgq_01.release.diff.dir': No space left on device
mv: cannot create directory '/var/jenkins/workspace/deal.II-CUDA11.0/build/tests/dofs/CMakeFiles/dofs.dof_constraints_11.release.dir': No space left on device
mv: cannot create directory '/var/jenkins/workspace/deal.II-CUDA11.0/build/tests/dofs/CMakeFiles/dofs.block_list_03.debug.dir': No space left on device
mv: cannot create directory '/var/jenkins/workspace/deal.II-CUDA11.0/build/tests/dofs/CMakeFiles/dofs.block_list_03.debug.diff.dir': No space left on device
mv: cannot create directory '/var/jenkins/workspace/deal.II-CUDA11.0/build/tests/dofs/CMakeFiles/dofs.dof_tools_16b.release.diff.dir': No space left on device
mv: cannot create directory '/var/jenkins/workspace/deal.II-CUDA11.0/build/tests/dofs/CMakeFiles/dofs.dof_tools_22a.release.dir': No space left on device
mv: cannot create directory '/var/jenkins/workspace/deal.II-CUDA11.0/build/tests/dofs/CMakeFiles/dofs.extract_dofs_per_component_01.mpirun1.release.diff.dir': No space left on device
mv: cannot create directory '/var/jenkins/workspace/deal.II-CUDA11.0/build/tests/dofs/CMakeFiles/dofs.dof_tools_16d.debug.diff.dir': No space left on device
mv: cannot create directory '/var/jenkins/workspace/deal.II-CUDA11.0/build/tests/dofs/CMakeFiles/dofs.dof_test.release.diff.dir': No space left on device
mv: cannot create directory '/var/jenkins/workspace/deal.II-CUDA11.0/build/tests/dofs/CMakeFiles/dofs.sparsity_pattern.release.diff.dir': No space left on device
mv: cannot create directory '/var/jenkins/workspace/deal.II-CUDA11.0/build/tests/dofs/CMakeFiles/dofs.extract_dofs_per_component_02.release.dir': No space left on device
mv: cannot create directory '/var/jenkins/workspace/deal.II-CUDA11.0/build/tests/dofs/count_dofs_on_patch.release': No space left on device
mv: cannot create directory '/var/jenkins/workspace/deal.II-CUDA11.0/build/tests/dofs/dof_handler_redistributed_dofs_02.debug': No space left on device
mv: cannot create directory '/var/jenkins/workspace/deal.II-CUDA11.0/build/tests/dofs/dof_tools_02a_subdomain.debug': No space left on device
mv: cannot create directory '/var/jenkins/workspace/deal.II-CUDA11.0/build/tests/dofs/sparsity_pattern_04.release': No space left on device
mv: cannot create directory '/var/jenkins/workspace/deal.II-CUDA11.0/build/tests/dofs/dof_renumbering_zorder_02.debug': No space left on device
mv: cannot create directory '/var/jenkins/workspace/deal.II-CUDA11.0/build/tests/dofs/interpolate_boundary_values_02.debug': No space left on device
mv: cannot create directory '/var/jenkins/workspace/deal.II-CUDA11.0/build/tests/dofs/mg_dof_handler.debug': No space left on device
mv: cannot create directory '/var/jenkins/workspace/deal.II-CUDA11.0/build/tests/dofs/dof_handler_redistributed_dofs_02.release': No space left on device
mv: cannot create directory '/var/jenkins/workspace/deal.II-CUDA11.0/build/tests/dofs/dof_tools_02a_subdomain.release': No space left on device
mv: cannot create directory '/var/jenkins/workspace/deal.II-CUDA11.0/build/tests/dofs/dof_tools_21_b_x_q3.release': No space left on device
mv: cannot create directory '/var/jenkins/workspace/deal.II-CUDA11.0/build/tests/dofs/sparsity_pattern_05.debug': No space left on device
mv: cannot create directory '/var/jenkins/workspace/deal.II-CUDA11.0/build/tests/dofs/distribute_dofs_01.debug': No space left on device
mv: cannot create directory '/var/jenkins/workspace/deal.II-CUDA11.0/build/tests/dofs/dof_tools_17d.debug': No space left on device
mv: cannot create directory '/var/jenkins/workspace/deal.II-CUDA11.0/build/tests/dofs/interpolate_boundary_values_02.release': No space left on device
mv: cannot create directory '/var/jenkins/workspace/deal.II-CUDA11.0/build/tests/dofs/mg_dof_handler.release': No space left on device
mv: cannot create directory '/var/jenkins/workspace/deal.II-CUDA11.0/build/tests/dofs/extract_dofs_by_component_02_mg.release': No space left on device
mv: cannot create directory '/var/jenkins/workspace/deal.II-CUDA11.0/build/tests/dofs/sparsity_pattern_05.release': No space left on device
mv: cannot create directory '/var/jenkins/workspace/deal.II-CUDA11.0/build/tests/dofs/dof_renumbering_zorder_02.release': No space left on device
mv: cannot create directory '/var/jenkins/workspace/deal.II-CUDA11.0/build/tests/dofs/dof_tools_21_b_y.debug': No space left on device
mv: cannot create directory '/var/jenkins/workspace/deal.II-CUDA11.0/build/tests/dofs/extract_dofs_by_component_03.debug': No space left on device
mv: cannot create directory '/var/jenkins/workspace/deal.II-CUDA11.0/build/tests/dofs/interpolate_dgq_01.debug': No space left on device
mv: cannot create directory '/var/jenkins/workspace/deal.II-CUDA11.0/build/tests/dofs/dof_tools_21_b_y.release': No space left on device
mv: cannot create directory '/var/jenkins/workspace/deal.II-CUDA11.0/build/tests/dofs/dof_renumbering.debug': No space left on device
mv: cannot create directory '/var/jenkins/workspace/deal.II-CUDA11.0/build/tests/dofs/dof_tools_02b.debug': No space left on device
mv: cannot create directory '/var/jenkins/workspace/deal.II-CUDA11.0/build/tests/dofs/dof_tools_17d.release': No space left on device
mv: cannot create directory '/var/jenkins/workspace/deal.II-CUDA11.0/build/tests/dofs/dof_accessor_01.debug': No space left on device
mv: cannot create directory '/var/jenkins/workspace/deal.II-CUDA11.0/build/tests/dofs/dof_renumbering.release': No space left on device
mv: cannot create directory '/var/jenkins/workspace/deal.II-CUDA11.0/build/tests/dofs/extract_dofs_by_component_03.release': No space left on device
mv: cannot create directory '/var/jenkins/workspace/deal.II-CUDA11.0/build/tests/dofs/interpolate_dgq_01.release': No space left on device
mv: cannot create directory '/var/jenkins/workspace/deal.II-CUDA11.0/build/tests/dofs/n_boundary_dofs_01.debug': No space left on device
mv: cannot create directory '/var/jenkins/workspace/deal.II-CUDA11.0/build/tests/dofs/dof_tools_02b.release': No space left on device
mv: cannot create directory '/var/jenkins/workspace/deal.II-CUDA11.0/build/tests/dofs/dof_tools_13.debug': No space left on device
mv: cannot create directory '/var/jenkins/workspace/deal.II-CUDA11.0/build/tests/dofs/dof_renumbering_02.debug': No space left on device
mv: cannot create directory '/var/jenkins/workspace/deal.II-CUDA11.0/build/tests/dofs/dof_test.debug': No space left on device
mv: cannot create directory '/var/jenkins/workspace/deal.II-CUDA11.0/build/tests/dofs/dof_tools_13.release': No space left on device
mv: cannot create directory '/var/jenkins/workspace/deal.II-CUDA11.0/build/tests/dofs/dof_tools_extract_dofs_with_support_contained_within_03.debug': No space left on device
mv: cannot create directory '/var/jenkins/workspace/deal.II-CUDA11.0/build/tests/dofs/sparsity_pattern_06.debug': No space left on device
mv: cannot create directory '/var/jenkins/workspace/deal.II-CUDA11.0/build/tests/dofs/dof_tools_02c.debug': No space left on device
mv: cannot create directory '/var/jenkins/workspace/deal.II-CUDA11.0/build/tests/dofs/dof_tools_18a.debug': No space left on device
mv: cannot create directory '/var/jenkins/workspace/deal.II-CUDA11.0/build/tests/dofs/interpolate_dgq_02.debug': No space left on device
mv: cannot create directory '/var/jenkins/workspace/deal.II-CUDA11.0/build/tests/dofs/dof_tools_13a.debug': No space left on device
mv: cannot create directory '/var/jenkins/workspace/deal.II-CUDA11.0/build/tests/dofs/dof_tools_extract_dofs_with_support_contained_within_03.release': No space left on device
mv: cannot create directory '/var/jenkins/workspace/deal.II-CUDA11.0/build/tests/dofs/extract_dofs_by_component_04.debug': No space left on device
mv: cannot create directory '/var/jenkins/workspace/deal.II-CUDA11.0/build/tests/dofs/n_boundary_dofs_01.release': No space left on device
mv: cannot create directory '/var/jenkins/workspace/deal.II-CUDA11.0/build/tests/dofs/dof_accessor_01.release': No space left on device
mv: cannot create directory '/var/jenkins/workspace/deal.II-CUDA11.0/build/tests/dofs/dof_renumbering_02.release': No space left on device
mv: cannot create directory '/var/jenkins/workspace/deal.II-CUDA11.0/build/tests/dofs/dof_tools_02c.release': No space left on device
mv: cannot create directory '/var/jenkins/workspace/deal.II-CUDA11.0/build/tests/dofs/dof_test.release': No space left on device
mv: cannot create directory '/var/jenkins/workspace/deal.II-CUDA11.0/build/tests/dofs/dof_tools_02d.debug': No space left on device
mv: cannot create directory '/var/jenkins/workspace/deal.II-CUDA11.0/build/tests/dofs/dof_tools_13a.release': No space left on device
mv: cannot create directory '/var/jenkins/workspace/deal.II-CUDA11.0/build/tests/dofs/dof_tools_18a.release': No space left on device
mv: cannot create directory '/var/jenkins/workspace/deal.II-CUDA11.0/build/tests/dofs/extract_dofs_by_component_04.release': No space left on device
mv: cannot create directory '/var/jenkins/workspace/deal.II-CUDA11.0/build/tests/dofs/dof_tools_21_c.debug': No space left on device
mv: cannot create directory '/var/jenkins/workspace/deal.II-CUDA11.0/build/tests/dofs/dof_constraints_01.debug': No space left on device
mv: cannot create directory '/var/jenkins/workspace/deal.II-CUDA11.0/build/tests/dofs/dof_renumbering_03.debug': No space left on device
mv: cannot create directory '/var/jenkins/workspace/deal.II-CUDA11.0/build/tests/dofs/dof_tools_02d.release': No space left on device
mv: cannot create directory '/var/jenkins/workspace/deal.II-CUDA11.0/build/tests/dofs/dof_tools_14.debug': No space left on device
mv: cannot create directory '/var/jenkins/workspace/deal.II-CUDA11.0/build/tests/dofs/extract_dofs_by_component_05.debug': No space left on device
mv: cannot create directory '/var/jenkins/workspace/deal.II-CUDA11.0/build/tests/dofs/interpolate_dgq_02.release': No space left on device
mv: cannot create directory '/var/jenkins/workspace/deal.II-CUDA11.0/build/tests/dofs/sparsity_pattern_06.release': No space left on device
mv: cannot create directory '/var/jenkins/workspace/deal.II-CUDA11.0/build/tests/dofs/dof_tools_03.debug': No space left on device
mv: cannot create directory '/var/jenkins/workspace/deal.II-CUDA11.0/build/tests/dofs/dof_tools_14.release': No space left on device
mv: cannot create directory '/var/jenkins/workspace/deal.II-CUDA11.0/build/tests/dofs/dof_tools_18a_1d.debug': No space left on device
mv: cannot create directory '/var/jenkins/workspace/deal.II-CUDA11.0/build/tests/dofs/dof_tools_extract_dofs_with_support_contained_within_04.debug': No space left on device
mv: cannot create directory '/var/jenkins/workspace/deal.II-CUDA11.0/build/tests/dofs/interpolate_q_01.debug': No space left on device
mv: cannot create directory '/var/jenkins/workspace/deal.II-CUDA11.0/build/tests/dofs/dof_constraints_01.release': No space left on device
mv: cannot create directory '/var/jenkins/workspace/deal.II-CUDA11.0/build/tests/dofs/dof_renumbering_03.release': No space left on device
mv: cannot create directory '/var/jenkins/workspace/deal.II-CUDA11.0/build/tests/dofs/dof_tools_00a.debug': No space left on device
mv: cannot create directory '/var/jenkins/workspace/deal.II-CUDA11.0/build/tests/dofs/dof_tools_03.release': No space left on device
mv: cannot create directory '/var/jenkins/workspace/deal.II-CUDA11.0/build/tests/dofs/dof_tools_15a.debug': No space left on device
mv: cannot create directory '/var/jenkins/workspace/deal.II-CUDA11.0/build/tests/dofs/dof_tools_extract_dofs_with_support_contained_within_04.release': No space left on device
mv: cannot create directory '/var/jenkins/workspace/deal.II-CUDA11.0/build/tests/dofs/dof_tools_21_c.release': No space left on device
mv: cannot create directory '/var/jenkins/workspace/deal.II-CUDA11.0/build/tests/dofs/extract_dofs_by_component_05.release': No space left on device
mv: cannot create directory '/var/jenkins/workspace/deal.II-CUDA11.0/build/tests/dofs/interpolate_q_01.release': No space left on device
mv: cannot create directory '/var/jenkins/workspace/deal.II-CUDA11.0/build/tests/dofs/extract_dofs_by_component_05_hp.debug': No space left on device
mv: cannot create directory '/var/jenkins/workspace/deal.II-CUDA11.0/build/tests/dofs/n_boundary_dofs_02.debug': No space left on device
mv: cannot create directory '/var/jenkins/workspace/deal.II-CUDA11.0/build/tests/dofs/dof_constraints_02.debug': No space left on device
mv: cannot create directory '/var/jenkins/workspace/deal.II-CUDA11.0/build/tests/dofs/dof_tools_00a.release': No space left on device
mv: cannot create directory '/var/jenkins/workspace/deal.II-CUDA11.0/build/tests/dofs/dof_tools_04.debug': No space left on device
mv: cannot create directory '/var/jenkins/workspace/deal.II-CUDA11.0/build/tests/dofs/dof_tools_18a_1d.release': No space left on device
mv: cannot create directory '/var/jenkins/workspace/deal.II-CUDA11.0/build/tests/dofs/dof_tools_22a.debug': No space left on device
mv: cannot create directory '/var/jenkins/workspace/deal.II-CUDA11.0/build/tests/dofs/interpolate_q_02.debug': No space left on device
mv: cannot create directory '/var/jenkins/workspace/deal.II-CUDA11.0/build/tests/dofs/sparsity_pattern_07.debug': No space left on device
mv: cannot create directory '/var/jenkins/workspace/deal.II-CUDA11.0/build/tests/dofs/dof_renumbering_04.debug': No space left on device
mv: cannot create directory '/var/jenkins/workspace/deal.II-CUDA11.0/build/tests/dofs/dof_tools_15a.release': No space left on device
mv: cannot create directory '/var/jenkins/workspace/deal.II-CUDA11.0/build/tests/dofs/extract_dofs_by_component_05_hp.release': No space left on device
mv: cannot create directory '/var/jenkins/workspace/deal.II-CUDA11.0/build/tests/dofs/dof_tools_04.release': No space left on device
mv: cannot create directory '/var/jenkins/workspace/deal.II-CUDA11.0/build/tests/dofs/interpolate_q_02.release': No space left on device
mv: cannot create directory '/var/jenkins/workspace/deal.II-CUDA11.0/build/tests/dofs/n_boundary_dofs_02.release': No space left on device
mv: cannot create directory '/var/jenkins/workspace/deal.II-CUDA11.0/build/tests/dofs/sparsity_pattern_07.release': No space left on device
mv: cannot create directory '/var/jenkins/workspace/deal.II-CUDA11.0/build/tests/dofs/accessor_01.debug': No space left on device
mv: cannot create directory '/var/jenkins/workspace/deal.II-CUDA11.0/build/tests/dofs/dof_constraints_02.release': No space left on device
mv: cannot create directory '/var/jenkins/workspace/deal.II-CUDA11.0/build/tests/dofs/dof_renumbering_04.release': No space left on device
mv: cannot create directory '/var/jenkins/workspace/deal.II-CUDA11.0/build/tests/dofs/dof_tools_15b.debug': No space left on device
mv: cannot create directory '/var/jenkins/workspace/deal.II-CUDA11.0/build/tests/dofs/extract_dofs_by_component_06.debug': No space left on device
mv: cannot create directory '/var/jenkins/workspace/deal.II-CUDA11.0/build/tests/dofs/dof_renumbering_04a.debug': No space left on device
mv: cannot create directory '/var/jenkins/workspace/deal.II-CUDA11.0/build/tests/dofs/dof_tools_22a.release': No space left on device
mv: cannot create directory '/var/jenkins/workspace/deal.II-CUDA11.0/build/tests/dofs/dof_tools_01a.debug': No space left on device
mv: cannot create directory '/var/jenkins/workspace/deal.II-CUDA11.0/build/tests/dofs/dof_tools_18b.debug': No space left on device
mv: cannot create directory '/var/jenkins/workspace/deal.II-CUDA11.0/build/tests/dofs/n_boundary_dofs_03.debug': No space left on device
mv: cannot create directory '/var/jenkins/workspace/deal.II-CUDA11.0/build/tests/dofs/dof_tools_15b.release': No space left on device
mv: cannot create directory '/var/jenkins/workspace/deal.II-CUDA11.0/build/tests/dofs/dof_tools_04a.debug': No space left on device
mv: cannot create directory '/var/jenkins/workspace/deal.II-CUDA11.0/build/tests/dofs/dof_tools_write_gnuplot_dof_support_point_info_01.debug': No space left on device
mv: cannot create directory '/var/jenkins/workspace/deal.II-CUDA11.0/build/tests/dofs/n_boundary_dofs_03.release': No space left on device
mv: cannot create directory '/var/jenkins/workspace/deal.II-CUDA11.0/build/tests/dofs/dof_constraints_03.debug': No space left on device
mv: cannot create directory '/var/jenkins/workspace/deal.II-CUDA11.0/build/tests/dofs/dof_tools_01a.release': No space left on device
mv: cannot create directory '/var/jenkins/workspace/deal.II-CUDA11.0/build/tests/dofs/dof_tools_18b.release': No space left on device
mv: cannot create directory '/var/jenkins/workspace/deal.II-CUDA11.0/build/tests/dofs/dof_tools_write_gnuplot_dof_support_point_info_01.release': No space left on device
mv: cannot create directory '/var/jenkins/workspace/deal.II-CUDA11.0/build/tests/dofs/extract_dofs_by_component_06.release': No space left on device
mv: cannot create directory '/var/jenkins/workspace/deal.II-CUDA11.0/build/tests/dofs/interpolate_q_system_01.debug': No space left on device
mv: cannot create directory '/var/jenkins/workspace/deal.II-CUDA11.0/build/tests/dofs/accessor_01.release': No space left on device
mv: cannot create directory '/var/jenkins/workspace/deal.II-CUDA11.0/build/tests/dofs/dof_renumbering_04a.release': No space left on device
mv: cannot create directory '/var/jenkins/workspace/deal.II-CUDA11.0/build/tests/dofs/n_dofs_per_object.debug': No space left on device
mv: cannot create directory '/var/jenkins/workspace/deal.II-CUDA11.0/build/tests/dofs/dof_tools_15c.debug': No space left on device
mv: cannot create directory '/var/jenkins/workspace/deal.II-CUDA11.0/build/tests/dofs/dof_tools_18c.debug': No space left on device
mv: cannot create directory '/var/jenkins/workspace/deal.II-CUDA11.0/build/tests/dofs/interpolate_q_system_01.release': No space left on device
mv: cannot create directory '/var/jenkins/workspace/deal.II-CUDA11.0/build/tests/dofs/block_info.debug': No space left on device
mv: cannot create directory '/var/jenkins/workspace/deal.II-CUDA11.0/build/tests/dofs/dof_tools_04a.release': No space left on device
mv: cannot create directory '/var/jenkins/workspace/deal.II-CUDA11.0/build/tests/dofs/dof_tools_write_gnuplot_dof_support_point_info_02.debug': No space left on device
mv: cannot create directory '/var/jenkins/workspace/deal.II-CUDA11.0/build/tests/dofs/dof_constraints_03.release': No space left on device
mv: cannot create directory '/var/jenkins/workspace/deal.II-CUDA11.0/build/tests/dofs/dof_renumbering_05.debug': No space left on device
mv: cannot create directory '/var/jenkins/workspace/deal.II-CUDA11.0/build/tests/dofs/dof_tools_15c.release': No space left on device
mv: cannot create directory '/var/jenkins/workspace/deal.II-CUDA11.0/build/tests/dofs/n_dofs_per_object.release': No space left on device
mv: cannot create directory '/var/jenkins/workspace/deal.II-CUDA11.0/build/tests/dofs/block_info.release': No space left on device
mv: cannot create directory '/var/jenkins/workspace/deal.II-CUDA11.0/build/tests/dofs/dof_tools_01a_constraints_false.debug': No space left on device
mv: cannot create directory '/var/jenkins/workspace/deal.II-CUDA11.0/build/tests/dofs/dof_tools_18c.release': No space left on device
mv: cannot create directory '/var/jenkins/workspace/deal.II-CUDA11.0/build/tests/dofs/extract_dofs_by_component_06_hp.debug': No space left on device
mv: cannot create directory '/var/jenkins/workspace/deal.II-CUDA11.0/build/tests/dofs/interpolate_q_system_02.debug': No space left on device
mv: cannot create directory '/var/jenkins/workspace/deal.II-CUDA11.0/build/tests/dofs/dof_renumbering_05.release': No space left on device
mv: cannot create directory '/var/jenkins/workspace/deal.II-CUDA11.0/build/tests/dofs/dof_tools_write_gnuplot_dof_support_point_info_02.release': No space left on device
mv: cannot create directory '/var/jenkins/workspace/deal.II-CUDA11.0/build/tests/dofs/dof_constraints_04.debug': No space left on device
mv: cannot create directory '/var/jenkins/workspace/deal.II-CUDA11.0/build/tests/dofs/block_info_02.debug': No space left on device
mv: cannot create directory '/var/jenkins/workspace/deal.II-CUDA11.0/build/tests/dofs/dof_tools_15d.debug': No space left on device
mv: cannot create directory '/var/jenkins/workspace/deal.II-CUDA11.0/build/tests/dofs/dof_tools_write_gnuplot_dof_support_point_info_03.debug': No space left on device
mv: cannot create directory '/var/jenkins/workspace/deal.II-CUDA11.0/build/tests/dofs/dof_constraints_04.release': No space left on device
mv: cannot create directory '/var/jenkins/workspace/deal.II-CUDA11.0/build/tests/dofs/dof_tools_01a_constraints_false.release': No space left on device
mv: cannot create directory '/var/jenkins/workspace/deal.II-CUDA11.0/build/tests/dofs/extract_dofs_by_component_06_hp.release': No space left on device
mv: cannot create directory '/var/jenkins/workspace/deal.II-CUDA11.0/build/tests/dofs/block_info_02.release': No space left on device
mv: cannot create directory '/var/jenkins/workspace/deal.II-CUDA11.0/build/tests/dofs/dof_renumbering_06.debug': No space left on device
mv: cannot create directory '/var/jenkins/workspace/deal.II-CUDA11.0/build/tests/dofs/interpolate_q_system_02.release': No space left on device
mv: cannot create directory '/var/jenkins/workspace/deal.II-CUDA11.0/build/tests/dofs/range_based_for_dof_face.debug': No space left on device
mv: cannot create directory '/var/jenkins/workspace/deal.II-CUDA11.0/build/tests/dofs/dof_constraints_05.debug': No space left on device
mv: cannot create directory '/var/jenkins/workspace/deal.II-CUDA11.0/build/tests/dofs/dof_tools_15d.release': No space left on device
mv: cannot create directory '/var/jenkins/workspace/deal.II-CUDA11.0/build/tests/dofs/dof_tools_write_gnuplot_dof_support_point_info_03.release': No space left on device
mv: cannot create directory '/var/jenkins/workspace/deal.II-CUDA11.0/build/tests/dofs/interpolate_q_system_mask_01.debug': No space left on device
mv: cannot create directory '/var/jenkins/workspace/deal.II-CUDA11.0/build/tests/dofs/dof_constraints_05.release': No space left on device
mv: cannot create directory '/var/jenkins/workspace/deal.II-CUDA11.0/build/tests/dofs/dof_renumbering_06.release': No space left on device
mv: cannot create directory '/var/jenkins/workspace/deal.II-CUDA11.0/build/tests/dofs/dof_tools_write_gnuplot_dof_support_point_info_04.debug': No space left on device
mv: cannot create directory '/var/jenkins/workspace/deal.II-CUDA11.0/build/tests/dofs/extract_dofs_per_component_01.debug': No space left on device
mv: cannot create directory '/var/jenkins/workspace/deal.II-CUDA11.0/build/tests/dofs/range_based_for_dof_face.release': No space left on device
mv: cannot create directory '/var/jenkins/workspace/deal.II-CUDA11.0/build/tests/dofs/dof_constraints_06.debug': No space left on device
mv: cannot create directory '/var/jenkins/workspace/deal.II-CUDA11.0/build/tests/dofs/range_based_for_step-6.debug': No space left on device
mv: cannot create directory '/var/jenkins/workspace/deal.II-CUDA11.0/build/tests/dofs/block_list_01.debug': No space left on device
mv: cannot create directory '/var/jenkins/workspace/deal.II-CUDA11.0/build/tests/dofs/dof_tools_01a_constraints_true.debug': No space left on device
mv: cannot create directory '/var/jenkins/workspace/deal.II-CUDA11.0/build/tests/dofs/dof_tools_18d.debug': No space left on device
mv: cannot create directory '/var/jenkins/workspace/deal.II-CUDA11.0/build/tests/dofs/interpolate_q_system_mask_01.release': No space left on device
mv: cannot create directory '/var/jenkins/workspace/deal.II-CUDA11.0/build/tests/dofs/dof_renumbering_07.debug': No space left on device
mv: cannot create directory '/var/jenkins/workspace/deal.II-CUDA11.0/build/tests/dofs/dof_tools_16a.debug': No space left on device
mv: cannot create directory '/var/jenkins/workspace/deal.II-CUDA11.0/build/tests/dofs/dof_tools_write_gnuplot_dof_support_point_info_04.release': No space left on device
mv: cannot create directory '/var/jenkins/workspace/deal.II-CUDA11.0/build/tests/dofs/extract_dofs_per_component_01.release': No space left on device
mv: cannot create directory '/var/jenkins/workspace/deal.II-CUDA11.0/build/tests/dofs/range_based_for_step-6.release': No space left on device
mv: cannot create directory '/var/jenkins/workspace/deal.II-CUDA11.0/build/tests/dofs/dof_tools_01a_constraints_true.release': No space left on device
mv: cannot create directory '/var/jenkins/workspace/deal.II-CUDA11.0/build/tests/dofs/block_list_01.release': No space left on device
mv: cannot create directory '/var/jenkins/workspace/deal.II-CUDA11.0/build/tests/dofs/dof_constraints_06.release': No space left on device
mv: cannot create directory '/var/jenkins/workspace/deal.II-CUDA11.0/build/tests/dofs/dof_tools_16a.release': No space left on device
mv: cannot create directory '/var/jenkins/workspace/deal.II-CUDA11.0/build/tests/dofs/dof_tools_18d.release': No space left on device
mv: cannot create directory '/var/jenkins/workspace/deal.II-CUDA11.0/build/tests/dofs/dof_tools_23.debug': No space left on device
mv: cannot create directory '/var/jenkins/workspace/deal.II-CUDA11.0/build/tests/dofs/range_based_for_tria.debug': No space left on device
mv: cannot create directory '/var/jenkins/workspace/deal.II-CUDA11.0/build/tests/dofs/dof_renumbering_07.release': No space left on device
mv: cannot create directory '/var/jenkins/workspace/deal.II-CUDA11.0/build/tests/dofs/dof_tools_05.debug': No space left on device
mv: cannot create directory '/var/jenkins/workspace/deal.II-CUDA11.0/build/tests/dofs/dof_constraints_07.debug': No space left on device
mv: cannot create directory '/var/jenkins/workspace/deal.II-CUDA11.0/build/tests/dofs/interpolate_q_system_mask_02.debug': No space left on device
mv: cannot create directory '/var/jenkins/workspace/deal.II-CUDA11.0/build/tests/dofs/block_list_02.debug': No space left on device
mv: cannot create directory '/var/jenkins/workspace/deal.II-CUDA11.0/build/tests/dofs/dof_tools_01a_subdomain.debug': No space left on device
mv: cannot create directory '/var/jenkins/workspace/deal.II-CUDA11.0/build/tests/dofs/dof_tools_23.release': No space left on device
mv: cannot create directory '/var/jenkins/workspace/deal.II-CUDA11.0/build/tests/dofs/dof_tools_05.release': No space left on device
mv: cannot create directory '/var/jenkins/workspace/deal.II-CUDA11.0/build/tests/dofs/extract_dofs_by_component_01.debug': No space left on device
mv: cannot create directory '/var/jenkins/workspace/deal.II-CUDA11.0/build/tests/dofs/interpolate_q_system_mask_02.release': No space left on device
mv: cannot create directory '/var/jenkins/workspace/deal.II-CUDA11.0/build/tests/dofs/range_based_for_tria.release': No space left on device
mv: cannot create directory '/var/jenkins/workspace/deal.II-CUDA11.0/build/tests/dofs/block_list_02.release': No space left on device
mv: cannot create directory '/var/jenkins/workspace/deal.II-CUDA11.0/build/tests/dofs/dof_constraints_07.release': No space left on device
mv: cannot create directory '/var/jenkins/workspace/deal.II-CUDA11.0/build/tests/dofs/dof_tools_01a_subdomain.release': No space left on device
mv: cannot create directory '/var/jenkins/workspace/deal.II-CUDA11.0/build/tests/dofs/dof_tools_16b.debug': No space left on device
mv: cannot create directory '/var/jenkins/workspace/deal.II-CUDA11.0/build/tests/dofs/dof_tools_16b.release': No space left on device
mv: cannot create directory '/var/jenkins/workspace/deal.II-CUDA11.0/build/tests/dofs/dof_tools_19.debug': No space left on device
mv: cannot create directory '/var/jenkins/workspace/deal.II-CUDA11.0/build/tests/dofs/dof_constraints_08.debug': No space left on device
mv: cannot create directory '/var/jenkins/workspace/deal.II-CUDA11.0/build/tests/dofs/dof_renumbering_08.debug': No space left on device
mv: cannot create directory '/var/jenkins/workspace/deal.II-CUDA11.0/build/tests/dofs/dof_tools_19.release': No space left on device
mv: cannot create directory '/var/jenkins/workspace/deal.II-CUDA11.0/build/tests/dofs/dof_tools_01b.debug': No space left on device
mv: cannot create directory '/var/jenkins/workspace/deal.II-CUDA11.0/build/tests/dofs/dof_tools_24.debug': No space left on device
mv: cannot create directory '/var/jenkins/workspace/deal.II-CUDA11.0/build/tests/dofs/extract_dofs_per_component_02.debug': No space left on device
mv: cannot create directory '/var/jenkins/workspace/deal.II-CUDA11.0/build/tests/dofs/block_list_03.debug': No space left on device
mv: cannot create directory '/var/jenkins/workspace/deal.II-CUDA11.0/build/tests/dofs/dof_renumbering_08.release': No space left on device
mv: cannot create directory '/var/jenkins/workspace/deal.II-CUDA11.0/build/tests/dofs/dof_tools_16c.debug': No space left on device
mv: cannot create directory '/var/jenkins/workspace/deal.II-CUDA11.0/build/tests/dofs/extract_dofs_by_component_01.release': No space left on device
mv: cannot create directory '/var/jenkins/workspace/deal.II-CUDA11.0/build/tests/dofs/dof_constraints_08.release': No space left on device
mv: cannot create directory '/var/jenkins/workspace/deal.II-CUDA11.0/build/tests/dofs/dof_tools_01b.release': No space left on device
mv: cannot create directory '/var/jenkins/workspace/deal.II-CUDA11.0/build/tests/dofs/dof_tools_06.debug': No space left on device
mv: cannot create directory '/var/jenkins/workspace/deal.II-CUDA11.0/build/tests/dofs/dof_tools_20.debug': No space left on device
mv: cannot create directory '/var/jenkins/workspace/deal.II-CUDA11.0/build/tests/dofs/range_based_for_tria_face.debug': No space left on device
mv: cannot create directory '/var/jenkins/workspace/deal.II-CUDA11.0/build/tests/dofs/dof_tools_01c.debug': No space left on device
mv: cannot create directory '/var/jenkins/workspace/deal.II-CUDA11.0/build/tests/dofs/dof_tools_16c.release': No space left on device
mv: cannot create directory '/var/jenkins/workspace/deal.II-CUDA11.0/build/tests/dofs/invalid_iterators_01.debug': No space left on device
mv: cannot create directory '/var/jenkins/workspace/deal.II-CUDA11.0/build/tests/dofs/block_list_03.release': No space left on device
mv: cannot create directory '/var/jenkins/workspace/deal.II-CUDA11.0/build/tests/dofs/extract_dofs_by_component_01_hp.debug': No space left on device
mv: cannot create directory '/var/jenkins/workspace/deal.II-CUDA11.0/build/tests/dofs/dof_constraints_09.debug': No space left on device
mv: cannot create directory '/var/jenkins/workspace/deal.II-CUDA11.0/build/tests/dofs/dof_tools_01c.release': No space left on device
mv: cannot create directory '/var/jenkins/workspace/deal.II-CUDA11.0/build/tests/dofs/dof_tools_06.release': No space left on device
mv: cannot create directory '/var/jenkins/workspace/deal.II-CUDA11.0/build/tests/dofs/dof_tools_16d.debug': No space left on device
mv: cannot create directory '/var/jenkins/workspace/deal.II-CUDA11.0/build/tests/dofs/extract_dofs_per_component_02.release': No space left on device
mv: cannot create directory '/var/jenkins/workspace/deal.II-CUDA11.0/build/tests/dofs/block_list_04.debug': No space left on device
mv: cannot create directory '/var/jenkins/workspace/deal.II-CUDA11.0/build/tests/dofs/dof_renumbering_09.debug': No space left on device
mv: cannot create directory '/var/jenkins/workspace/deal.II-CUDA11.0/build/tests/dofs/dof_tools_24.release': No space left on device
mv: cannot create directory '/var/jenkins/workspace/deal.II-CUDA11.0/build/tests/dofs/extract_dofs_by_component_01_hp.release': No space left on device
mv: cannot create directory '/var/jenkins/workspace/deal.II-CUDA11.0/build/tests/dofs/invalid_iterators_01.release': No space left on device
mv: cannot create directory '/var/jenkins/workspace/deal.II-CUDA11.0/build/tests/dofs/range_based_for_tria_face.release': No space left on device
mv: cannot create directory '/var/jenkins/workspace/deal.II-CUDA11.0/build/tests/dofs/block_list_04.release': No space left on device
mv: cannot create directory '/var/jenkins/workspace/deal.II-CUDA11.0/build/tests/dofs/dof_tools_01d.debug': No space left on device
mv: cannot create directory '/var/jenkins/workspace/deal.II-CUDA11.0/build/tests/dofs/dof_tools_07.debug': No space left on device
mv: cannot create directory '/var/jenkins/workspace/deal.II-CUDA11.0/build/tests/dofs/sparsity_pattern.debug': No space left on device
mv: cannot create directory '/var/jenkins/workspace/deal.II-CUDA11.0/build/tests/dofs/dof_tools_16d.release': No space left on device
mv: cannot create directory '/var/jenkins/workspace/deal.II-CUDA11.0/build/tests/dofs/dof_constraints_09.release': No space left on device
mv: cannot create directory '/var/jenkins/workspace/deal.II-CUDA11.0/build/tests/dofs/dof_tools_01d.release': No space left on device
mv: cannot create directory '/var/jenkins/workspace/deal.II-CUDA11.0/build/tests/dofs/dof_tools_07.release': No space left on device
mv: cannot create directory '/var/jenkins/workspace/deal.II-CUDA11.0/build/tests/dofs/dof_tools_20.release': No space left on device
mv: cannot create directory '/var/jenkins/workspace/deal.II-CUDA11.0/build/tests/dofs/extract_dofs_by_component_01_mg.debug': No space left on device
mv: cannot create directory '/var/jenkins/workspace/deal.II-CUDA11.0/build/tests/dofs/dof_tools_17a.debug': No space left on device
mv: cannot create directory '/var/jenkins/workspace/deal.II-CUDA11.0/build/tests/dofs/dof_tools_25.debug': No space left on device
mv: cannot create directory '/var/jenkins/workspace/deal.II-CUDA11.0/build/tests/dofs/extract_dofs_by_component_01_mg.release': No space left on device
mv: cannot create directory '/var/jenkins/workspace/deal.II-CUDA11.0/build/tests/dofs/invalid_iterators_02.debug': No space left on device
mv: cannot create directory '/var/jenkins/workspace/deal.II-CUDA11.0/build/tests/dofs/dof_renumbering_09.release': No space left on device
mv: cannot create directory '/var/jenkins/workspace/deal.II-CUDA11.0/build/tests/dofs/dof_tools_08.debug': No space left on device
mv: cannot create directory '/var/jenkins/workspace/deal.II-CUDA11.0/build/tests/dofs/invalid_iterators_02.release': No space left on device
mv: cannot create directory '/var/jenkins/workspace/deal.II-CUDA11.0/build/tests/dofs/sparsity_pattern.release': No space left on device
mv: cannot create directory '/var/jenkins/workspace/deal.II-CUDA11.0/build/tests/dofs/block_list_05.debug': No space left on device
mv: cannot create directory '/var/jenkins/workspace/deal.II-CUDA11.0/build/tests/dofs/dof_constraints_10.debug': No space left on device
mv: cannot create directory '/var/jenkins/workspace/deal.II-CUDA11.0/build/tests/dofs/dof_tools_08.release': No space left on device
mv: cannot create directory '/var/jenkins/workspace/deal.II-CUDA11.0/build/tests/dofs/dof_tools_21.debug': No space left on device
mv: cannot create directory '/var/jenkins/workspace/deal.II-CUDA11.0/build/tests/dofs/block_list_05.release': No space left on device
mv: cannot create directory '/var/jenkins/workspace/deal.II-CUDA11.0/build/tests/dofs/dof_tools_25.release': No space left on device
mv: cannot create directory '/var/jenkins/workspace/deal.II-CUDA11.0/build/tests/dofs/get_dofs_on_patch.debug': No space left on device
mv: cannot create directory '/var/jenkins/workspace/deal.II-CUDA11.0/build/tests/dofs/locally_relevant_dofs_per_subdomain_01.debug': No space left on device
mv: cannot create directory '/var/jenkins/workspace/deal.II-CUDA11.0/build/tests/dofs/dof_tools_17a.release': No space left on device
mv: cannot create directory '/var/jenkins/workspace/deal.II-CUDA11.0/build/tests/dofs/get_dofs_on_patch.release': No space left on device
mv: cannot create directory '/var/jenkins/workspace/deal.II-CUDA11.0/build/tests/dofs/dof_tools_02a.debug': No space left on device
mv: cannot create directory '/var/jenkins/workspace/deal.II-CUDA11.0/build/tests/dofs/dof_tools_09.debug': No space left on device
mv: cannot create directory '/var/jenkins/workspace/deal.II-CUDA11.0/build/tests/dofs/extract_dofs_by_component_01x.debug': No space left on device
mv: cannot create directory '/var/jenkins/workspace/deal.II-CUDA11.0/build/tests/dofs/dof_constraints_10.release': No space left on device
mv: cannot create directory '/var/jenkins/workspace/deal.II-CUDA11.0/build/tests/dofs/dof_tools_21.release': No space left on device
mv: cannot create directory '/var/jenkins/workspace/deal.II-CUDA11.0/build/tests/dofs/locally_relevant_dofs_per_subdomain_01.release': No space left on device
mv: cannot create directory '/var/jenkins/workspace/deal.II-CUDA11.0/build/tests/dofs/extract_dofs_by_component_01x.release': No space left on device
mv: cannot create directory '/var/jenkins/workspace/deal.II-CUDA11.0/build/tests/dofs/sparsity_pattern_01.debug': No space left on device
mv: cannot create directory '/var/jenkins/workspace/deal.II-CUDA11.0/build/tests/dofs/dof_renumbering_10.debug': No space left on device
mv: cannot create directory '/var/jenkins/workspace/deal.II-CUDA11.0/build/tests/dofs/dof_tools_02a.release': No space left on device
mv: cannot create directory '/var/jenkins/workspace/deal.II-CUDA11.0/build/tests/dofs/dof_tools_09.release': No space left on device
mv: cannot create directory '/var/jenkins/workspace/deal.II-CUDA11.0/build/tests/dofs/hp_constraints_are_implemented.debug': No space left on device
mv: cannot create directory '/var/jenkins/workspace/deal.II-CUDA11.0/build/tests/dofs/dof_constraints_11.debug': No space left on device
mv: cannot create directory '/var/jenkins/workspace/deal.II-CUDA11.0/build/tests/dofs/dof_tools_17b.debug': No space left on device
mv: cannot create directory '/var/jenkins/workspace/deal.II-CUDA11.0/build/tests/dofs/dof_tools_21_b.debug': No space left on device
mv: cannot create directory '/var/jenkins/workspace/deal.II-CUDA11.0/build/tests/dofs/dof_tools_extract_dofs_with_support_contained_within_01.debug': No space left on device
mv: cannot create directory '/var/jenkins/workspace/deal.II-CUDA11.0/build/tests/dofs/block_list_parallel_01.debug': No space left on device
mv: cannot create directory '/var/jenkins/workspace/deal.II-CUDA11.0/build/tests/dofs/extract_dofs_by_component_01y.debug': No space left on device
mv: cannot create directory '/var/jenkins/workspace/deal.II-CUDA11.0/build/tests/dofs/sparsity_pattern_01.release': No space left on device
mv: cannot create directory '/var/jenkins/workspace/deal.II-CUDA11.0/build/tests/dofs/hp_constraints_are_implemented.release': No space left on device
mv: cannot create directory '/var/jenkins/workspace/deal.II-CUDA11.0/build/tests/dofs/locally_relevant_dofs_per_subdomain_01_hp.debug': No space left on device
mv: cannot create directory '/var/jenkins/workspace/deal.II-CUDA11.0/build/tests/dofs/dof_constraints_11.release': No space left on device
mv: cannot create directory '/var/jenkins/workspace/deal.II-CUDA11.0/build/tests/dofs/dof_tools_02a_constraints_false.debug': No space left on device
mv: cannot create directory '/var/jenkins/workspace/deal.II-CUDA11.0/build/tests/dofs/dof_tools_10.debug': No space left on device
mv: cannot create directory '/var/jenkins/workspace/deal.II-CUDA11.0/build/tests/dofs/extract_dofs_by_component_01y.release': No space left on device
mv: cannot create regular file '/var/jenkins/workspace/deal.II-CUDA11.0/build/tests/dofs/CMakeCache.txt': No space left on device
mv: cannot create regular file '/var/jenkins/workspace/deal.II-CUDA11.0/build/tests/dofs/Makefile': No space left on device
mv: cannot create regular file '/var/jenkins/workspace/deal.II-CUDA11.0/build/tests/dofs/cmake_install.cmake': No space left on device
mv: cannot create regular file '/var/jenkins/workspace/deal.II-CUDA11.0/build/tests/dofs/CTestTestfile.cmake': No space left on device
mv: cannot create directory '/var/jenkins/workspace/deal.II-CUDA11.0/build/tests/dofs/dof_tools_10.release': No space left on device
mv: cannot create directory '/var/jenkins/workspace/deal.II-CUDA11.0/build/tests/dofs/dof_tools_21_b.release': No space left on device
mv: cannot create directory '/var/jenkins/workspace/deal.II-CUDA11.0/build/tests/dofs/sparsity_pattern_02.debug': No space left on device
mv: cannot create directory '/var/jenkins/workspace/deal.II-CUDA11.0/build/tests/dofs/block_list_parallel_01.release': No space left on device
mv: cannot create directory '/var/jenkins/workspace/deal.II-CUDA11.0/build/tests/dofs/dof_constraints_11_x.debug': No space left on device
mv: cannot create directory '/var/jenkins/workspace/deal.II-CUDA11.0/build/tests/dofs/dof_tools_17b.release': No space left on device
mv: cannot create directory '/var/jenkins/workspace/deal.II-CUDA11.0/build/tests/dofs/dof_tools_12.debug': No space left on device
mv: cannot create directory '/var/jenkins/workspace/deal.II-CUDA11.0/build/tests/dofs/dof_tools_extract_dofs_with_support_contained_within_01.release': No space left on device
mv: cannot create directory '/var/jenkins/workspace/deal.II-CUDA11.0/build/tests/dofs/interpolate_based_on_material_id_01.debug': No space left on device
mv: cannot create directory '/var/jenkins/workspace/deal.II-CUDA11.0/build/tests/dofs/locally_relevant_dofs_per_subdomain_01_hp.release': No space left on device
mv: cannot create directory '/var/jenkins/workspace/deal.II-CUDA11.0/build/tests/dofs/sparsity_pattern_02.release': No space left on device
mv: cannot create directory '/var/jenkins/workspace/deal.II-CUDA11.0/build/tests/dofs/dof_renumbering_10.release': No space left on device
mv: cannot create directory '/var/jenkins/workspace/deal.II-CUDA11.0/build/tests/dofs/dof_tools_02a_constraints_false.release': No space left on device
mv: cannot create directory '/var/jenkins/workspace/deal.II-CUDA11.0/build/tests/dofs/block_relaxation_01.debug': No space left on device
mv: cannot create directory '/var/jenkins/workspace/deal.II-CUDA11.0/build/tests/epetraext': No space left on device
mv: cannot create directory '/var/jenkins/workspace/deal.II-CUDA11.0/build/tests/examples': No space left on device
mv: cannot create directory '/var/jenkins/workspace/deal.II-CUDA11.0/build/tests/fe': No space left on device
mv: cannot create directory '/var/jenkins/workspace/deal.II-CUDA11.0/build/tests/feinterface': No space left on device
mv: cannot create directory '/var/jenkins/workspace/deal.II-CUDA11.0/build/tests/full_matrix': No space left on device
mv: cannot create directory '/var/jenkins/workspace/deal.II-CUDA11.0/build/tests/fullydistributed_grids': No space left on device
mv: cannot create directory '/var/jenkins/workspace/deal.II-CUDA11.0/build/doc': No space left on device
mv: cannot create directory '/var/jenkins/workspace/deal.II-CUDA11.0/build/bundled': No space left on device
mv: cannot create regular file '/var/jenkins/workspace/deal.II-CUDA11.0/build/revision.log': No space left on device
mv: cannot create regular file '/var/jenkins/workspace/deal.II-CUDA11.0/build/detailed.log': No space left on device
mv: cannot create regular file '/var/jenkins/workspace/deal.II-CUDA11.0/build/summary.log': No space left on device
mv: cannot create regular file '/var/jenkins/workspace/deal.II-CUDA11.0/build/CTestTestfile.cmake': No space left on device
mv: cannot create regular file '/var/jenkins/workspace/deal.II-CUDA11.0/build/Makefile': No space left on device
mv: cannot create regular file '/var/jenkins/workspace/deal.II-CUDA11.0/build/cmake_install.cmake': No space left on device
mv: cannot create regular file '/var/jenkins/workspace/deal.II-CUDA11.0/build/CMakeCache.txt': No space left on device
mv: cannot create directory '/var/jenkins/workspace/deal.II-CUDA11.0/build/CMakeFiles': No space left on device
+ docker rm -f cuda11_deal_ci
cuda11_deal_ci
Build step 'Execute shell' marked build as failure
INFO: Processing CTest-Version 3.x (default)
INFO: [CTest-Version 3.x (default)] - 1 test report file(s) were found with the pattern 'build/Testing/**/Test.xml' relative to '/var/jenkins/workspace/deal.II-CUDA11.0' for the testing framework 'CTest-Version 3.x (default)'.
INFO: Check 'Failed Tests' threshold.
INFO: The total number of tests for the threshold 'Failed Tests' exceeds the specified "failure threshold" value.
INFO: Setting the build status to FAILURE
Finished: FAILURE