Console Output

Skipping 1,962 KB.. Full Log
            Start  8031: mpi/parallel_block_vector_08.mpirun=4.release
 9962/10731 Test  #8027: mpi/parallel_block_vector_07.mpirun=4.release ...................................   Passed    2.70 sec
            Start  8034: mpi/parallel_block_vector_09.mpirun=5.debug
 9963/10731 Test  #7809: mpi/mg_ghost_dofs_periodic_04.mpirun=5.debug ....................................   Passed   24.94 sec
            Start  8035: mpi/parallel_block_vector_09.mpirun=5.release
 9964/10731 Test  #8030: mpi/parallel_block_vector_08.mpirun=4.debug .....................................   Passed    2.96 sec
            Start  8038: mpi/parallel_block_vector_10.mpirun=4.debug
 9965/10731 Test  #8031: mpi/parallel_block_vector_08.mpirun=4.release ...................................   Passed    2.65 sec
            Start  8039: mpi/parallel_block_vector_10.mpirun=4.release
 9966/10731 Test  #8035: mpi/parallel_block_vector_09.mpirun=5.release ...................................   Passed    2.66 sec
            Start  8040: mpi/parallel_block_vector_11.mpirun=4.debug
 9967/10731 Test  #8034: mpi/parallel_block_vector_09.mpirun=5.debug .....................................   Passed    3.03 sec
            Start  8041: mpi/parallel_block_vector_11.mpirun=4.release
 9968/10731 Test  #8038: mpi/parallel_block_vector_10.mpirun=4.debug .....................................   Passed    2.97 sec
            Start  8042: mpi/parallel_block_vector_12.mpirun=4.debug
 9969/10731 Test  #8039: mpi/parallel_block_vector_10.mpirun=4.release ...................................   Passed    2.70 sec
            Start  8043: mpi/parallel_block_vector_12.mpirun=4.release
 9970/10731 Test  #7983: mpi/p4est_save_05.mpirun=5.release ..............................................   Passed   17.72 sec
            Start  8058: mpi/parallel_partitioner_03b.mpirun=4.debug
 9971/10731 Test  #7982: mpi/p4est_save_05.mpirun=5.debug ................................................   Passed   23.06 sec
            Start  8059: mpi/parallel_partitioner_03b.mpirun=4.release
 9972/10731 Test  #8058: mpi/parallel_partitioner_03b.mpirun=4.debug .....................................   Passed   12.93 sec
            Start  8064: mpi/parallel_partitioner_05.mpirun=4.debug
 9973/10731 Test  #8059: mpi/parallel_partitioner_03b.mpirun=4.release ...................................   Passed   11.28 sec
            Start  8065: mpi/parallel_partitioner_05.mpirun=4.release
 9974/10731 Test  #8041: mpi/parallel_block_vector_11.mpirun=4.release ...................................   Passed   25.34 sec
            Start  8066: mpi/parallel_partitioner_06.mpirun=4.debug
 9975/10731 Test  #8043: mpi/parallel_block_vector_12.mpirun=4.release ...................................   Passed   24.93 sec
            Start  8067: mpi/parallel_partitioner_06.mpirun=4.release
 9976/10731 Test  #8040: mpi/parallel_block_vector_11.mpirun=4.debug .....................................   Passed   28.93 sec
            Start  8068: mpi/parallel_partitioner_07.mpirun=4.debug
 9977/10731 Test  #8042: mpi/parallel_block_vector_12.mpirun=4.debug .....................................   Passed   29.59 sec
            Start  8069: mpi/parallel_partitioner_07.mpirun=4.release
 9978/10731 Test  #8064: mpi/parallel_partitioner_05.mpirun=4.debug ......................................   Passed   12.59 sec
            Start  8162: mpi/parallel_vector_23.mpirun=4.debug
 9979/10731 Test  #8065: mpi/parallel_partitioner_05.mpirun=4.release ....................................   Passed   11.36 sec
            Start  8163: mpi/parallel_vector_23.mpirun=4.release
 9980/10731 Test  #8066: mpi/parallel_partitioner_06.mpirun=4.debug ......................................   Passed   13.07 sec
            Start  8166: mpi/parallel_vector_back_interpolate.mpirun=4.debug
 9981/10731 Test  #8067: mpi/parallel_partitioner_06.mpirun=4.release ....................................   Passed   11.36 sec
            Start  8167: mpi/parallel_vector_back_interpolate.mpirun=4.release
 9982/10731 Test  #8069: mpi/parallel_partitioner_07.mpirun=4.release ....................................   Passed   11.66 sec
            Start  8168: mpi/parallel_vector_back_interpolate_02.mpirun=4.debug
 9983/10731 Test  #8068: mpi/parallel_partitioner_07.mpirun=4.debug ......................................   Passed   13.25 sec
            Start  8169: mpi/parallel_vector_back_interpolate_02.mpirun=4.release
 9984/10731 Test  #8162: mpi/parallel_vector_23.mpirun=4.debug ...........................................   Passed   13.07 sec
            Start  8170: mpi/parallel_vector_interpolate.mpirun=4.debug
 9985/10731 Test  #8163: mpi/parallel_vector_23.mpirun=4.release .........................................   Passed   11.24 sec
            Start  8171: mpi/parallel_vector_interpolate.mpirun=4.release
 9986/10731 Test  #8167: mpi/parallel_vector_back_interpolate.mpirun=4.release ...........................   Passed   17.25 sec
            Start  8218: mpi/project_bv_div_conf.mpirun=4.debug
 9987/10731 Test  #8166: mpi/parallel_vector_back_interpolate.mpirun=4.debug .............................   Passed   19.85 sec
            Start  8219: mpi/project_bv_div_conf.mpirun=4.release
 9988/10731 Test  #8218: mpi/project_bv_div_conf.mpirun=4.debug ..........................................   Passed    2.59 sec
            Start  8270: mpi/refine_and_coarsen_fixed_number_08.mpirun=4.debug
 9989/10731 Test  #8169: mpi/parallel_vector_back_interpolate_02.mpirun=4.release ........................   Passed   18.57 sec
            Start  8271: mpi/refine_and_coarsen_fixed_number_08.mpirun=4.release
 9990/10731 Test  #8219: mpi/project_bv_div_conf.mpirun=4.release ........................................   Passed    2.51 sec
            Start  8286: mpi/renumber_cuthill_mckee.mpirun=4.debug
 9991/10731 Test  #8171: mpi/parallel_vector_interpolate.mpirun=4.release ................................   Passed   17.16 sec
            Start  8287: mpi/renumber_cuthill_mckee.mpirun=4.release
 9992/10731 Test  #8270: mpi/refine_and_coarsen_fixed_number_08.mpirun=4.debug ...........................   Passed    2.64 sec
            Start  8288: mpi/renumber_cuthill_mckee_02.mpirun=4.debug
 9993/10731 Test  #8168: mpi/parallel_vector_back_interpolate_02.mpirun=4.debug ..........................   Passed   20.95 sec
            Start  8289: mpi/renumber_cuthill_mckee_02.mpirun=4.release
 9994/10731 Test  #8271: mpi/refine_and_coarsen_fixed_number_08.mpirun=4.release .........................   Passed    2.43 sec
            Start  8306: mpi/renumber_z_order_04.mpirun=4.debug
 9995/10731 Test  #8170: mpi/parallel_vector_interpolate.mpirun=4.debug ..................................   Passed   19.72 sec
            Start  8307: mpi/renumber_z_order_04.mpirun=4.release
 9996/10731 Test  #8287: mpi/renumber_cuthill_mckee.mpirun=4.release .....................................   Passed    2.51 sec
            Start  8308: mpi/renumber_z_order_05.mpirun=4.debug
 9997/10731 Test  #8286: mpi/renumber_cuthill_mckee.mpirun=4.debug .......................................   Passed    2.80 sec
            Start  8309: mpi/renumber_z_order_05.mpirun=4.release
 9998/10731 Test  #8307: mpi/renumber_z_order_04.mpirun=4.release ........................................   Passed   16.91 sec
            Start  8310: mpi/renumber_z_order_06.mpirun=4.debug
 9999/10731 Test  #8309: mpi/renumber_z_order_05.mpirun=4.release ........................................   Passed   17.07 sec
            Start  8311: mpi/renumber_z_order_06.mpirun=4.release
10000/10731 Test  #8306: mpi/renumber_z_order_04.mpirun=4.debug ..........................................   Passed   19.67 sec
            Start  8330: mpi/solution_transfer_05.mpirun=4.debug
10001/10731 Test  #8308: mpi/renumber_z_order_05.mpirun=4.debug ..........................................   Passed   19.93 sec
            Start  8331: mpi/solution_transfer_05.mpirun=4.release
10002/10731 Test  #8288: mpi/renumber_cuthill_mckee_02.mpirun=4.debug ....................................   Passed   24.09 sec
            Start  8356: mpi/tria_copy_triangulation.mpirun=4.debug
10003/10731 Test  #8331: mpi/solution_transfer_05.mpirun=4.release .......................................   Passed    2.62 sec
            Start  8357: mpi/tria_copy_triangulation.mpirun=4.release
10004/10731 Test  #8330: mpi/solution_transfer_05.mpirun=4.debug .........................................   Passed    3.18 sec
            Start  8394: mpi/tria_signals_06.mpirun=4.debug
10005/10731 Test  #8289: mpi/renumber_cuthill_mckee_02.mpirun=4.release ..................................   Passed   23.21 sec
            Start  8395: mpi/tria_signals_06.mpirun=4.release
10006/10731 Test  #8356: mpi/tria_copy_triangulation.mpirun=4.debug ......................................   Passed    2.63 sec
            Start  8498: mpi/trilinos_vector_ghosts_01.mpirun=4.debug
10007/10731 Test  #8357: mpi/tria_copy_triangulation.mpirun=4.release ....................................   Passed    2.54 sec
            Start  8499: mpi/trilinos_vector_ghosts_01.mpirun=4.release
10008/10731 Test  #8311: mpi/renumber_z_order_06.mpirun=4.release ........................................   Passed   17.29 sec
            Start  8585: multigrid/renumbering_05.mpirun=5.debug
10009/10731 Test  #8310: mpi/renumber_z_order_06.mpirun=4.debug ..........................................   Passed   20.05 sec
            Start  8586: multigrid/renumbering_05.mpirun=5.release
10010/10731 Test  #8499: mpi/trilinos_vector_ghosts_01.mpirun=4.release ..................................   Passed   16.68 sec
            Start  8673: multigrid/transfer_matrix_free_02.mpirun=5.debug
10011/10731 Test  #8395: mpi/tria_signals_06.mpirun=4.release ............................................   Passed   19.60 sec
            Start  8674: multigrid/transfer_matrix_free_02.mpirun=5.release
10012/10731 Test  #8674: multigrid/transfer_matrix_free_02.mpirun=5.release ..............................   Passed    2.65 sec
            Start  8675: multigrid/transfer_matrix_free_02_block.mpirun=5.debug
10013/10731 Test  #8498: mpi/trilinos_vector_ghosts_01.mpirun=4.debug ....................................   Passed   20.72 sec
            Start  8676: multigrid/transfer_matrix_free_02_block.mpirun=5.release
10014/10731 Test  #8586: multigrid/renumbering_05.mpirun=5.release .......................................   Passed   20.79 sec
            Start  8677: multigrid/transfer_matrix_free_02_block_02.mpirun=5.debug
10015/10731 Test  #8585: multigrid/renumbering_05.mpirun=5.debug .........................................   Passed   23.14 sec
            Start  8678: multigrid/transfer_matrix_free_02_block_02.mpirun=5.release
10016/10731 Test  #8673: multigrid/transfer_matrix_free_02.mpirun=5.debug ................................   Passed   21.58 sec
            Start  8679: multigrid/transfer_matrix_free_03.mpirun=5.debug
10017/10731 Test  #8676: multigrid/transfer_matrix_free_02_block.mpirun=5.release ........................   Passed   23.30 sec
            Start  8680: multigrid/transfer_matrix_free_03.mpirun=5.release
10018/10731 Test  #8678: multigrid/transfer_matrix_free_02_block_02.mpirun=5.release .....................   Passed   26.77 sec
            Start  8689: multigrid/transfer_matrix_free_05.mpirun=5.debug
10019/10731 Test  #8394: mpi/tria_signals_06.mpirun=4.debug ..............................................   Passed   66.50 sec
            Start  8690: multigrid/transfer_matrix_free_05.mpirun=5.release
10020/10731 Test  #8675: multigrid/transfer_matrix_free_02_block.mpirun=5.debug ..........................   Passed   45.85 sec
            Start  8695: multigrid/transfer_matrix_free_07.mpirun=5.debug
10021/10731 Test  #8690: multigrid/transfer_matrix_free_05.mpirun=5.release ..............................   Passed    8.97 sec
            Start  8696: multigrid/transfer_matrix_free_07.mpirun=5.release
10022/10731 Test  #8680: multigrid/transfer_matrix_free_03.mpirun=5.release ..............................   Passed   45.39 sec
            Start  9101: numerics/project_parallel_q_01.mpirun=4.debug
10023/10731 Test  #8679: multigrid/transfer_matrix_free_03.mpirun=5.debug ................................   Passed   54.40 sec
            Start  9102: numerics/project_parallel_q_01.mpirun=4.release
10024/10731 Test  #9101: numerics/project_parallel_q_01.mpirun=4.debug ...................................   Passed    5.65 sec
            Start  9103: numerics/project_parallel_q_02.mpirun=4.debug
10025/10731 Test  #9102: numerics/project_parallel_q_01.mpirun=4.release .................................   Passed    2.09 sec
            Start  9104: numerics/project_parallel_q_02.mpirun=4.release
10026/10731 Test  #8689: multigrid/transfer_matrix_free_05.mpirun=5.debug ................................   Passed   37.37 sec
            Start  9105: numerics/project_parallel_q_03.mpirun=4.debug
10027/10731 Test  #8696: multigrid/transfer_matrix_free_07.mpirun=5.release ..............................   Passed   26.67 sec
            Start  9106: numerics/project_parallel_q_03.mpirun=4.release
10028/10731 Test  #8677: multigrid/transfer_matrix_free_02_block_02.mpirun=5.debug .......................   Passed   70.29 sec
            Start  9107: numerics/project_parallel_q_04.mpirun=4.debug
10029/10731 Test  #9104: numerics/project_parallel_q_02.mpirun=4.release .................................   Passed   18.88 sec
            Start  9108: numerics/project_parallel_q_04.mpirun=4.release
10030/10731 Test  #8695: multigrid/transfer_matrix_free_07.mpirun=5.debug ................................   Passed   48.55 sec
            Start  9109: numerics/project_parallel_q_05.mpirun=4.debug
10031/10731 Test  #9103: numerics/project_parallel_q_02.mpirun=4.debug ...................................   Passed   21.68 sec
            Start  9110: numerics/project_parallel_q_05.mpirun=4.release
10032/10731 Test  #9106: numerics/project_parallel_q_03.mpirun=4.release .................................   Passed   17.97 sec
            Start 10198: trilinos/assemble_matrix_parallel_02.mpirun=4.debug
10033/10731 Test  #9105: numerics/project_parallel_q_03.mpirun=4.debug ...................................   Passed   22.50 sec
            Start 10199: trilinos/assemble_matrix_parallel_02.mpirun=4.release
10034/10731 Test #10199: trilinos/assemble_matrix_parallel_02.mpirun=4.release ...........................   Passed    1.25 sec
            Start 10200: trilinos/assemble_matrix_parallel_03.mpirun=4.debug
10035/10731 Test  #9107: numerics/project_parallel_q_04.mpirun=4.debug ...................................   Passed   19.75 sec
            Start 10201: trilinos/assemble_matrix_parallel_03.mpirun=4.release
10036/10731 Test #10198: trilinos/assemble_matrix_parallel_02.mpirun=4.debug .............................   Passed    5.84 sec
            Start 10202: trilinos/assemble_matrix_parallel_04.mpirun=4.debug
10037/10731 Test  #9108: numerics/project_parallel_q_04.mpirun=4.release .................................   Passed   17.74 sec
            Start 10203: trilinos/assemble_matrix_parallel_04.mpirun=4.release
10038/10731 Test  #9110: numerics/project_parallel_q_05.mpirun=4.release .................................   Passed   18.43 sec
            Start 10206: trilinos/assemble_matrix_parallel_05.mpirun=4.debug
10039/10731 Test  #9109: numerics/project_parallel_q_05.mpirun=4.debug ...................................   Passed   20.11 sec
            Start 10207: trilinos/assemble_matrix_parallel_05.mpirun=4.release
10040/10731 Test #10207: trilinos/assemble_matrix_parallel_05.mpirun=4.release ...........................   Passed    1.38 sec
            Start 10208: trilinos/assemble_matrix_parallel_06.mpirun=4.debug
10041/10731 Test #10206: trilinos/assemble_matrix_parallel_05.mpirun=4.debug .............................   Passed    5.84 sec
            Start 10209: trilinos/assemble_matrix_parallel_06.mpirun=4.release
10042/10731 Test #10201: trilinos/assemble_matrix_parallel_03.mpirun=4.release ...........................   Passed   21.86 sec
            Start 10210: trilinos/assemble_matrix_parallel_07.mpirun=4.debug
10043/10731 Test #10200: trilinos/assemble_matrix_parallel_03.mpirun=4.debug .............................   Passed   26.57 sec
            Start 10211: trilinos/assemble_matrix_parallel_07.mpirun=4.release
10044/10731 Test #10202: trilinos/assemble_matrix_parallel_04.mpirun=4.debug .............................   Passed   29.23 sec
            Start 10234: trilinos/copy_to_dealvec_block.mpirun=4.debug
10045/10731 Test #10203: trilinos/assemble_matrix_parallel_04.mpirun=4.release ...........................   Passed   25.17 sec
            Start 10235: trilinos/copy_to_dealvec_block.mpirun=4.release
10046/10731 Test #10234: trilinos/copy_to_dealvec_block.mpirun=4.debug ...................................   Passed   11.82 sec
            Start 10446: trilinos/trilinos_sparsity_pattern_02.mpirun=4.debug
10047/10731 Test #10208: trilinos/assemble_matrix_parallel_06.mpirun=4.debug .............................   Passed   29.49 sec
            Start 10447: trilinos/trilinos_sparsity_pattern_02.mpirun=4.release
10048/10731 Test #10209: trilinos/assemble_matrix_parallel_06.mpirun=4.release ...........................   Passed   25.52 sec
            Start 10448: trilinos/trilinos_sparsity_pattern_03.mpirun=4.debug
10049/10731 Test #10235: trilinos/copy_to_dealvec_block.mpirun=4.release .................................   Passed   10.09 sec
            Start 10449: trilinos/trilinos_sparsity_pattern_03.mpirun=4.release
10050/10731 Test #10211: trilinos/assemble_matrix_parallel_07.mpirun=4.release ...........................   Passed   22.16 sec
10051/10731 Test #10210: trilinos/assemble_matrix_parallel_07.mpirun=4.debug .............................   Passed   30.78 sec
            Start  1516: base/mpi_all_gather_01.mpirun=6.debug
10052/10731 Test #10449: trilinos/trilinos_sparsity_pattern_03.mpirun=4.release ..........................   Passed    9.12 sec
            Start  1517: base/mpi_all_gather_01.mpirun=6.release
10053/10731 Test #10448: trilinos/trilinos_sparsity_pattern_03.mpirun=4.debug ............................   Passed   11.08 sec
10054/10731 Test  #1516: base/mpi_all_gather_01.mpirun=6.debug ...........................................   Passed    2.04 sec
            Start  7791: mpi/mg_04.mpirun=10.debug
10055/10731 Test  #1517: base/mpi_all_gather_01.mpirun=6.release .........................................   Passed    1.96 sec
            Start  1536: base/mpi_gather_01.mpirun=6.debug
10056/10731 Test  #7791: mpi/mg_04.mpirun=10.debug .......................................................   Passed    2.62 sec
            Start  7792: mpi/mg_04.mpirun=10.release
10057/10731 Test  #1536: base/mpi_gather_01.mpirun=6.debug ...............................................   Passed    2.12 sec
            Start  7793: mpi/mg_04.mpirun=2.debug
10058/10731 Test #10447: trilinos/trilinos_sparsity_pattern_02.mpirun=4.release ..........................   Passed   16.31 sec
            Start  1537: base/mpi_gather_01.mpirun=6.release
10059/10731 Test  #7792: mpi/mg_04.mpirun=10.release .....................................................   Passed    2.54 sec
            Start  8525: multigrid/distribute_bug_01.mpirun=13.debug
10060/10731 Test  #7793: mpi/mg_04.mpirun=2.debug ........................................................   Passed    2.61 sec
            Start  7794: mpi/mg_04.mpirun=2.release
10061/10731 Test #10446: trilinos/trilinos_sparsity_pattern_02.mpirun=4.debug ............................   Passed   18.89 sec
            Start  7795: mpi/mg_04.mpirun=4.debug
10062/10731 Test  #1537: base/mpi_gather_01.mpirun=6.release .............................................   Passed    1.96 sec
            Start  1554: base/mpi_some_to_some_01.mpirun=6.debug
10063/10731 Test  #7794: mpi/mg_04.mpirun=2.release ......................................................   Passed    2.44 sec
10064/10731 Test  #1554: base/mpi_some_to_some_01.mpirun=6.debug .........................................   Passed    2.02 sec
            Start  1555: base/mpi_some_to_some_01.mpirun=6.release
10065/10731 Test  #7795: mpi/mg_04.mpirun=4.debug ........................................................   Passed    2.52 sec
            Start  4676: fullydistributed_grids/copy_serial_tria_grouped_01.mpirun=7.debug
10066/10731 Test  #1555: base/mpi_some_to_some_01.mpirun=6.release .......................................   Passed    1.95 sec
            Start  4677: fullydistributed_grids/copy_serial_tria_grouped_01.mpirun=7.release
10067/10731 Test  #8525: multigrid/distribute_bug_01.mpirun=13.debug .....................................   Passed   21.33 sec
            Start  8526: multigrid/distribute_bug_01.mpirun=13.release
10068/10731 Test  #8526: multigrid/distribute_bug_01.mpirun=13.release ...................................   Passed   16.85 sec
            Start  7961: mpi/p4est_3d_refine_04.mpirun=10.debug
            Start  8527: multigrid/distribute_bug_01.mpirun=2.debug
10069/10731 Test  #8527: multigrid/distribute_bug_01.mpirun=2.debug ......................................   Passed    3.20 sec
            Start  8528: multigrid/distribute_bug_01.mpirun=2.release
10070/10731 Test  #8528: multigrid/distribute_bug_01.mpirun=2.release ....................................   Passed    0.73 sec
10071/10731 Test  #7961: mpi/p4est_3d_refine_04.mpirun=10.debug ..........................................   Passed    5.49 sec
            Start  7962: mpi/p4est_3d_refine_04.mpirun=10.release
10072/10731 Test  #7962: mpi/p4est_3d_refine_04.mpirun=10.release ........................................   Passed    2.57 sec
            Start  8204: mpi/point_to_point_pattern_01.mpirun=10.debug
10073/10731 Test  #8204: mpi/point_to_point_pattern_01.mpirun=10.debug ...................................   Passed   11.94 sec
            Start  8205: mpi/point_to_point_pattern_01.mpirun=10.release
            Start  8206: mpi/point_to_point_pattern_01.mpirun=3.debug
10074/10731 Test  #8206: mpi/point_to_point_pattern_01.mpirun=3.debug ....................................   Passed    2.50 sec
10075/10731 Test  #4677: fullydistributed_grids/copy_serial_tria_grouped_01.mpirun=7.release .............   Passed   60.70 sec
            Start  4656: fullydistributed_grids/copy_serial_tria_05.mpirun=9.debug
10076/10731 Test  #4676: fullydistributed_grids/copy_serial_tria_grouped_01.mpirun=7.debug ...............   Passed   63.03 sec
            Start  6031: lac/diagonal_matrix_02.mpirun=7.debug
10077/10731 Test  #6031: lac/diagonal_matrix_02.mpirun=7.debug ...........................................   Passed    1.36 sec
            Start  6032: lac/diagonal_matrix_02.mpirun=7.release
10078/10731 Test  #8205: mpi/point_to_point_pattern_01.mpirun=10.release .................................   Passed   10.43 sec
            Start  8272: mpi/refinement_listener_01.mpirun=10.debug
10079/10731 Test  #6032: lac/diagonal_matrix_02.mpirun=7.release .........................................   Passed    1.11 sec
            Start  8207: mpi/point_to_point_pattern_01.mpirun=3.release
            Start  7796: mpi/mg_04.mpirun=4.release
10080/10731 Test  #8207: mpi/point_to_point_pattern_01.mpirun=3.release ..................................   Passed    2.42 sec
10081/10731 Test  #7796: mpi/mg_04.mpirun=4.release ......................................................   Passed    2.55 sec
            Start  6812: matrix_free/cell_categorization.mpirun=7.debug
10082/10731 Test  #6812: matrix_free/cell_categorization.mpirun=7.debug ..................................   Passed    1.48 sec
            Start  6813: matrix_free/cell_categorization.mpirun=7.release
10083/10731 Test  #6813: matrix_free/cell_categorization.mpirun=7.release ................................   Passed    1.11 sec
            Start  6818: matrix_free/cell_categorization_02.mpirun=7.debug
10084/10731 Test  #6818: matrix_free/cell_categorization_02.mpirun=7.debug ...............................   Passed   10.76 sec
            Start  6819: matrix_free/cell_categorization_02.mpirun=7.release
10085/10731 Test  #6819: matrix_free/cell_categorization_02.mpirun=7.release .............................   Passed    1.39 sec
            Start  6836: matrix_free/dg_pbc_01.mpirun=7.debug
10086/10731 Test  #6836: matrix_free/dg_pbc_01.mpirun=7.debug ............................................   Passed    1.28 sec
            Start  6837: matrix_free/dg_pbc_01.mpirun=7.release
10087/10731 Test  #4656: fullydistributed_grids/copy_serial_tria_05.mpirun=9.debug .......................   Passed   22.26 sec
            Start  4657: fullydistributed_grids/copy_serial_tria_05.mpirun=9.release
10088/10731 Test  #6837: matrix_free/dg_pbc_01.mpirun=7.release ..........................................   Passed    0.99 sec
            Start  6840: matrix_free/dg_pbc_02.mpirun=7.debug
10089/10731 Test  #8272: mpi/refinement_listener_01.mpirun=10.debug ......................................   Passed   21.48 sec
            Start  8273: mpi/refinement_listener_01.mpirun=10.release
10090/10731 Test  #6840: matrix_free/dg_pbc_02.mpirun=7.debug ............................................   Passed    1.94 sec
            Start  6841: matrix_free/dg_pbc_02.mpirun=7.release
10091/10731 Test  #6841: matrix_free/dg_pbc_02.mpirun=7.release ..........................................   Passed    1.02 sec
            Start  7161: matrix_free/parallel_multigrid.mpirun=7.debug
10092/10731 Test  #7161: matrix_free/parallel_multigrid.mpirun=7.debug ...................................   Passed   14.37 sec
            Start  7162: matrix_free/parallel_multigrid.mpirun=7.release
10093/10731 Test  #7162: matrix_free/parallel_multigrid.mpirun=7.release .................................   Passed    1.69 sec
            Start  7165: matrix_free/parallel_multigrid_02.mpirun=7.debug
10094/10731 Test  #8273: mpi/refinement_listener_01.mpirun=10.release ....................................   Passed   17.89 sec
            Start  8278: mpi/refinement_listener_02.mpirun=10.debug
10095/10731 Test  #4657: fullydistributed_grids/copy_serial_tria_05.mpirun=9.release .....................   Passed   20.11 sec
            Start  7166: matrix_free/parallel_multigrid_02.mpirun=7.release
10096/10731 Test  #7166: matrix_free/parallel_multigrid_02.mpirun=7.release ..............................   Passed    1.21 sec
            Start  7169: matrix_free/parallel_multigrid_adaptive_01.mpirun=7.debug
10097/10731 Test  #7165: matrix_free/parallel_multigrid_02.mpirun=7.debug ................................   Passed    4.03 sec
            Start  7170: matrix_free/parallel_multigrid_adaptive_01.mpirun=7.release
10098/10731 Test  #7170: matrix_free/parallel_multigrid_adaptive_01.mpirun=7.release .....................   Passed    2.17 sec
            Start  7173: matrix_free/parallel_multigrid_adaptive_02.mpirun=7.debug
10099/10731 Test  #8278: mpi/refinement_listener_02.mpirun=10.debug ......................................   Passed   25.64 sec
            Start  8279: mpi/refinement_listener_02.mpirun=10.release
10100/10731 Test  #7169: matrix_free/parallel_multigrid_adaptive_01.mpirun=7.debug .......................   Passed   27.21 sec
            Start  7174: matrix_free/parallel_multigrid_adaptive_02.mpirun=7.release
10101/10731 Test  #7174: matrix_free/parallel_multigrid_adaptive_02.mpirun=7.release .....................   Passed    2.59 sec
            Start  7191: matrix_free/parallel_multigrid_mf.mpirun=7.debug
10102/10731 Test  #8279: mpi/refinement_listener_02.mpirun=10.release ....................................   Passed   18.01 sec
            Start  8318: mpi/simple_mpi_01.mpirun=10.debug
10103/10731 Test  #7173: matrix_free/parallel_multigrid_adaptive_02.mpirun=7.debug .......................   Passed   40.42 sec
            Start  7192: matrix_free/parallel_multigrid_mf.mpirun=7.release
10104/10731 Test  #8318: mpi/simple_mpi_01.mpirun=10.debug ...............................................   Passed   12.20 sec
            Start  8319: mpi/simple_mpi_01.mpirun=10.release
            Start  8320: mpi/simple_mpi_01.mpirun=3.debug
10105/10731 Test  #8320: mpi/simple_mpi_01.mpirun=3.debug ................................................   Passed    2.47 sec
10106/10731 Test  #8319: mpi/simple_mpi_01.mpirun=10.release .............................................   Passed   10.18 sec
            Start  8346: mpi/tria_01.mpirun=10.debug
            Start  8321: mpi/simple_mpi_01.mpirun=3.release
10107/10731 Test  #8321: mpi/simple_mpi_01.mpirun=3.release ..............................................   Passed    2.45 sec
10108/10731 Test  #8346: mpi/tria_01.mpirun=10.debug .....................................................   Passed   19.63 sec
            Start  8347: mpi/tria_01.mpirun=10.release
            Start  8348: mpi/tria_01.mpirun=2.debug
10109/10731 Test  #8348: mpi/tria_01.mpirun=2.debug ......................................................   Passed    2.53 sec
10110/10731 Test  #7191: matrix_free/parallel_multigrid_mf.mpirun=7.debug ................................   Passed   57.31 sec
            Start  7293: mpi/attach_data_01.mpirun=8.debug
10111/10731 Test  #7293: mpi/attach_data_01.mpirun=8.debug ...............................................   Passed    2.62 sec
            Start  7294: mpi/attach_data_01.mpirun=8.release
10112/10731 Test  #7294: mpi/attach_data_01.mpirun=8.release .............................................   Passed    2.45 sec
            Start  7299: mpi/attach_data_02.mpirun=8.debug
10113/10731 Test  #7299: mpi/attach_data_02.mpirun=8.debug ...............................................   Passed    2.67 sec
            Start  7300: mpi/attach_data_02.mpirun=8.release
10114/10731 Test  #7300: mpi/attach_data_02.mpirun=8.release .............................................   Passed    2.51 sec
            Start  7307: mpi/cell_data_transfer_01.mpirun=8.debug
10115/10731 Test  #7307: mpi/cell_data_transfer_01.mpirun=8.debug ........................................   Passed    2.52 sec
            Start  7308: mpi/cell_data_transfer_01.mpirun=8.release
10116/10731 Test  #8347: mpi/tria_01.mpirun=10.release ...................................................   Passed   16.64 sec
            Start  8410: mpi/trilinos_distribute_01.mpirun=10.debug
10117/10731 Test  #7308: mpi/cell_data_transfer_01.mpirun=8.release ......................................   Passed    2.49 sec
            Start  8349: mpi/tria_01.mpirun=2.release
            Start  7543: mpi/derivative_approximation_02.mpirun=7.debug
10118/10731 Test  #8410: mpi/trilinos_distribute_01.mpirun=10.debug ......................................   Passed    2.47 sec
            Start  8411: mpi/trilinos_distribute_01.mpirun=10.release
10119/10731 Test  #8349: mpi/tria_01.mpirun=2.release ....................................................   Passed    2.48 sec
            Start  8412: mpi/trilinos_distribute_01.mpirun=2.debug
10120/10731 Test  #7543: mpi/derivative_approximation_02.mpirun=7.debug ..................................   Passed    2.69 sec
            Start  7544: mpi/derivative_approximation_02.mpirun=7.release
10121/10731 Test  #8411: mpi/trilinos_distribute_01.mpirun=10.release ....................................   Passed    2.47 sec
            Start  8418: mpi/trilinos_distribute_01_block.mpirun=10.debug
10122/10731 Test  #8412: mpi/trilinos_distribute_01.mpirun=2.debug .......................................   Passed    2.46 sec
            Start  8413: mpi/trilinos_distribute_01.mpirun=2.release
10123/10731 Test  #7544: mpi/derivative_approximation_02.mpirun=7.release ................................   Passed    2.54 sec
            Start  7631: mpi/has_hanging_nodes.mpirun=7.debug
10124/10731 Test  #7192: matrix_free/parallel_multigrid_mf.mpirun=7.release ..............................   Passed   63.75 sec
            Start  7632: mpi/has_hanging_nodes.mpirun=7.release
10125/10731 Test  #8418: mpi/trilinos_distribute_01_block.mpirun=10.debug ................................   Passed    2.78 sec
            Start  8419: mpi/trilinos_distribute_01_block.mpirun=10.release
10126/10731 Test  #8413: mpi/trilinos_distribute_01.mpirun=2.release .....................................   Passed    2.58 sec
            Start  8420: mpi/trilinos_distribute_01_block.mpirun=2.debug
10127/10731 Test  #7631: mpi/has_hanging_nodes.mpirun=7.debug ............................................   Passed    4.12 sec
            Start  7709: mpi/hp_unify_dof_indices_08.mpirun=7.debug
10128/10731 Test  #8419: mpi/trilinos_distribute_01_block.mpirun=10.release ..............................   Passed    3.23 sec
            Start  8426: mpi/trilinos_distribute_01_inhomogenous.mpirun=10.debug
10129/10731 Test  #7632: mpi/has_hanging_nodes.mpirun=7.release ..........................................   Passed    3.35 sec
            Start  8421: mpi/trilinos_distribute_01_block.mpirun=2.release
            Start  8208: mpi/point_to_point_pattern_01.mpirun=4.debug
10130/10731 Test  #8420: mpi/trilinos_distribute_01_block.mpirun=2.debug .................................   Passed    2.62 sec
10131/10731 Test  #8421: mpi/trilinos_distribute_01_block.mpirun=2.release ...............................   Passed    2.47 sec
            Start  8209: mpi/point_to_point_pattern_01.mpirun=4.release
10132/10731 Test  #8426: mpi/trilinos_distribute_01_inhomogenous.mpirun=10.debug .........................   Passed    2.70 sec
            Start  8427: mpi/trilinos_distribute_01_inhomogenous.mpirun=10.release
10133/10731 Test  #8208: mpi/point_to_point_pattern_01.mpirun=4.debug ....................................   Passed    2.62 sec
            Start  8428: mpi/trilinos_distribute_01_inhomogenous.mpirun=2.debug
10134/10731 Test  #8209: mpi/point_to_point_pattern_01.mpirun=4.release ..................................   Passed    2.54 sec
            Start  7710: mpi/hp_unify_dof_indices_08.mpirun=7.release
10135/10731 Test  #8428: mpi/trilinos_distribute_01_inhomogenous.mpirun=2.debug ..........................   Passed    2.78 sec
10136/10731 Test  #8427: mpi/trilinos_distribute_01_inhomogenous.mpirun=10.release .......................   Passed    2.87 sec
            Start  3087: distributed_grids/grid_tools_exchange_bounding_boxes_1.mpirun=12.debug
10137/10731 Test  #7710: mpi/hp_unify_dof_indices_08.mpirun=7.release ....................................   Passed    4.12 sec
            Start  8429: mpi/trilinos_distribute_01_inhomogenous.mpirun=2.release
            Start  8322: mpi/simple_mpi_01.mpirun=4.debug
10138/10731 Test  #8429: mpi/trilinos_distribute_01_inhomogenous.mpirun=2.release ........................   Passed    2.45 sec
10139/10731 Test  #8322: mpi/simple_mpi_01.mpirun=4.debug ................................................   Passed    2.51 sec
            Start  7799: mpi/mg_06.mpirun=7.debug
10140/10731 Test  #3087: distributed_grids/grid_tools_exchange_bounding_boxes_1.mpirun=12.debug ..........   Passed   18.24 sec
            Start  3088: distributed_grids/grid_tools_exchange_bounding_boxes_1.mpirun=12.release
10141/10731 Test  #7799: mpi/mg_06.mpirun=7.debug ........................................................   Passed   21.70 sec
            Start  3089: distributed_grids/grid_tools_exchange_bounding_boxes_1.mpirun=4.debug
10142/10731 Test  #3089: distributed_grids/grid_tools_exchange_bounding_boxes_1.mpirun=4.debug ...........   Passed    0.63 sec
            Start  7800: mpi/mg_06.mpirun=7.release
10143/10731 Test  #3088: distributed_grids/grid_tools_exchange_bounding_boxes_1.mpirun=12.release ........   Passed   15.37 sec
            Start  7008: matrix_free/matrix_vector_10.mpirun=10.debug
10144/10731 Test  #7709: mpi/hp_unify_dof_indices_08.mpirun=7.debug ......................................   Passed   39.19 sec
            Start  3090: distributed_grids/grid_tools_exchange_bounding_boxes_1.mpirun=4.release
            Start  8323: mpi/simple_mpi_01.mpirun=4.release
10145/10731 Test  #3090: distributed_grids/grid_tools_exchange_bounding_boxes_1.mpirun=4.release .........   Passed    0.57 sec
            Start  8350: mpi/tria_01.mpirun=4.debug
10146/10731 Test  #7008: matrix_free/matrix_vector_10.mpirun=10.debug ....................................   Passed    2.37 sec
            Start  7009: matrix_free/matrix_vector_10.mpirun=10.release
10147/10731 Test  #8323: mpi/simple_mpi_01.mpirun=4.release ..............................................   Passed    2.44 sec
            Start  7010: matrix_free/matrix_vector_10.mpirun=4.debug
10148/10731 Test  #8350: mpi/tria_01.mpirun=4.debug ......................................................   Passed    2.74 sec
            Start  8351: mpi/tria_01.mpirun=4.release
10149/10731 Test  #7009: matrix_free/matrix_vector_10.mpirun=10.release ..................................   Passed    1.58 sec
            Start  7012: matrix_free/matrix_vector_11.mpirun=10.debug
10150/10731 Test  #7010: matrix_free/matrix_vector_10.mpirun=4.debug .....................................   Passed    2.96 sec
            Start  7011: matrix_free/matrix_vector_10.mpirun=4.release
10151/10731 Test  #8351: mpi/tria_01.mpirun=4.release ....................................................   Passed    2.58 sec
            Start  8414: mpi/trilinos_distribute_01.mpirun=4.debug
10152/10731 Test  #7011: matrix_free/matrix_vector_10.mpirun=4.release ...................................   Passed    1.03 sec
            Start  8415: mpi/trilinos_distribute_01.mpirun=4.release
10153/10731 Test  #8414: mpi/trilinos_distribute_01.mpirun=4.debug .......................................   Passed    2.50 sec
            Start  8422: mpi/trilinos_distribute_01_block.mpirun=4.debug
10154/10731 Test  #8415: mpi/trilinos_distribute_01.mpirun=4.release .....................................   Passed    2.39 sec
            Start  8423: mpi/trilinos_distribute_01_block.mpirun=4.release
10155/10731 Test  #8422: mpi/trilinos_distribute_01_block.mpirun=4.debug .................................   Passed    2.54 sec
            Start  8430: mpi/trilinos_distribute_01_inhomogenous.mpirun=4.debug
10156/10731 Test  #8423: mpi/trilinos_distribute_01_block.mpirun=4.release ...............................   Passed    2.43 sec
            Start  8431: mpi/trilinos_distribute_01_inhomogenous.mpirun=4.release
10157/10731 Test  #7800: mpi/mg_06.mpirun=7.release ......................................................   Passed   17.70 sec
            Start  7803: mpi/mg_ghost_dofs_periodic_01.mpirun=7.debug
10158/10731 Test  #8430: mpi/trilinos_distribute_01_inhomogenous.mpirun=4.debug ..........................   Passed    2.51 sec
10159/10731 Test  #8431: mpi/trilinos_distribute_01_inhomogenous.mpirun=4.release ........................   Passed    2.43 sec
            Start  7311: mpi/cell_data_transfer_02.mpirun=8.debug
10160/10731 Test  #7803: mpi/mg_ghost_dofs_periodic_01.mpirun=7.debug ....................................   Passed    2.91 sec
            Start  7804: mpi/mg_ghost_dofs_periodic_01.mpirun=7.release
10161/10731 Test  #7311: mpi/cell_data_transfer_02.mpirun=8.debug ........................................   Passed    2.71 sec
            Start  7312: mpi/cell_data_transfer_02.mpirun=8.release
10162/10731 Test  #7804: mpi/mg_ghost_dofs_periodic_01.mpirun=7.release ..................................   Passed    2.66 sec
            Start  7815: mpi/mg_ghost_dofs_periodic_06.mpirun=7.debug
10163/10731 Test  #7312: mpi/cell_data_transfer_02.mpirun=8.release ......................................   Passed    2.48 sec
            Start  7315: mpi/cell_data_transfer_03.mpirun=8.debug
10164/10731 Test  #7315: mpi/cell_data_transfer_03.mpirun=8.debug ........................................   Passed    2.72 sec
            Start  7316: mpi/cell_data_transfer_03.mpirun=8.release
10165/10731 Test  #7316: mpi/cell_data_transfer_03.mpirun=8.release ......................................   Passed    2.43 sec
            Start  7549: mpi/distort_random_01.mpirun=8.debug
10166/10731 Test  #7549: mpi/distort_random_01.mpirun=8.debug ............................................   Passed    2.91 sec
            Start  7550: mpi/distort_random_01.mpirun=8.release
10167/10731 Test  #7550: mpi/distort_random_01.mpirun=8.release ..........................................   Passed    2.77 sec
            Start  7555: mpi/distort_random_02.mpirun=8.debug
10168/10731 Test  #7555: mpi/distort_random_02.mpirun=8.debug ............................................   Passed    3.27 sec
            Start  7556: mpi/distort_random_02.mpirun=8.release
10169/10731 Test  #7556: mpi/distort_random_02.mpirun=8.release ..........................................   Passed    4.00 sec
            Start  7635: mpi/hp_active_fe_indices_transfer_01.mpirun=8.debug
10170/10731 Test  #7815: mpi/mg_ghost_dofs_periodic_06.mpirun=7.debug ....................................   Passed   21.07 sec
            Start  7816: mpi/mg_ghost_dofs_periodic_06.mpirun=7.release
10171/10731 Test  #7635: mpi/hp_active_fe_indices_transfer_01.mpirun=8.debug .............................   Passed    3.23 sec
            Start  7636: mpi/hp_active_fe_indices_transfer_01.mpirun=8.release
10172/10731 Test  #7012: matrix_free/matrix_vector_11.mpirun=10.debug ....................................   Passed   37.07 sec
            Start  7013: matrix_free/matrix_vector_11.mpirun=10.release
10173/10731 Test  #7636: mpi/hp_active_fe_indices_transfer_01.mpirun=8.release ...........................   Passed    2.52 sec
            Start  7014: matrix_free/matrix_vector_11.mpirun=4.debug
10174/10731 Test  #7014: matrix_free/matrix_vector_11.mpirun=4.debug .....................................   Passed    5.67 sec
            Start  7639: mpi/hp_active_fe_indices_transfer_02.mpirun=8.debug
10175/10731 Test  #7639: mpi/hp_active_fe_indices_transfer_02.mpirun=8.debug .............................   Passed    2.93 sec
            Start  7640: mpi/hp_active_fe_indices_transfer_02.mpirun=8.release
10176/10731 Test  #7640: mpi/hp_active_fe_indices_transfer_02.mpirun=8.release ...........................   Passed    2.50 sec
            Start  7643: mpi/hp_active_fe_indices_transfer_03.mpirun=8.debug
10177/10731 Test  #7643: mpi/hp_active_fe_indices_transfer_03.mpirun=8.debug .............................   Passed    2.70 sec
            Start  7644: mpi/hp_active_fe_indices_transfer_03.mpirun=8.release
10178/10731 Test  #7816: mpi/mg_ghost_dofs_periodic_06.mpirun=7.release ..................................   Passed   17.43 sec
            Start  7829: mpi/muelu_periodicity.mpirun=7.debug
10179/10731 Test  #7644: mpi/hp_active_fe_indices_transfer_03.mpirun=8.release ...........................   Passed    2.54 sec
            Start  7830: mpi/muelu_periodicity.mpirun=7.release
10180/10731 Test  #7829: mpi/muelu_periodicity.mpirun=7.debug ............................................   Passed    3.77 sec
            Start  7839: mpi/no_flux_constraints.mpirun=9.debug
10181/10731 Test  #7830: mpi/muelu_periodicity.mpirun=7.release ..........................................   Passed    3.05 sec
            Start  8184: mpi/periodicity_02.mpirun=7.debug
10182/10731 Test  #8184: mpi/periodicity_02.mpirun=7.debug ...............................................   Passed    3.59 sec
            Start  8185: mpi/periodicity_02.mpirun=7.release
10183/10731 Test  #8185: mpi/periodicity_02.mpirun=7.release .............................................   Passed    2.85 sec
            Start  8192: mpi/periodicity_04.mpirun=7.debug
10184/10731 Test  #7839: mpi/no_flux_constraints.mpirun=9.debug ..........................................   Passed   32.08 sec
            Start  7840: mpi/no_flux_constraints.mpirun=9.release
10185/10731 Test  #7013: matrix_free/matrix_vector_11.mpirun=10.release ..................................   Passed   53.48 sec
            Start  7018: matrix_free/matrix_vector_12.mpirun=10.debug
10186/10731 Test  #7018: matrix_free/matrix_vector_12.mpirun=10.debug ....................................   Passed   16.09 sec
            Start  7019: matrix_free/matrix_vector_12.mpirun=10.release
10187/10731 Test  #7840: mpi/no_flux_constraints.mpirun=9.release ........................................   Passed   18.80 sec
            Start  7015: matrix_free/matrix_vector_11.mpirun=4.release
            Start  7020: matrix_free/matrix_vector_12.mpirun=3.debug
10188/10731 Test  #8192: mpi/periodicity_04.mpirun=7.debug ...............................................   Passed   49.22 sec
            Start  7843: mpi/no_flux_constraints_02.mpirun=9.debug
10189/10731 Test  #7019: matrix_free/matrix_vector_12.mpirun=10.release ..................................   Passed    7.68 sec
            Start  7231: matrix_free/step-48.mpirun=10.debug
10190/10731 Test  #7015: matrix_free/matrix_vector_11.mpirun=4.release ...................................   Passed    6.99 sec
            Start  7021: matrix_free/matrix_vector_12.mpirun=3.release
10191/10731 Test  #7020: matrix_free/matrix_vector_12.mpirun=3.debug .....................................   Passed    7.69 sec
10192/10731 Test  #7021: matrix_free/matrix_vector_12.mpirun=3.release ...................................   Passed    1.18 sec
            Start  8193: mpi/periodicity_04.mpirun=7.release
10193/10731 Test  #7231: matrix_free/step-48.mpirun=10.debug .............................................   Passed    2.88 sec
            Start  7232: matrix_free/step-48.mpirun=10.release
10194/10731 Test  #7843: mpi/no_flux_constraints_02.mpirun=9.debug .......................................   Passed   11.49 sec
            Start  7233: matrix_free/step-48.mpirun=4.debug
10195/10731 Test  #7232: matrix_free/step-48.mpirun=10.release ...........................................   Passed    8.24 sec
            Start  7340: mpi/collective_01.mpirun=10.debug
            Start  7234: matrix_free/step-48.mpirun=4.release
10196/10731 Test  #8193: mpi/periodicity_04.mpirun=7.release .............................................   Passed    9.91 sec
            Start  8214: mpi/point_value_01.mpirun=6.debug
10197/10731 Test  #7234: matrix_free/step-48.mpirun=4.release ............................................   Passed    1.01 sec
10198/10731 Test  #7233: matrix_free/step-48.mpirun=4.debug ..............................................   Passed    2.35 sec
            Start  7844: mpi/no_flux_constraints_02.mpirun=9.release
10199/10731 Test  #7340: mpi/collective_01.mpirun=10.debug ...............................................   Passed    2.58 sec
            Start  7341: mpi/collective_01.mpirun=10.release
10200/10731 Test  #8214: mpi/point_value_01.mpirun=6.debug ...............................................   Passed    2.63 sec
            Start  7342: mpi/collective_01.mpirun=4.debug
10201/10731 Test  #7342: mpi/collective_01.mpirun=4.debug ................................................   Passed    2.49 sec
            Start  8215: mpi/point_value_01.mpirun=6.release
10202/10731 Test  #7341: mpi/collective_01.mpirun=10.release .............................................   Passed    2.59 sec
            Start  7346: mpi/collective_02.mpirun=10.debug
10203/10731 Test  #7844: mpi/no_flux_constraints_02.mpirun=9.release .....................................   Passed    3.78 sec
            Start  7343: mpi/collective_01.mpirun=4.release
10204/10731 Test  #8215: mpi/point_value_01.mpirun=6.release .............................................   Passed    2.51 sec
            Start  7347: mpi/collective_02.mpirun=10.release
10205/10731 Test  #7346: mpi/collective_02.mpirun=10.debug ...............................................   Passed    2.52 sec
            Start  7352: mpi/collective_02_array.mpirun=10.debug
10206/10731 Test  #7343: mpi/collective_01.mpirun=4.release ..............................................   Passed    2.39 sec
            Start  7348: mpi/collective_02.mpirun=4.debug
10207/10731 Test  #7347: mpi/collective_02.mpirun=10.release .............................................   Passed    2.58 sec
            Start  7353: mpi/collective_02_array.mpirun=10.release
10208/10731 Test  #7352: mpi/collective_02_array.mpirun=10.debug .........................................   Passed    2.63 sec
            Start  7358: mpi/collective_02_array_in_place.mpirun=10.debug
10209/10731 Test  #7348: mpi/collective_02.mpirun=4.debug ................................................   Passed    2.44 sec
            Start  7349: mpi/collective_02.mpirun=4.release
10210/10731 Test  #7353: mpi/collective_02_array.mpirun=10.release .......................................   Passed    2.54 sec
            Start  7359: mpi/collective_02_array_in_place.mpirun=10.release
10211/10731 Test  #7358: mpi/collective_02_array_in_place.mpirun=10.debug ................................   Passed    2.60 sec
            Start  7372: mpi/collective_02_vector.mpirun=10.debug
10212/10731 Test  #7349: mpi/collective_02.mpirun=4.release ..............................................   Passed    2.33 sec
            Start  7354: mpi/collective_02_array.mpirun=4.debug
10213/10731 Test  #7359: mpi/collective_02_array_in_place.mpirun=10.release ..............................   Passed    2.60 sec
            Start  7373: mpi/collective_02_vector.mpirun=10.release
10214/10731 Test  #7372: mpi/collective_02_vector.mpirun=10.debug ........................................   Passed    2.58 sec
            Start  7378: mpi/collective_02_vector_in_place.mpirun=10.debug
10215/10731 Test  #7354: mpi/collective_02_array.mpirun=4.debug ..........................................   Passed    2.52 sec
            Start  7355: mpi/collective_02_array.mpirun=4.release
10216/10731 Test  #7373: mpi/collective_02_vector.mpirun=10.release ......................................   Passed    2.52 sec
            Start  7379: mpi/collective_02_vector_in_place.mpirun=10.release
10217/10731 Test  #7378: mpi/collective_02_vector_in_place.mpirun=10.debug ...............................   Passed    2.70 sec
            Start  7384: mpi/collective_full_matrix.mpirun=10.debug
10218/10731 Test  #7355: mpi/collective_02_array.mpirun=4.release ........................................   Passed    2.52 sec
            Start  7360: mpi/collective_02_array_in_place.mpirun=4.debug
10219/10731 Test  #7379: mpi/collective_02_vector_in_place.mpirun=10.release .............................   Passed    2.54 sec
            Start  7385: mpi/collective_full_matrix.mpirun=10.release
10220/10731 Test  #7360: mpi/collective_02_array_in_place.mpirun=4.debug .................................   Passed    2.56 sec
            Start  7361: mpi/collective_02_array_in_place.mpirun=4.release
10221/10731 Test  #7384: mpi/collective_full_matrix.mpirun=10.debug ......................................   Passed    2.63 sec
            Start  7394: mpi/collective_max.mpirun=10.debug
10222/10731 Test  #7385: mpi/collective_full_matrix.mpirun=10.release ....................................   Passed    2.51 sec
            Start  7395: mpi/collective_max.mpirun=10.release
10223/10731 Test  #7361: mpi/collective_02_array_in_place.mpirun=4.release ...............................   Passed    2.49 sec
            Start  7374: mpi/collective_02_vector.mpirun=4.debug
10224/10731 Test  #7394: mpi/collective_max.mpirun=10.debug ..............................................   Passed    2.57 sec
            Start  7400: mpi/collective_max_array.mpirun=10.debug
10225/10731 Test  #7395: mpi/collective_max.mpirun=10.release ............................................   Passed    2.43 sec
            Start  7401: mpi/collective_max_array.mpirun=10.release
10226/10731 Test  #7374: mpi/collective_02_vector.mpirun=4.debug .........................................   Passed    2.59 sec
            Start  7375: mpi/collective_02_vector.mpirun=4.release
10227/10731 Test  #7400: mpi/collective_max_array.mpirun=10.debug ........................................   Passed    2.64 sec
            Start  7406: mpi/collective_max_array_in_place.mpirun=10.debug
10228/10731 Test  #7401: mpi/collective_max_array.mpirun=10.release ......................................   Passed    2.56 sec
            Start  7407: mpi/collective_max_array_in_place.mpirun=10.release
10229/10731 Test  #7375: mpi/collective_02_vector.mpirun=4.release .......................................   Passed    2.37 sec
            Start  7380: mpi/collective_02_vector_in_place.mpirun=4.debug
10230/10731 Test  #7406: mpi/collective_max_array_in_place.mpirun=10.debug ...............................   Passed    2.51 sec
            Start  7412: mpi/collective_max_vector.mpirun=10.debug
10231/10731 Test  #7407: mpi/collective_max_array_in_place.mpirun=10.release .............................   Passed    2.51 sec
            Start  7413: mpi/collective_max_vector.mpirun=10.release
10232/10731 Test  #7380: mpi/collective_02_vector_in_place.mpirun=4.debug ................................   Passed    2.49 sec
            Start  7381: mpi/collective_02_vector_in_place.mpirun=4.release
10233/10731 Test  #7412: mpi/collective_max_vector.mpirun=10.debug .......................................   Passed    2.53 sec
            Start  7418: mpi/collective_max_vector_in_place.mpirun=10.debug
10234/10731 Test  #7413: mpi/collective_max_vector.mpirun=10.release .....................................   Passed    2.44 sec
            Start  7419: mpi/collective_max_vector_in_place.mpirun=10.release
10235/10731 Test  #7381: mpi/collective_02_vector_in_place.mpirun=4.release ..............................   Passed    2.42 sec
            Start  7386: mpi/collective_full_matrix.mpirun=3.debug
            Start  7387: mpi/collective_full_matrix.mpirun=3.release
10236/10731 Test  #7418: mpi/collective_max_vector_in_place.mpirun=10.debug ..............................   Passed    2.58 sec
            Start  7426: mpi/collective_min.mpirun=10.debug
10237/10731 Test  #7419: mpi/collective_max_vector_in_place.mpirun=10.release ............................   Passed    2.49 sec
            Start  7427: mpi/collective_min.mpirun=10.release
10238/10731 Test  #7387: mpi/collective_full_matrix.mpirun=3.release .....................................   Passed    2.40 sec
10239/10731 Test  #7386: mpi/collective_full_matrix.mpirun=3.debug .......................................   Passed    2.52 sec
            Start  7396: mpi/collective_max.mpirun=4.debug
10240/10731 Test  #7426: mpi/collective_min.mpirun=10.debug ..............................................   Passed    2.54 sec
            Start  7432: mpi/collective_min_array.mpirun=10.debug
10241/10731 Test  #7427: mpi/collective_min.mpirun=10.release ............................................   Passed    2.41 sec
            Start  7433: mpi/collective_min_array.mpirun=10.release
10242/10731 Test  #7396: mpi/collective_max.mpirun=4.debug ...............................................   Passed    2.56 sec
            Start  7397: mpi/collective_max.mpirun=4.release
10243/10731 Test  #7432: mpi/collective_min_array.mpirun=10.debug ........................................   Passed    2.56 sec
            Start  7438: mpi/collective_min_array_in_place.mpirun=10.debug
10244/10731 Test  #7433: mpi/collective_min_array.mpirun=10.release ......................................   Passed    2.47 sec
            Start  7439: mpi/collective_min_array_in_place.mpirun=10.release
10245/10731 Test  #7397: mpi/collective_max.mpirun=4.release .............................................   Passed    2.43 sec
            Start  7402: mpi/collective_max_array.mpirun=4.debug
10246/10731 Test  #7438: mpi/collective_min_array_in_place.mpirun=10.debug ...............................   Passed    2.48 sec
            Start  7444: mpi/collective_min_vector.mpirun=10.debug
10247/10731 Test  #7439: mpi/collective_min_array_in_place.mpirun=10.release .............................   Passed    2.48 sec
            Start  7445: mpi/collective_min_vector.mpirun=10.release
10248/10731 Test  #7402: mpi/collective_max_array.mpirun=4.debug .........................................   Passed    2.46 sec
            Start  7403: mpi/collective_max_array.mpirun=4.release
10249/10731 Test  #7444: mpi/collective_min_vector.mpirun=10.debug .......................................   Passed    2.56 sec
            Start  7450: mpi/collective_min_vector_in_place.mpirun=10.debug
10250/10731 Test  #7445: mpi/collective_min_vector.mpirun=10.release .....................................   Passed    2.44 sec
            Start  7451: mpi/collective_min_vector_in_place.mpirun=10.release
10251/10731 Test  #7403: mpi/collective_max_array.mpirun=4.release .......................................   Passed    2.42 sec
            Start  7408: mpi/collective_max_array_in_place.mpirun=4.debug
10252/10731 Test  #7450: mpi/collective_min_vector_in_place.mpirun=10.debug ..............................   Passed    2.46 sec
            Start  7460: mpi/collective_tensor.mpirun=10.debug
10253/10731 Test  #7451: mpi/collective_min_vector_in_place.mpirun=10.release ............................   Passed    2.50 sec
            Start  7461: mpi/collective_tensor.mpirun=10.release
10254/10731 Test  #7408: mpi/collective_max_array_in_place.mpirun=4.debug ................................   Passed    2.58 sec
            Start  7409: mpi/collective_max_array_in_place.mpirun=4.release
10255/10731 Test  #7460: mpi/collective_tensor.mpirun=10.debug ...........................................   Passed    2.58 sec
            Start  7486: mpi/compute_mean_value.mpirun=10.debug
10256/10731 Test  #7461: mpi/collective_tensor.mpirun=10.release .........................................   Passed    2.46 sec
            Start  7487: mpi/compute_mean_value.mpirun=10.release
10257/10731 Test  #7409: mpi/collective_max_array_in_place.mpirun=4.release ..............................   Passed    2.42 sec
            Start  7414: mpi/collective_max_vector.mpirun=4.debug
10258/10731 Test  #7414: mpi/collective_max_vector.mpirun=4.debug ........................................   Passed    2.53 sec
            Start  7415: mpi/collective_max_vector.mpirun=4.release
10259/10731 Test  #7415: mpi/collective_max_vector.mpirun=4.release ......................................   Passed    2.41 sec
            Start  7420: mpi/collective_max_vector_in_place.mpirun=4.debug
10260/10731 Test  #7420: mpi/collective_max_vector_in_place.mpirun=4.debug ...............................   Passed    2.51 sec
            Start  7421: mpi/collective_max_vector_in_place.mpirun=4.release
10261/10731 Test  #7421: mpi/collective_max_vector_in_place.mpirun=4.release .............................   Passed    2.33 sec
            Start  7428: mpi/collective_min.mpirun=4.debug
10262/10731 Test  #7428: mpi/collective_min.mpirun=4.debug ...............................................   Passed    2.45 sec
            Start  7429: mpi/collective_min.mpirun=4.release
10263/10731 Test  #7429: mpi/collective_min.mpirun=4.release .............................................   Passed    2.28 sec
            Start  7434: mpi/collective_min_array.mpirun=4.debug
10264/10731 Test  #7434: mpi/collective_min_array.mpirun=4.debug .........................................   Passed    2.42 sec
            Start  7435: mpi/collective_min_array.mpirun=4.release
10265/10731 Test  #7487: mpi/compute_mean_value.mpirun=10.release ........................................   Passed   18.37 sec
            Start  7496: mpi/constraint_matrix_trilinos_bug.mpirun=10.debug
10266/10731 Test  #7486: mpi/compute_mean_value.mpirun=10.debug ..........................................   Passed   20.83 sec
            Start  7502: mpi/count_dofs_per_block_01.mpirun=10.debug
10267/10731 Test  #7435: mpi/collective_min_array.mpirun=4.release .......................................   Passed    2.40 sec
            Start  7440: mpi/collective_min_array_in_place.mpirun=4.debug
10268/10731 Test  #7440: mpi/collective_min_array_in_place.mpirun=4.debug ................................   Passed    2.45 sec
            Start  7441: mpi/collective_min_array_in_place.mpirun=4.release
10269/10731 Test  #7441: mpi/collective_min_array_in_place.mpirun=4.release ..............................   Passed    2.48 sec
            Start  7446: mpi/collective_min_vector.mpirun=4.debug
10270/10731 Test  #7446: mpi/collective_min_vector.mpirun=4.debug ........................................   Passed    2.38 sec
            Start  7447: mpi/collective_min_vector.mpirun=4.release
10271/10731 Test  #7447: mpi/collective_min_vector.mpirun=4.release ......................................   Passed    2.42 sec
            Start  7452: mpi/collective_min_vector_in_place.mpirun=4.debug
10272/10731 Test  #7452: mpi/collective_min_vector_in_place.mpirun=4.debug ...............................   Passed    2.53 sec
            Start  7453: mpi/collective_min_vector_in_place.mpirun=4.release
10273/10731 Test  #7453: mpi/collective_min_vector_in_place.mpirun=4.release .............................   Passed    2.32 sec
            Start  7462: mpi/collective_tensor.mpirun=4.debug
10274/10731 Test  #7462: mpi/collective_tensor.mpirun=4.debug ............................................   Passed    2.42 sec
            Start  7463: mpi/collective_tensor.mpirun=4.release
10275/10731 Test  #7463: mpi/collective_tensor.mpirun=4.release ..........................................   Passed    2.38 sec
            Start  7488: mpi/compute_mean_value.mpirun=4.debug
10276/10731 Test  #7496: mpi/constraint_matrix_trilinos_bug.mpirun=10.debug ..............................   Passed   20.80 sec
            Start  7503: mpi/count_dofs_per_block_01.mpirun=10.release
10277/10731 Test  #7502: mpi/count_dofs_per_block_01.mpirun=10.debug .....................................   Passed   22.11 sec
            Start  7506: mpi/count_dofs_per_block_02.mpirun=10.debug
10278/10731 Test  #7488: mpi/compute_mean_value.mpirun=4.debug ...........................................   Passed    3.10 sec
            Start  7489: mpi/compute_mean_value.mpirun=4.release
10279/10731 Test  #7489: mpi/compute_mean_value.mpirun=4.release .........................................   Passed    2.51 sec
            Start  7497: mpi/constraint_matrix_trilinos_bug.mpirun=4.debug
10280/10731 Test  #7497: mpi/constraint_matrix_trilinos_bug.mpirun=4.debug ...............................   Passed    2.65 sec
            Start  7504: mpi/count_dofs_per_block_01.mpirun=4.debug
10281/10731 Test  #7504: mpi/count_dofs_per_block_01.mpirun=4.debug ......................................   Passed    4.92 sec
10282/10731 Test  #7503: mpi/count_dofs_per_block_01.mpirun=10.release ...................................   Passed   18.26 sec
            Start  7507: mpi/count_dofs_per_block_02.mpirun=10.release
            Start  7505: mpi/count_dofs_per_block_01.mpirun=4.release
10283/10731 Test  #7505: mpi/count_dofs_per_block_01.mpirun=4.release ....................................   Passed    2.54 sec
10284/10731 Test  #7506: mpi/count_dofs_per_block_02.mpirun=10.debug .....................................   Passed   21.52 sec
            Start  7510: mpi/count_dofs_per_component_01.mpirun=10.debug
            Start  7508: mpi/count_dofs_per_block_02.mpirun=4.debug
10285/10731 Test  #7508: mpi/count_dofs_per_block_02.mpirun=4.debug ......................................   Passed    3.37 sec
10286/10731 Test  #7507: mpi/count_dofs_per_block_02.mpirun=10.release ...................................   Passed   18.36 sec
            Start  7511: mpi/count_dofs_per_component_01.mpirun=10.release
            Start  7509: mpi/count_dofs_per_block_02.mpirun=4.release
10287/10731 Test  #7509: mpi/count_dofs_per_block_02.mpirun=4.release ....................................   Passed    2.54 sec
10288/10731 Test  #7510: mpi/count_dofs_per_component_01.mpirun=10.debug .................................   Passed   20.09 sec
            Start  7514: mpi/crash_01.mpirun=10.debug
            Start  7512: mpi/count_dofs_per_component_01.mpirun=4.debug
10289/10731 Test  #7512: mpi/count_dofs_per_component_01.mpirun=4.debug ..................................   Passed    2.65 sec
10290/10731 Test  #7511: mpi/count_dofs_per_component_01.mpirun=10.release ...............................   Passed   18.07 sec
            Start  7515: mpi/crash_01.mpirun=10.release
            Start  7513: mpi/count_dofs_per_component_01.mpirun=4.release
10291/10731 Test  #7513: mpi/count_dofs_per_component_01.mpirun=4.release ................................   Passed    2.48 sec
10292/10731 Test  #7514: mpi/crash_01.mpirun=10.debug ....................................................   Passed   18.90 sec
            Start  7520: mpi/crash_03.mpirun=10.debug
            Start  7516: mpi/crash_01.mpirun=4.debug
10293/10731 Test  #7516: mpi/crash_01.mpirun=4.debug .....................................................   Passed    2.52 sec
10294/10731 Test  #7515: mpi/crash_01.mpirun=10.release ..................................................   Passed   16.19 sec
            Start  7521: mpi/crash_03.mpirun=10.release
            Start  7517: mpi/crash_01.mpirun=4.release
10295/10731 Test  #7517: mpi/crash_01.mpirun=4.release ...................................................   Passed    2.41 sec
10296/10731 Test  #7520: mpi/crash_03.mpirun=10.debug ....................................................   Passed   17.83 sec
            Start  7561: mpi/distribute_sp_01.mpirun=10.debug
            Start  7522: mpi/crash_03.mpirun=4.debug
10297/10731 Test  #7522: mpi/crash_03.mpirun=4.debug .....................................................   Passed    2.53 sec
10298/10731 Test  #7521: mpi/crash_03.mpirun=10.release ..................................................   Passed   14.65 sec
            Start  7562: mpi/distribute_sp_01.mpirun=10.release
            Start  7523: mpi/crash_03.mpirun=4.release
10299/10731 Test  #7523: mpi/crash_03.mpirun=4.release ...................................................   Passed    2.40 sec
10300/10731 Test  #7561: mpi/distribute_sp_01.mpirun=10.debug ............................................   Passed   13.11 sec
            Start  7565: mpi/distribute_sp_02.mpirun=10.debug
            Start  7563: mpi/distribute_sp_01.mpirun=4.debug
10301/10731 Test  #7563: mpi/distribute_sp_01.mpirun=4.debug .............................................   Passed    2.52 sec
10302/10731 Test  #7562: mpi/distribute_sp_01.mpirun=10.release ..........................................   Passed   11.18 sec
            Start  7566: mpi/distribute_sp_02.mpirun=10.release
            Start  7564: mpi/distribute_sp_01.mpirun=4.release
10303/10731 Test  #7564: mpi/distribute_sp_01.mpirun=4.release ...........................................   Passed    2.40 sec
10304/10731 Test  #7565: mpi/distribute_sp_02.mpirun=10.debug ............................................   Passed   13.31 sec
            Start  7569: mpi/dof_handler_number_cache.mpirun=10.debug
            Start  7567: mpi/distribute_sp_02.mpirun=4.debug
10305/10731 Test  #7566: mpi/distribute_sp_02.mpirun=10.release ..........................................   Passed   11.18 sec
            Start  7570: mpi/dof_handler_number_cache.mpirun=10.release
10306/10731 Test  #7567: mpi/distribute_sp_02.mpirun=4.debug .............................................   Passed    2.55 sec
            Start  7568: mpi/distribute_sp_02.mpirun=4.release
10307/10731 Test  #7568: mpi/distribute_sp_02.mpirun=4.release ...........................................   Passed    2.46 sec
10308/10731 Test  #7570: mpi/dof_handler_number_cache.mpirun=10.release ..................................   Passed   25.88 sec
            Start  7581: mpi/extract_boundary_dofs.mpirun=10.debug
            Start  7572: mpi/dof_handler_number_cache.mpirun=4.release
10309/10731 Test  #7569: mpi/dof_handler_number_cache.mpirun=10.debug ....................................   Passed   26.84 sec
            Start  7582: mpi/extract_boundary_dofs.mpirun=10.release
10310/10731 Test  #7572: mpi/dof_handler_number_cache.mpirun=4.release ...................................   Passed    2.48 sec
            Start  7571: mpi/dof_handler_number_cache.mpirun=4.debug
10311/10731 Test  #7571: mpi/dof_handler_number_cache.mpirun=4.debug .....................................   Passed    3.53 sec
10312/10731 Test  #7582: mpi/extract_boundary_dofs.mpirun=10.release .....................................   Passed   17.95 sec
            Start  7585: mpi/extract_constant_modes_01.mpirun=10.debug
            Start  7584: mpi/extract_boundary_dofs.mpirun=4.release
10313/10731 Test  #7581: mpi/extract_boundary_dofs.mpirun=10.debug .......................................   Passed   20.46 sec
            Start  7586: mpi/extract_constant_modes_01.mpirun=10.release
10314/10731 Test  #7584: mpi/extract_boundary_dofs.mpirun=4.release ......................................   Passed    2.58 sec
            Start  7583: mpi/extract_boundary_dofs.mpirun=4.debug
10315/10731 Test  #7583: mpi/extract_boundary_dofs.mpirun=4.debug ........................................   Passed    3.03 sec
10316/10731 Test  #7586: mpi/extract_constant_modes_01.mpirun=10.release .................................   Passed   16.39 sec
            Start  7591: mpi/extract_locally_active_dofs.mpirun=10.debug
            Start  7588: mpi/extract_constant_modes_01.mpirun=4.release
10317/10731 Test  #7585: mpi/extract_constant_modes_01.mpirun=10.debug ...................................   Passed   19.36 sec
            Start  7592: mpi/extract_locally_active_dofs.mpirun=10.release
10318/10731 Test  #7588: mpi/extract_constant_modes_01.mpirun=4.release ..................................   Passed    2.53 sec
            Start  7587: mpi/extract_constant_modes_01.mpirun=4.debug
10319/10731 Test  #7587: mpi/extract_constant_modes_01.mpirun=4.debug ....................................   Passed    2.49 sec
10320/10731 Test  #7592: mpi/extract_locally_active_dofs.mpirun=10.release ...............................   Passed   17.60 sec
            Start  7595: mpi/fe_field_function_01.mpirun=10.debug
            Start  7594: mpi/extract_locally_active_dofs.mpirun=4.release
10321/10731 Test  #7591: mpi/extract_locally_active_dofs.mpirun=10.debug .................................   Passed   20.47 sec
            Start  7596: mpi/fe_field_function_01.mpirun=10.release
10322/10731 Test  #7594: mpi/extract_locally_active_dofs.mpirun=4.release ................................   Passed    2.41 sec
            Start  7593: mpi/extract_locally_active_dofs.mpirun=4.debug
10323/10731 Test  #7593: mpi/extract_locally_active_dofs.mpirun=4.debug ..................................   Passed    3.04 sec
10324/10731 Test  #7596: mpi/fe_field_function_01.mpirun=10.release ......................................   Passed   24.89 sec
            Start  7609: mpi/fe_tools_extrapolate_03.mpirun=10.debug
            Start  7598: mpi/fe_field_function_01.mpirun=4.release
10325/10731 Test  #7598: mpi/fe_field_function_01.mpirun=4.release .......................................   Passed    4.32 sec
10326/10731 Test  #7595: mpi/fe_field_function_01.mpirun=10.debug ........................................   Passed   40.01 sec
            Start  7610: mpi/fe_tools_extrapolate_03.mpirun=10.release
            Start  7597: mpi/fe_field_function_01.mpirun=4.debug
10327/10731 Test  #7609: mpi/fe_tools_extrapolate_03.mpirun=10.debug .....................................   Passed   14.67 sec
            Start  7671: mpi/hp_integrate_difference.mpirun=10.debug
10328/10731 Test  #7610: mpi/fe_tools_extrapolate_03.mpirun=10.release ...................................   Passed    2.73 sec
            Start  7672: mpi/hp_integrate_difference.mpirun=10.release
10329/10731 Test  #7597: mpi/fe_field_function_01.mpirun=4.debug .........................................   Passed   22.07 sec
            Start  7611: mpi/fe_tools_extrapolate_03.mpirun=3.debug
            Start  7612: mpi/fe_tools_extrapolate_03.mpirun=3.release
10330/10731 Test  #7672: mpi/hp_integrate_difference.mpirun=10.release ...................................   Passed   19.93 sec
            Start  7721: mpi/integrate_difference.mpirun=10.debug
10331/10731 Test  #7671: mpi/hp_integrate_difference.mpirun=10.debug .....................................   Passed   22.26 sec
            Start  7722: mpi/integrate_difference.mpirun=10.release
10332/10731 Test  #7612: mpi/fe_tools_extrapolate_03.mpirun=3.release ....................................   Passed    2.65 sec
10333/10731 Test  #7611: mpi/fe_tools_extrapolate_03.mpirun=3.debug ......................................   Passed    4.48 sec
            Start  7673: mpi/hp_integrate_difference.mpirun=4.debug
10334/10731 Test  #7673: mpi/hp_integrate_difference.mpirun=4.debug ......................................   Passed    3.31 sec
            Start  7674: mpi/hp_integrate_difference.mpirun=4.release
10335/10731 Test  #7674: mpi/hp_integrate_difference.mpirun=4.release ....................................   Passed    2.53 sec
10336/10731 Test  #7722: mpi/integrate_difference.mpirun=10.release ......................................   Passed   18.58 sec
            Start  7725: mpi/interpolate_01.mpirun=10.debug
            Start  7724: mpi/integrate_difference.mpirun=4.release
10337/10731 Test  #7721: mpi/integrate_difference.mpirun=10.debug ........................................   Passed   20.87 sec
            Start  7726: mpi/interpolate_01.mpirun=10.release
10338/10731 Test  #7724: mpi/integrate_difference.mpirun=4.release .......................................   Passed    2.47 sec
            Start  7723: mpi/integrate_difference.mpirun=4.debug
10339/10731 Test  #7723: mpi/integrate_difference.mpirun=4.debug .........................................   Passed    2.87 sec
10340/10731 Test  #7726: mpi/interpolate_01.mpirun=10.release ............................................   Passed   18.23 sec
            Start  7729: mpi/interpolate_03.mpirun=10.debug
            Start  7728: mpi/interpolate_01.mpirun=4.release
10341/10731 Test  #7725: mpi/interpolate_01.mpirun=10.debug ..............................................   Passed   20.76 sec
            Start  7730: mpi/interpolate_03.mpirun=10.release
10342/10731 Test  #7728: mpi/interpolate_01.mpirun=4.release .............................................   Passed    2.51 sec
            Start  7727: mpi/interpolate_01.mpirun=4.debug
10343/10731 Test  #7727: mpi/interpolate_01.mpirun=4.debug ...............................................   Passed    2.51 sec
10344/10731 Test  #7730: mpi/interpolate_03.mpirun=10.release ............................................   Passed   16.43 sec
            Start  7739: mpi/is_locally_owned.mpirun=10.debug
            Start  7732: mpi/interpolate_03.mpirun=4.release
10345/10731 Test  #7729: mpi/interpolate_03.mpirun=10.debug ..............................................   Passed   19.12 sec
            Start  7740: mpi/is_locally_owned.mpirun=10.release
10346/10731 Test  #7732: mpi/interpolate_03.mpirun=4.release .............................................   Passed    2.46 sec
            Start  7731: mpi/interpolate_03.mpirun=4.debug
10347/10731 Test  #7731: mpi/interpolate_03.mpirun=4.debug ...............................................   Passed    2.55 sec
10348/10731 Test  #7740: mpi/is_locally_owned.mpirun=10.release ..........................................   Passed   16.62 sec
            Start  7749: mpi/make_zero_boundary_values.mpirun=10.debug
            Start  7742: mpi/is_locally_owned.mpirun=4.release
10349/10731 Test  #7739: mpi/is_locally_owned.mpirun=10.debug ............................................   Passed   19.96 sec
            Start  7750: mpi/make_zero_boundary_values.mpirun=10.release
10350/10731 Test  #7742: mpi/is_locally_owned.mpirun=4.release ...........................................   Passed    2.50 sec
            Start  7741: mpi/is_locally_owned.mpirun=4.debug
10351/10731 Test  #7741: mpi/is_locally_owned.mpirun=4.debug .............................................   Passed    2.62 sec
10352/10731 Test  #7750: mpi/make_zero_boundary_values.mpirun=10.release .................................   Passed   19.23 sec
            Start  7753: mpi/map_dofs_to_support_points.mpirun=10.debug
            Start  7752: mpi/make_zero_boundary_values.mpirun=4.release
10353/10731 Test  #7749: mpi/make_zero_boundary_values.mpirun=10.debug ...................................   Passed   21.66 sec
            Start  7754: mpi/map_dofs_to_support_points.mpirun=10.release
10354/10731 Test  #7752: mpi/make_zero_boundary_values.mpirun=4.release ..................................   Passed    2.51 sec
            Start  7751: mpi/make_zero_boundary_values.mpirun=4.debug
10355/10731 Test  #7751: mpi/make_zero_boundary_values.mpirun=4.debug ....................................   Passed    3.01 sec
10356/10731 Test  #7754: mpi/map_dofs_to_support_points.mpirun=10.release ................................   Passed   18.02 sec
            Start  7775: mpi/mg_01.mpirun=10.debug
            Start  7756: mpi/map_dofs_to_support_points.mpirun=4.release
10357/10731 Test  #7753: mpi/map_dofs_to_support_points.mpirun=10.debug ..................................   Passed   20.36 sec
            Start  7776: mpi/mg_01.mpirun=10.release
10358/10731 Test  #7756: mpi/map_dofs_to_support_points.mpirun=4.release .................................   Passed    2.45 sec
            Start  7755: mpi/map_dofs_to_support_points.mpirun=4.debug
10359/10731 Test  #7755: mpi/map_dofs_to_support_points.mpirun=4.debug ...................................   Passed    2.69 sec
10360/10731 Test  #7776: mpi/mg_01.mpirun=10.release .....................................................   Passed   14.76 sec
            Start  7779: mpi/mg_02.mpirun=10.debug
            Start  7778: mpi/mg_01.mpirun=4.release
10361/10731 Test  #7775: mpi/mg_01.mpirun=10.debug .......................................................   Passed   17.58 sec
            Start  7780: mpi/mg_02.mpirun=10.release
10362/10731 Test  #7778: mpi/mg_01.mpirun=4.release ......................................................   Passed    2.47 sec
            Start  7777: mpi/mg_01.mpirun=4.debug
10363/10731 Test  #7777: mpi/mg_01.mpirun=4.debug ........................................................   Passed    2.51 sec
10364/10731 Test  #7780: mpi/mg_02.mpirun=10.release .....................................................   Passed   21.24 sec
            Start  7785: mpi/mg_03.mpirun=10.debug
            Start  7782: mpi/mg_02.mpirun=4.release
10365/10731 Test  #7779: mpi/mg_02.mpirun=10.debug .......................................................   Passed   23.56 sec
            Start  7786: mpi/mg_03.mpirun=10.release
10366/10731 Test  #7782: mpi/mg_02.mpirun=4.release ......................................................   Passed    2.50 sec
            Start  7781: mpi/mg_02.mpirun=4.debug
10367/10731 Test  #7785: mpi/mg_03.mpirun=10.debug .......................................................   Passed    2.65 sec
            Start  7855: mpi/p4est_2d_coarse_01.mpirun=10.debug
10368/10731 Test  #7786: mpi/mg_03.mpirun=10.release .....................................................   Passed    2.51 sec
            Start  7856: mpi/p4est_2d_coarse_01.mpirun=10.release
10369/10731 Test  #7781: mpi/mg_02.mpirun=4.debug ........................................................   Passed    2.49 sec
            Start  7787: mpi/mg_03.mpirun=4.debug
10370/10731 Test  #7787: mpi/mg_03.mpirun=4.debug ........................................................   Passed    2.57 sec
            Start  7788: mpi/mg_03.mpirun=4.release
10371/10731 Test  #7788: mpi/mg_03.mpirun=4.release ......................................................   Passed    2.32 sec
10372/10731 Test  #7856: mpi/p4est_2d_coarse_01.mpirun=10.release ........................................   Passed   16.54 sec
            Start  7859: mpi/p4est_2d_constraintmatrix_01.mpirun=10.debug
            Start  7858: mpi/p4est_2d_coarse_01.mpirun=4.release
10373/10731 Test  #7858: mpi/p4est_2d_coarse_01.mpirun=4.release .........................................   Passed    2.95 sec
10374/10731 Test  #7855: mpi/p4est_2d_coarse_01.mpirun=10.debug ..........................................   Passed   30.63 sec
            Start  7860: mpi/p4est_2d_constraintmatrix_01.mpirun=10.release
            Start  7857: mpi/p4est_2d_coarse_01.mpirun=4.debug
10375/10731 Test  #7859: mpi/p4est_2d_constraintmatrix_01.mpirun=10.debug ................................   Passed   18.56 sec
            Start  7863: mpi/p4est_2d_constraintmatrix_02.mpirun=10.debug
10376/10731 Test  #7857: mpi/p4est_2d_coarse_01.mpirun=4.debug ...........................................   Passed   13.54 sec
            Start  7861: mpi/p4est_2d_constraintmatrix_01.mpirun=4.debug
10377/10731 Test  #7861: mpi/p4est_2d_constraintmatrix_01.mpirun=4.debug .................................   Passed    2.59 sec
10378/10731 Test  #7860: mpi/p4est_2d_constraintmatrix_01.mpirun=10.release ..............................   Passed   16.60 sec
            Start  7864: mpi/p4est_2d_constraintmatrix_02.mpirun=10.release
            Start  7862: mpi/p4est_2d_constraintmatrix_01.mpirun=4.release
10379/10731 Test  #7862: mpi/p4est_2d_constraintmatrix_01.mpirun=4.release ...............................   Passed    2.36 sec
10380/10731 Test  #7863: mpi/p4est_2d_constraintmatrix_02.mpirun=10.debug ................................   Passed   19.49 sec
            Start  7867: mpi/p4est_2d_constraintmatrix_03.mpirun=10.debug
            Start  7865: mpi/p4est_2d_constraintmatrix_02.mpirun=4.debug
10381/10731 Test  #7865: mpi/p4est_2d_constraintmatrix_02.mpirun=4.debug .................................   Passed    2.57 sec
10382/10731 Test  #7864: mpi/p4est_2d_constraintmatrix_02.mpirun=10.release ..............................   Passed   16.81 sec
            Start  7868: mpi/p4est_2d_constraintmatrix_03.mpirun=10.release
            Start  7866: mpi/p4est_2d_constraintmatrix_02.mpirun=4.release
10383/10731 Test  #7866: mpi/p4est_2d_constraintmatrix_02.mpirun=4.release ...............................   Passed    2.45 sec
10384/10731 Test  #7867: mpi/p4est_2d_constraintmatrix_03.mpirun=10.debug ................................   Passed   23.69 sec
            Start  7871: mpi/p4est_2d_constraintmatrix_04.mpirun=10.debug
            Start  7869: mpi/p4est_2d_constraintmatrix_03.mpirun=4.debug
10385/10731 Test  #7869: mpi/p4est_2d_constraintmatrix_03.mpirun=4.debug .................................   Passed    3.06 sec
10386/10731 Test  #7868: mpi/p4est_2d_constraintmatrix_03.mpirun=10.release ..............................   Passed   20.37 sec
            Start  7872: mpi/p4est_2d_constraintmatrix_04.mpirun=10.release
            Start  7870: mpi/p4est_2d_constraintmatrix_03.mpirun=4.release
10387/10731 Test  #7870: mpi/p4est_2d_constraintmatrix_03.mpirun=4.release ...............................   Passed    2.58 sec
10388/10731 Test  #7871: mpi/p4est_2d_constraintmatrix_04.mpirun=10.debug ................................   Passed   21.78 sec
            Start  7877: mpi/p4est_2d_dofhandler_01.mpirun=10.debug
            Start  7873: mpi/p4est_2d_constraintmatrix_04.mpirun=4.debug
10389/10731 Test  #7872: mpi/p4est_2d_constraintmatrix_04.mpirun=10.release ..............................   Passed   17.80 sec
            Start  7878: mpi/p4est_2d_dofhandler_01.mpirun=10.release
10390/10731 Test  #7873: mpi/p4est_2d_constraintmatrix_04.mpirun=4.debug .................................   Passed    3.98 sec
            Start  7874: mpi/p4est_2d_constraintmatrix_04.mpirun=4.release
10391/10731 Test  #7874: mpi/p4est_2d_constraintmatrix_04.mpirun=4.release ...............................   Passed    2.53 sec
10392/10731 Test  #7878: mpi/p4est_2d_dofhandler_01.mpirun=10.release ....................................   Passed   17.02 sec
            Start  7881: mpi/p4est_2d_dofhandler_02.mpirun=10.debug
            Start  7880: mpi/p4est_2d_dofhandler_01.mpirun=4.release
10393/10731 Test  #7880: mpi/p4est_2d_dofhandler_01.mpirun=4.release .....................................   Passed    2.46 sec
10394/10731 Test  #7877: mpi/p4est_2d_dofhandler_01.mpirun=10.debug ......................................   Passed   21.95 sec
            Start  7882: mpi/p4est_2d_dofhandler_02.mpirun=10.release
            Start  7879: mpi/p4est_2d_dofhandler_01.mpirun=4.debug
10395/10731 Test  #7879: mpi/p4est_2d_dofhandler_01.mpirun=4.debug .......................................   Passed    2.60 sec
10396/10731 Test  #7882: mpi/p4est_2d_dofhandler_02.mpirun=10.release ....................................   Passed   17.24 sec
            Start  7885: mpi/p4est_2d_dofhandler_03.mpirun=10.debug
            Start  7884: mpi/p4est_2d_dofhandler_02.mpirun=4.release
10397/10731 Test  #7884: mpi/p4est_2d_dofhandler_02.mpirun=4.release .....................................   Passed    2.69 sec
10398/10731 Test  #7881: mpi/p4est_2d_dofhandler_02.mpirun=10.debug ......................................   Passed   25.49 sec
            Start  7886: mpi/p4est_2d_dofhandler_03.mpirun=10.release
            Start  7883: mpi/p4est_2d_dofhandler_02.mpirun=4.debug
10399/10731 Test  #7883: mpi/p4est_2d_dofhandler_02.mpirun=4.debug .......................................   Passed    4.67 sec
10400/10731 Test  #7886: mpi/p4est_2d_dofhandler_03.mpirun=10.release ....................................   Passed   17.84 sec
            Start  7889: mpi/p4est_2d_dofhandler_04.mpirun=10.debug
            Start  7888: mpi/p4est_2d_dofhandler_03.mpirun=4.release
10401/10731 Test  #7888: mpi/p4est_2d_dofhandler_03.mpirun=4.release .....................................   Passed    2.51 sec
10402/10731 Test  #7885: mpi/p4est_2d_dofhandler_03.mpirun=10.debug ......................................   Passed   25.36 sec
            Start  7890: mpi/p4est_2d_dofhandler_04.mpirun=10.release
            Start  7887: mpi/p4est_2d_dofhandler_03.mpirun=4.debug
10403/10731 Test  #7887: mpi/p4est_2d_dofhandler_03.mpirun=4.debug .......................................   Passed    4.62 sec
10404/10731 Test  #7890: mpi/p4est_2d_dofhandler_04.mpirun=10.release ....................................   Passed   17.62 sec
            Start  7893: mpi/p4est_2d_dofhandler_05.mpirun=10.debug
            Start  7892: mpi/p4est_2d_dofhandler_04.mpirun=4.release
10405/10731 Test  #7892: mpi/p4est_2d_dofhandler_04.mpirun=4.release .....................................   Passed    2.69 sec
10406/10731 Test  #7889: mpi/p4est_2d_dofhandler_04.mpirun=10.debug ......................................   Passed   25.71 sec
            Start  7894: mpi/p4est_2d_dofhandler_05.mpirun=10.release
            Start  7891: mpi/p4est_2d_dofhandler_04.mpirun=4.debug
10407/10731 Test  #7891: mpi/p4est_2d_dofhandler_04.mpirun=4.debug .......................................   Passed    4.55 sec
10408/10731 Test  #7893: mpi/p4est_2d_dofhandler_05.mpirun=10.debug ......................................   Passed   19.20 sec
            Start  7897: mpi/p4est_2d_ghost_01.mpirun=10.debug
            Start  7895: mpi/p4est_2d_dofhandler_05.mpirun=4.debug
10409/10731 Test  #7894: mpi/p4est_2d_dofhandler_05.mpirun=10.release ....................................   Passed   16.21 sec
            Start  7898: mpi/p4est_2d_ghost_01.mpirun=10.release
10410/10731 Test  #7895: mpi/p4est_2d_dofhandler_05.mpirun=4.debug .......................................   Passed    2.55 sec
            Start  7896: mpi/p4est_2d_dofhandler_05.mpirun=4.release
10411/10731 Test  #7896: mpi/p4est_2d_dofhandler_05.mpirun=4.release .....................................   Passed    2.45 sec
10412/10731 Test  #7898: mpi/p4est_2d_ghost_01.mpirun=10.release .........................................   Passed   16.82 sec
            Start  7901: mpi/p4est_2d_ghost_02.mpirun=10.debug
            Start  7900: mpi/p4est_2d_ghost_01.mpirun=4.release
10413/10731 Test  #7897: mpi/p4est_2d_ghost_01.mpirun=10.debug ...........................................   Passed   20.42 sec
            Start  7902: mpi/p4est_2d_ghost_02.mpirun=10.release
10414/10731 Test  #7900: mpi/p4est_2d_ghost_01.mpirun=4.release ..........................................   Passed    2.56 sec
            Start  7899: mpi/p4est_2d_ghost_01.mpirun=4.debug
10415/10731 Test  #7899: mpi/p4est_2d_ghost_01.mpirun=4.debug ............................................   Passed    2.64 sec
10416/10731 Test  #7902: mpi/p4est_2d_ghost_02.mpirun=10.release .........................................   Passed   16.54 sec
            Start  7905: mpi/p4est_2d_refine_01.mpirun=10.debug
            Start  7904: mpi/p4est_2d_ghost_02.mpirun=4.release
10417/10731 Test  #7901: mpi/p4est_2d_ghost_02.mpirun=10.debug ...........................................   Passed   20.52 sec
            Start  7906: mpi/p4est_2d_refine_01.mpirun=10.release
10418/10731 Test  #7904: mpi/p4est_2d_ghost_02.mpirun=4.release ..........................................   Passed    2.60 sec
            Start  7903: mpi/p4est_2d_ghost_02.mpirun=4.debug
10419/10731 Test  #7903: mpi/p4est_2d_ghost_02.mpirun=4.debug ............................................   Passed    2.59 sec
10420/10731 Test  #7906: mpi/p4est_2d_refine_01.mpirun=10.release ........................................   Passed   15.85 sec
            Start  7909: mpi/p4est_2d_refine_02.mpirun=10.debug
            Start  7908: mpi/p4est_2d_refine_01.mpirun=4.release
10421/10731 Test  #7905: mpi/p4est_2d_refine_01.mpirun=10.debug ..........................................   Passed   19.57 sec
            Start  7910: mpi/p4est_2d_refine_02.mpirun=10.release
10422/10731 Test  #7908: mpi/p4est_2d_refine_01.mpirun=4.release .........................................   Passed    2.52 sec
            Start  7907: mpi/p4est_2d_refine_01.mpirun=4.debug
10423/10731 Test  #7907: mpi/p4est_2d_refine_01.mpirun=4.debug ...........................................   Passed    2.60 sec
10424/10731 Test  #7910: mpi/p4est_2d_refine_02.mpirun=10.release ........................................   Passed   17.00 sec
            Start  7913: mpi/p4est_2d_refine_03.mpirun=10.debug
            Start  7912: mpi/p4est_2d_refine_02.mpirun=4.release
10425/10731 Test  #7909: mpi/p4est_2d_refine_02.mpirun=10.debug ..........................................   Passed   20.63 sec
            Start  7914: mpi/p4est_2d_refine_03.mpirun=10.release
10426/10731 Test  #7912: mpi/p4est_2d_refine_02.mpirun=4.release .........................................   Passed    2.63 sec
            Start  7911: mpi/p4est_2d_refine_02.mpirun=4.debug
10427/10731 Test  #7911: mpi/p4est_2d_refine_02.mpirun=4.debug ...........................................   Passed    2.61 sec
10428/10731 Test  #7914: mpi/p4est_2d_refine_03.mpirun=10.release ........................................   Passed   17.53 sec
            Start  7917: mpi/p4est_2d_renumber_01.mpirun=10.debug
            Start  7916: mpi/p4est_2d_refine_03.mpirun=4.release
10429/10731 Test  #7913: mpi/p4est_2d_refine_03.mpirun=10.debug ..........................................   Passed   21.50 sec
            Start  7918: mpi/p4est_2d_renumber_01.mpirun=10.release
10430/10731 Test  #7916: mpi/p4est_2d_refine_03.mpirun=4.release .........................................   Passed    2.62 sec
            Start  7915: mpi/p4est_2d_refine_03.mpirun=4.debug
10431/10731 Test  #7915: mpi/p4est_2d_refine_03.mpirun=4.debug ...........................................   Passed    3.75 sec
10432/10731 Test  #7918: mpi/p4est_2d_renumber_01.mpirun=10.release ......................................   Passed   19.02 sec
            Start  7921: mpi/p4est_2d_renumber_02.mpirun=10.debug
            Start  7920: mpi/p4est_2d_renumber_01.mpirun=4.release
10433/10731 Test  #7917: mpi/p4est_2d_renumber_01.mpirun=10.debug ........................................   Passed   21.34 sec
            Start  7922: mpi/p4est_2d_renumber_02.mpirun=10.release
10434/10731 Test  #7920: mpi/p4est_2d_renumber_01.mpirun=4.release .......................................   Passed    2.47 sec
            Start  7919: mpi/p4est_2d_renumber_01.mpirun=4.debug
10435/10731 Test  #7919: mpi/p4est_2d_renumber_01.mpirun=4.debug .........................................   Passed    2.71 sec
10436/10731 Test  #7922: mpi/p4est_2d_renumber_02.mpirun=10.release ......................................   Passed   20.85 sec
            Start  7925: mpi/p4est_2d_simple.mpirun=10.debug
            Start  7924: mpi/p4est_2d_renumber_02.mpirun=4.release
10437/10731 Test  #7921: mpi/p4est_2d_renumber_02.mpirun=10.debug ........................................   Passed   23.01 sec
            Start  7926: mpi/p4est_2d_simple.mpirun=10.release
10438/10731 Test  #7924: mpi/p4est_2d_renumber_02.mpirun=4.release .......................................   Passed    2.46 sec
            Start  7923: mpi/p4est_2d_renumber_02.mpirun=4.debug
10439/10731 Test  #7923: mpi/p4est_2d_renumber_02.mpirun=4.debug .........................................   Passed    2.57 sec
10440/10731 Test  #7926: mpi/p4est_2d_simple.mpirun=10.release ...........................................   Passed   13.82 sec
            Start  7929: mpi/p4est_3d_constraintmatrix_01.mpirun=10.debug
            Start  7928: mpi/p4est_2d_simple.mpirun=4.release
10441/10731 Test  #7925: mpi/p4est_2d_simple.mpirun=10.debug .............................................   Passed   16.96 sec
            Start  7930: mpi/p4est_3d_constraintmatrix_01.mpirun=10.release
10442/10731 Test  #7928: mpi/p4est_2d_simple.mpirun=4.release ............................................   Passed    2.48 sec
            Start  7927: mpi/p4est_2d_simple.mpirun=4.debug
10443/10731 Test  #7927: mpi/p4est_2d_simple.mpirun=4.debug ..............................................   Passed    2.61 sec
10444/10731 Test  #7930: mpi/p4est_3d_constraintmatrix_01.mpirun=10.release ..............................   Passed   16.40 sec
            Start  7933: mpi/p4est_3d_constraintmatrix_02.mpirun=10.debug
            Start  7932: mpi/p4est_3d_constraintmatrix_01.mpirun=4.release
10445/10731 Test  #7932: mpi/p4est_3d_constraintmatrix_01.mpirun=4.release ...............................   Passed    2.65 sec
10446/10731 Test  #7929: mpi/p4est_3d_constraintmatrix_01.mpirun=10.debug ................................   Passed   20.31 sec
            Start  7934: mpi/p4est_3d_constraintmatrix_02.mpirun=10.release
            Start  7931: mpi/p4est_3d_constraintmatrix_01.mpirun=4.debug
10447/10731 Test  #7931: mpi/p4est_3d_constraintmatrix_01.mpirun=4.debug .................................   Passed    3.75 sec
10448/10731 Test  #7934: mpi/p4est_3d_constraintmatrix_02.mpirun=10.release ..............................   Passed   16.73 sec
            Start  7937: mpi/p4est_3d_constraintmatrix_03.mpirun=10.debug
            Start  7936: mpi/p4est_3d_constraintmatrix_02.mpirun=4.release
10449/10731 Test  #7933: mpi/p4est_3d_constraintmatrix_02.mpirun=10.debug ................................   Passed   19.90 sec
            Start  7938: mpi/p4est_3d_constraintmatrix_03.mpirun=10.release
10450/10731 Test  #7936: mpi/p4est_3d_constraintmatrix_02.mpirun=4.release ...............................   Passed    2.42 sec
            Start  7935: mpi/p4est_3d_constraintmatrix_02.mpirun=4.debug
10451/10731 Test  #7935: mpi/p4est_3d_constraintmatrix_02.mpirun=4.debug .................................   Passed    2.74 sec
10452/10731 Test  #7938: mpi/p4est_3d_constraintmatrix_03.mpirun=10.release ..............................   Passed   19.04 sec
            Start  7943: mpi/p4est_3d_ghost_01.mpirun=10.debug
            Start  7940: mpi/p4est_3d_constraintmatrix_03.mpirun=4.release
10453/10731 Test  #7940: mpi/p4est_3d_constraintmatrix_03.mpirun=4.release ...............................   Passed    4.05 sec
10454/10731 Test  #7937: mpi/p4est_3d_constraintmatrix_03.mpirun=10.debug ................................   Passed   36.28 sec
            Start  7944: mpi/p4est_3d_ghost_01.mpirun=10.release
            Start  7939: mpi/p4est_3d_constraintmatrix_03.mpirun=4.debug
10455/10731 Test  #7943: mpi/p4est_3d_ghost_01.mpirun=10.debug ...........................................   Passed   20.04 sec
            Start  7947: mpi/p4est_3d_refine_01.mpirun=10.debug
10456/10731 Test  #7944: mpi/p4est_3d_ghost_01.mpirun=10.release .........................................   Passed   16.77 sec
            Start  7948: mpi/p4est_3d_refine_01.mpirun=10.release
10457/10731 Test  #7939: mpi/p4est_3d_constraintmatrix_03.mpirun=4.debug .................................   Passed   29.84 sec
            Start  7945: mpi/p4est_3d_ghost_01.mpirun=4.debug
10458/10731 Test  #7947: mpi/p4est_3d_refine_01.mpirun=10.debug ..........................................   Passed   26.57 sec
            Start  7951: mpi/p4est_3d_refine_02.mpirun=10.debug
10459/10731 Test  #7945: mpi/p4est_3d_ghost_01.mpirun=4.debug ............................................   Passed    2.73 sec
            Start  7946: mpi/p4est_3d_ghost_01.mpirun=4.release
10460/10731 Test  #7948: mpi/p4est_3d_refine_01.mpirun=10.release ........................................   Passed   16.61 sec
            Start  7952: mpi/p4est_3d_refine_02.mpirun=10.release
10461/10731 Test  #7946: mpi/p4est_3d_ghost_01.mpirun=4.release ..........................................   Passed    2.59 sec
            Start  7949: mpi/p4est_3d_refine_01.mpirun=4.debug
10462/10731 Test  #7949: mpi/p4est_3d_refine_01.mpirun=4.debug ...........................................   Passed    7.75 sec
            Start  7950: mpi/p4est_3d_refine_01.mpirun=4.release
10463/10731 Test  #7950: mpi/p4est_3d_refine_01.mpirun=4.release .........................................   Passed    2.59 sec
10464/10731 Test  #7951: mpi/p4est_3d_refine_02.mpirun=10.debug ..........................................   Passed   20.21 sec
            Start  7955: mpi/p4est_3d_refine_03.mpirun=10.debug
            Start  7953: mpi/p4est_3d_refine_02.mpirun=4.debug
10465/10731 Test  #7952: mpi/p4est_3d_refine_02.mpirun=10.release ........................................   Passed   16.71 sec
            Start  7956: mpi/p4est_3d_refine_03.mpirun=10.release
10466/10731 Test  #7953: mpi/p4est_3d_refine_02.mpirun=4.debug ...........................................   Passed    2.60 sec
            Start  7954: mpi/p4est_3d_refine_02.mpirun=4.release
10467/10731 Test  #7954: mpi/p4est_3d_refine_02.mpirun=4.release .........................................   Passed    2.49 sec
10468/10731 Test  #7956: mpi/p4est_3d_refine_03.mpirun=10.release ........................................   Passed   16.30 sec
            Start  7968: mpi/p4est_data_out_01.mpirun=10.debug
            Start  7958: mpi/p4est_3d_refine_03.mpirun=4.release
10469/10731 Test  #7958: mpi/p4est_3d_refine_03.mpirun=4.release .........................................   Passed    2.43 sec
10470/10731 Test  #7955: mpi/p4est_3d_refine_03.mpirun=10.debug ..........................................   Passed   19.22 sec
            Start  7969: mpi/p4est_data_out_01.mpirun=10.release
            Start  7957: mpi/p4est_3d_refine_03.mpirun=4.debug
10471/10731 Test  #7957: mpi/p4est_3d_refine_03.mpirun=4.debug ...........................................   Passed    2.48 sec
10472/10731 Test  #7969: mpi/p4est_data_out_01.mpirun=10.release .........................................   Passed   17.52 sec
            Start  7972: mpi/p4est_get_subdomain_association.mpirun=10.debug
            Start  7971: mpi/p4est_data_out_01.mpirun=4.release
10473/10731 Test  #7968: mpi/p4est_data_out_01.mpirun=10.debug ...........................................   Passed   22.63 sec
            Start  7973: mpi/p4est_get_subdomain_association.mpirun=10.release
10474/10731 Test  #7971: mpi/p4est_data_out_01.mpirun=4.release ..........................................   Passed    2.48 sec
            Start  7970: mpi/p4est_data_out_01.mpirun=4.debug
10475/10731 Test  #7970: mpi/p4est_data_out_01.mpirun=4.debug ............................................   Passed    2.53 sec
10476/10731 Test  #7973: mpi/p4est_get_subdomain_association.mpirun=10.release ...........................   Passed   16.64 sec
            Start  7978: mpi/p4est_save_01.mpirun=10.debug
            Start  7975: mpi/p4est_get_subdomain_association.mpirun=4.release
10477/10731 Test  #7972: mpi/p4est_get_subdomain_association.mpirun=10.debug .............................   Passed   20.99 sec
            Start  7979: mpi/p4est_save_01.mpirun=10.release
10478/10731 Test  #7975: mpi/p4est_get_subdomain_association.mpirun=4.release ............................   Passed    2.48 sec
            Start  7974: mpi/p4est_get_subdomain_association.mpirun=4.debug
10479/10731 Test  #7974: mpi/p4est_get_subdomain_association.mpirun=4.debug ..............................   Passed    2.51 sec
10480/10731 Test  #7979: mpi/p4est_save_01.mpirun=10.release .............................................   Passed   16.81 sec
            Start  8002: mpi/parallel_block_vector_01.mpirun=10.debug
            Start  7981: mpi/p4est_save_01.mpirun=4.release
10481/10731 Test  #7978: mpi/p4est_save_01.mpirun=10.debug ...............................................   Passed   19.88 sec
            Start  8003: mpi/parallel_block_vector_01.mpirun=10.release
10482/10731 Test  #7981: mpi/p4est_save_01.mpirun=4.release ..............................................   Passed    2.59 sec
            Start  7980: mpi/p4est_save_01.mpirun=4.debug
10483/10731 Test  #8002: mpi/parallel_block_vector_01.mpirun=10.debug ....................................   Passed    2.67 sec
            Start  8008: mpi/parallel_block_vector_02.mpirun=10.debug
10484/10731 Test  #8003: mpi/parallel_block_vector_01.mpirun=10.release ..................................   Passed    2.44 sec
            Start  8009: mpi/parallel_block_vector_02.mpirun=10.release
10485/10731 Test  #7980: mpi/p4est_save_01.mpirun=4.debug ................................................   Passed    2.66 sec
            Start  8004: mpi/parallel_block_vector_01.mpirun=4.debug
10486/10731 Test  #8008: mpi/parallel_block_vector_02.mpirun=10.debug ....................................   Passed    2.61 sec
            Start  8014: mpi/parallel_block_vector_04.mpirun=10.debug
10487/10731 Test  #8009: mpi/parallel_block_vector_02.mpirun=10.release ..................................   Passed    2.51 sec
            Start  8015: mpi/parallel_block_vector_04.mpirun=10.release
10488/10731 Test  #8004: mpi/parallel_block_vector_01.mpirun=4.debug .....................................   Passed    2.50 sec
            Start  8005: mpi/parallel_block_vector_01.mpirun=4.release
10489/10731 Test  #8014: mpi/parallel_block_vector_04.mpirun=10.debug ....................................   Passed    2.64 sec
            Start  8046: mpi/parallel_partitioner_01.mpirun=10.debug
10490/10731 Test  #8015: mpi/parallel_block_vector_04.mpirun=10.release ..................................   Passed    2.50 sec
            Start  8047: mpi/parallel_partitioner_01.mpirun=10.release
10491/10731 Test  #8005: mpi/parallel_block_vector_01.mpirun=4.release ...................................   Passed    2.47 sec
            Start  8010: mpi/parallel_block_vector_02.mpirun=4.debug
10492/10731 Test  #8010: mpi/parallel_block_vector_02.mpirun=4.debug .....................................   Passed    2.51 sec
            Start  8011: mpi/parallel_block_vector_02.mpirun=4.release
10493/10731 Test  #8011: mpi/parallel_block_vector_02.mpirun=4.release ...................................   Passed    2.33 sec
            Start  8016: mpi/parallel_block_vector_04.mpirun=4.debug
10494/10731 Test  #8016: mpi/parallel_block_vector_04.mpirun=4.debug .....................................   Passed    2.43 sec
            Start  8017: mpi/parallel_block_vector_04.mpirun=4.release
10495/10731 Test  #8047: mpi/parallel_partitioner_01.mpirun=10.release ...................................   Passed   11.22 sec
            Start  8050: mpi/parallel_partitioner_02.mpirun=10.debug
10496/10731 Test  #8017: mpi/parallel_block_vector_04.mpirun=4.release ...................................   Passed    2.43 sec
            Start  8049: mpi/parallel_partitioner_01.mpirun=4.release
10497/10731 Test  #8046: mpi/parallel_partitioner_01.mpirun=10.debug .....................................   Passed   12.90 sec
            Start  8051: mpi/parallel_partitioner_02.mpirun=10.release
10498/10731 Test  #8049: mpi/parallel_partitioner_01.mpirun=4.release ....................................   Passed    2.47 sec
            Start  8048: mpi/parallel_partitioner_01.mpirun=4.debug
10499/10731 Test  #8048: mpi/parallel_partitioner_01.mpirun=4.debug ......................................   Passed    2.51 sec
10500/10731 Test  #8051: mpi/parallel_partitioner_02.mpirun=10.release ...................................   Passed   10.78 sec
            Start  8054: mpi/parallel_partitioner_03.mpirun=10.debug
            Start  8053: mpi/parallel_partitioner_02.mpirun=4.release
10501/10731 Test  #8050: mpi/parallel_partitioner_02.mpirun=10.debug .....................................   Passed   12.61 sec
            Start  8055: mpi/parallel_partitioner_03.mpirun=10.release
10502/10731 Test  #8053: mpi/parallel_partitioner_02.mpirun=4.release ....................................   Passed    2.41 sec
            Start  8052: mpi/parallel_partitioner_02.mpirun=4.debug
10503/10731 Test  #8052: mpi/parallel_partitioner_02.mpirun=4.debug ......................................   Passed    2.45 sec
10504/10731 Test  #8055: mpi/parallel_partitioner_03.mpirun=10.release ...................................   Passed   11.12 sec
            Start  8060: mpi/parallel_partitioner_04.mpirun=10.debug
            Start  8057: mpi/parallel_partitioner_03.mpirun=4.release
10505/10731 Test  #8054: mpi/parallel_partitioner_03.mpirun=10.debug .....................................   Passed   12.69 sec
            Start  8061: mpi/parallel_partitioner_04.mpirun=10.release
10506/10731 Test  #8057: mpi/parallel_partitioner_03.mpirun=4.release ....................................   Passed    2.41 sec
            Start  8056: mpi/parallel_partitioner_03.mpirun=4.debug
10507/10731 Test  #8056: mpi/parallel_partitioner_03.mpirun=4.debug ......................................   Passed    2.52 sec
10508/10731 Test  #8061: mpi/parallel_partitioner_04.mpirun=10.release ...................................   Passed   11.61 sec
            Start  8074: mpi/parallel_vector_01.mpirun=10.debug
            Start  8063: mpi/parallel_partitioner_04.mpirun=4.release
10509/10731 Test  #8060: mpi/parallel_partitioner_04.mpirun=10.debug .....................................   Passed   12.59 sec
            Start  8075: mpi/parallel_vector_01.mpirun=10.release
10510/10731 Test  #8063: mpi/parallel_partitioner_04.mpirun=4.release ....................................   Passed    2.45 sec
            Start  8062: mpi/parallel_partitioner_04.mpirun=4.debug
10511/10731 Test  #8062: mpi/parallel_partitioner_04.mpirun=4.debug ......................................   Passed    2.49 sec
10512/10731 Test  #8075: mpi/parallel_vector_01.mpirun=10.release ........................................   Passed   10.86 sec
            Start  8078: mpi/parallel_vector_02.mpirun=10.debug
            Start  8077: mpi/parallel_vector_01.mpirun=4.release
10513/10731 Test  #8074: mpi/parallel_vector_01.mpirun=10.debug ..........................................   Passed   12.43 sec
            Start  8079: mpi/parallel_vector_02.mpirun=10.release
10514/10731 Test  #8077: mpi/parallel_vector_01.mpirun=4.release .........................................   Passed    2.43 sec
            Start  8076: mpi/parallel_vector_01.mpirun=4.debug
10515/10731 Test  #8076: mpi/parallel_vector_01.mpirun=4.debug ...........................................   Passed    2.44 sec
10516/10731 Test  #8079: mpi/parallel_vector_02.mpirun=10.release ........................................   Passed   10.95 sec
            Start  8082: mpi/parallel_vector_03.mpirun=10.debug
            Start  8081: mpi/parallel_vector_02.mpirun=4.release
10517/10731 Test  #8078: mpi/parallel_vector_02.mpirun=10.debug ..........................................   Passed   12.85 sec
            Start  8083: mpi/parallel_vector_03.mpirun=10.release
10518/10731 Test  #8081: mpi/parallel_vector_02.mpirun=4.release .........................................   Passed    2.43 sec
            Start  8080: mpi/parallel_vector_02.mpirun=4.debug
10519/10731 Test  #8080: mpi/parallel_vector_02.mpirun=4.debug ...........................................   Passed    2.52 sec
10520/10731 Test  #8083: mpi/parallel_vector_03.mpirun=10.release ........................................   Passed   10.84 sec
            Start  8088: mpi/parallel_vector_04.mpirun=10.debug
            Start  8085: mpi/parallel_vector_03.mpirun=4.release
10521/10731 Test  #8082: mpi/parallel_vector_03.mpirun=10.debug ..........................................   Passed   12.91 sec
            Start  8089: mpi/parallel_vector_04.mpirun=10.release
10522/10731 Test  #8085: mpi/parallel_vector_03.mpirun=4.release .........................................   Passed    2.51 sec
            Start  8084: mpi/parallel_vector_03.mpirun=4.debug
10523/10731 Test  #8084: mpi/parallel_vector_03.mpirun=4.debug ...........................................   Passed    2.51 sec
10524/10731 Test  #8089: mpi/parallel_vector_04.mpirun=10.release ........................................   Passed   10.87 sec
            Start  8092: mpi/parallel_vector_05.mpirun=10.debug
            Start  8091: mpi/parallel_vector_04.mpirun=4.release
10525/10731 Test  #8088: mpi/parallel_vector_04.mpirun=10.debug ..........................................   Passed   12.69 sec
            Start  8093: mpi/parallel_vector_05.mpirun=10.release
10526/10731 Test  #8091: mpi/parallel_vector_04.mpirun=4.release .........................................   Passed    2.44 sec
            Start  8090: mpi/parallel_vector_04.mpirun=4.debug
10527/10731 Test  #8090: mpi/parallel_vector_04.mpirun=4.debug ...........................................   Passed    2.45 sec
10528/10731 Test  #8093: mpi/parallel_vector_05.mpirun=10.release ........................................   Passed   10.63 sec
            Start  8098: mpi/parallel_vector_06.mpirun=10.debug
            Start  8095: mpi/parallel_vector_05.mpirun=4.release
10529/10731 Test  #8092: mpi/parallel_vector_05.mpirun=10.debug ..........................................   Passed   12.62 sec
            Start  8099: mpi/parallel_vector_06.mpirun=10.release
10530/10731 Test  #8095: mpi/parallel_vector_05.mpirun=4.release .........................................   Passed    2.48 sec
            Start  8094: mpi/parallel_vector_05.mpirun=4.debug
10531/10731 Test  #8098: mpi/parallel_vector_06.mpirun=10.debug ..........................................   Passed    2.60 sec
            Start  8102: mpi/parallel_vector_07.mpirun=10.debug
10532/10731 Test  #8099: mpi/parallel_vector_06.mpirun=10.release ........................................   Passed    2.47 sec
            Start  8103: mpi/parallel_vector_07.mpirun=10.release
10533/10731 Test  #8094: mpi/parallel_vector_05.mpirun=4.debug ...........................................   Passed    2.54 sec
            Start  8100: mpi/parallel_vector_06.mpirun=4.debug
10534/10731 Test  #8100: mpi/parallel_vector_06.mpirun=4.debug ...........................................   Passed    2.49 sec
            Start  8101: mpi/parallel_vector_06.mpirun=4.release
10535/10731 Test  #8101: mpi/parallel_vector_06.mpirun=4.release .........................................   Passed    2.35 sec
10536/10731 Test  #8102: mpi/parallel_vector_07.mpirun=10.debug ..........................................   Passed   12.42 sec
            Start  8106: mpi/parallel_vector_08.mpirun=10.debug
            Start  8104: mpi/parallel_vector_07.mpirun=4.debug
10537/10731 Test  #8103: mpi/parallel_vector_07.mpirun=10.release ........................................   Passed   11.16 sec
            Start  8107: mpi/parallel_vector_08.mpirun=10.release
10538/10731 Test  #8104: mpi/parallel_vector_07.mpirun=4.debug ...........................................   Passed    2.50 sec
            Start  8105: mpi/parallel_vector_07.mpirun=4.release
10539/10731 Test  #8105: mpi/parallel_vector_07.mpirun=4.release .........................................   Passed    2.39 sec
10540/10731 Test  #8107: mpi/parallel_vector_08.mpirun=10.release ........................................   Passed   11.18 sec
            Start  8110: mpi/parallel_vector_09.mpirun=10.debug
            Start  8109: mpi/parallel_vector_08.mpirun=4.release
10541/10731 Test  #8106: mpi/parallel_vector_08.mpirun=10.debug ..........................................   Passed   13.03 sec
            Start  8111: mpi/parallel_vector_09.mpirun=10.release
10542/10731 Test  #8109: mpi/parallel_vector_08.mpirun=4.release .........................................   Passed    2.41 sec
            Start  8108: mpi/parallel_vector_08.mpirun=4.debug
10543/10731 Test  #8108: mpi/parallel_vector_08.mpirun=4.debug ...........................................   Passed    2.40 sec
10544/10731 Test  #8111: mpi/parallel_vector_09.mpirun=10.release ........................................   Passed   10.60 sec
            Start  8114: mpi/parallel_vector_10.mpirun=10.debug
            Start  8113: mpi/parallel_vector_09.mpirun=4.release
10545/10731 Test  #8110: mpi/parallel_vector_09.mpirun=10.debug ..........................................   Passed   12.98 sec
            Start  8115: mpi/parallel_vector_10.mpirun=10.release
10546/10731 Test  #8113: mpi/parallel_vector_09.mpirun=4.release .........................................   Passed    2.46 sec
            Start  8112: mpi/parallel_vector_09.mpirun=4.debug
10547/10731 Test  #8112: mpi/parallel_vector_09.mpirun=4.debug ...........................................   Passed    2.49 sec
10548/10731 Test  #8115: mpi/parallel_vector_10.mpirun=10.release ........................................   Passed   10.67 sec
            Start  8118: mpi/parallel_vector_11.mpirun=10.debug
            Start  8117: mpi/parallel_vector_10.mpirun=4.release
10549/10731 Test  #8114: mpi/parallel_vector_10.mpirun=10.debug ..........................................   Passed   12.62 sec
            Start  8119: mpi/parallel_vector_11.mpirun=10.release
10550/10731 Test  #8117: mpi/parallel_vector_10.mpirun=4.release .........................................   Passed    2.47 sec
            Start  8116: mpi/parallel_vector_10.mpirun=4.debug
10551/10731 Test  #8116: mpi/parallel_vector_10.mpirun=4.debug ...........................................   Passed    2.60 sec
10552/10731 Test  #8119: mpi/parallel_vector_11.mpirun=10.release ........................................   Passed   10.79 sec
            Start  8124: mpi/parallel_vector_12.mpirun=10.debug
            Start  8121: mpi/parallel_vector_11.mpirun=4.release
10553/10731 Test  #8118: mpi/parallel_vector_11.mpirun=10.debug ..........................................   Passed   12.81 sec
            Start  8125: mpi/parallel_vector_12.mpirun=10.release
10554/10731 Test  #8121: mpi/parallel_vector_11.mpirun=4.release .........................................   Passed    2.40 sec
            Start  8120: mpi/parallel_vector_11.mpirun=4.debug
10555/10731 Test  #8124: mpi/parallel_vector_12.mpirun=10.debug ..........................................   Passed    2.56 sec
            Start  8128: mpi/parallel_vector_13.mpirun=10.debug
10556/10731 Test  #8125: mpi/parallel_vector_12.mpirun=10.release ........................................   Passed    2.46 sec
            Start  8129: mpi/parallel_vector_13.mpirun=10.release
10557/10731 Test  #8120: mpi/parallel_vector_11.mpirun=4.debug ...........................................   Passed    2.40 sec
            Start  8126: mpi/parallel_vector_12.mpirun=4.debug
10558/10731 Test  #8126: mpi/parallel_vector_12.mpirun=4.debug ...........................................   Passed    2.56 sec
            Start  8127: mpi/parallel_vector_12.mpirun=4.release
10559/10731 Test  #8127: mpi/parallel_vector_12.mpirun=4.release .........................................   Passed    2.37 sec
10560/10731 Test  #8129: mpi/parallel_vector_13.mpirun=10.release ........................................   Passed   10.44 sec
            Start  8144: mpi/parallel_vector_18.mpirun=10.debug
            Start  8131: mpi/parallel_vector_13.mpirun=4.release
10561/10731 Test  #8128: mpi/parallel_vector_13.mpirun=10.debug ..........................................   Passed   12.69 sec
            Start  8145: mpi/parallel_vector_18.mpirun=10.release
10562/10731 Test  #8131: mpi/parallel_vector_13.mpirun=4.release .........................................   Passed    2.40 sec
            Start  8130: mpi/parallel_vector_13.mpirun=4.debug
10563/10731 Test  #8144: mpi/parallel_vector_18.mpirun=10.debug ..........................................   Passed    2.57 sec
            Start  8150: mpi/parallel_vector_19.mpirun=10.debug
10564/10731 Test  #8145: mpi/parallel_vector_18.mpirun=10.release ........................................   Passed    2.42 sec
            Start  8151: mpi/parallel_vector_19.mpirun=10.release
10565/10731 Test  #8130: mpi/parallel_vector_13.mpirun=4.debug ...........................................   Passed    2.54 sec
            Start  8146: mpi/parallel_vector_18.mpirun=4.debug
10566/10731 Test  #8150: mpi/parallel_vector_19.mpirun=10.debug ..........................................   Passed    2.60 sec
            Start  8158: mpi/parallel_vector_22.mpirun=10.debug
10567/10731 Test  #8151: mpi/parallel_vector_19.mpirun=10.release ........................................   Passed    2.46 sec
            Start  8159: mpi/parallel_vector_22.mpirun=10.release
10568/10731 Test  #8146: mpi/parallel_vector_18.mpirun=4.debug ...........................................   Passed    2.57 sec
            Start  8147: mpi/parallel_vector_18.mpirun=4.release
10569/10731 Test  #8147: mpi/parallel_vector_18.mpirun=4.release .........................................   Passed    2.39 sec
            Start  8152: mpi/parallel_vector_19.mpirun=4.debug
10570/10731 Test  #8152: mpi/parallel_vector_19.mpirun=4.debug ...........................................   Passed    2.45 sec
            Start  8153: mpi/parallel_vector_19.mpirun=4.release
10571/10731 Test  #8153: mpi/parallel_vector_19.mpirun=4.release .........................................   Passed    2.32 sec
10572/10731 Test  #8159: mpi/parallel_vector_22.mpirun=10.release ........................................   Passed   10.91 sec
            Start  8220: mpi/refine_and_coarsen_fixed_fraction_01.mpirun=10.debug
            Start  8161: mpi/parallel_vector_22.mpirun=4.release
10573/10731 Test  #8158: mpi/parallel_vector_22.mpirun=10.debug ..........................................   Passed   12.64 sec
            Start  8221: mpi/refine_and_coarsen_fixed_fraction_01.mpirun=10.release
10574/10731 Test  #8161: mpi/parallel_vector_22.mpirun=4.release .........................................   Passed    2.42 sec
            Start  8160: mpi/parallel_vector_22.mpirun=4.debug
10575/10731 Test  #8160: mpi/parallel_vector_22.mpirun=4.debug ...........................................   Passed    2.48 sec
10576/10731 Test  #8221: mpi/refine_and_coarsen_fixed_fraction_01.mpirun=10.release ......................   Passed   16.63 sec
            Start  8224: mpi/refine_and_coarsen_fixed_fraction_02.mpirun=10.debug
            Start  8223: mpi/refine_and_coarsen_fixed_fraction_01.mpirun=4.release
10577/10731 Test  #8223: mpi/refine_and_coarsen_fixed_fraction_01.mpirun=4.release .......................   Passed    2.54 sec
10578/10731 Test  #8220: mpi/refine_and_coarsen_fixed_fraction_01.mpirun=10.debug ........................   Passed   20.25 sec
            Start  8225: mpi/refine_and_coarsen_fixed_fraction_02.mpirun=10.release
            Start  8222: mpi/refine_and_coarsen_fixed_fraction_01.mpirun=4.debug
10579/10731 Test  #8222: mpi/refine_and_coarsen_fixed_fraction_01.mpirun=4.debug .........................   Passed    2.61 sec
10580/10731 Test  #8225: mpi/refine_and_coarsen_fixed_fraction_02.mpirun=10.release ......................   Passed   16.72 sec
            Start  8228: mpi/refine_and_coarsen_fixed_fraction_03.mpirun=10.debug
            Start  8227: mpi/refine_and_coarsen_fixed_fraction_02.mpirun=4.release
10581/10731 Test  #8224: mpi/refine_and_coarsen_fixed_fraction_02.mpirun=10.debug ........................   Passed   19.96 sec
            Start  8229: mpi/refine_and_coarsen_fixed_fraction_03.mpirun=10.release
10582/10731 Test  #8227: mpi/refine_and_coarsen_fixed_fraction_02.mpirun=4.release .......................   Passed    2.46 sec
            Start  8226: mpi/refine_and_coarsen_fixed_fraction_02.mpirun=4.debug
10583/10731 Test  #8226: mpi/refine_and_coarsen_fixed_fraction_02.mpirun=4.debug .........................   Passed    2.68 sec
10584/10731 Test  #8229: mpi/refine_and_coarsen_fixed_fraction_03.mpirun=10.release ......................   Passed   16.58 sec
            Start  8240: mpi/refine_and_coarsen_fixed_number_01.mpirun=10.debug
            Start  8231: mpi/refine_and_coarsen_fixed_fraction_03.mpirun=4.release
10585/10731 Test  #8231: mpi/refine_and_coarsen_fixed_fraction_03.mpirun=4.release .......................   Passed    2.56 sec
10586/10731 Test  #8228: mpi/refine_and_coarsen_fixed_fraction_03.mpirun=10.debug ........................   Passed   20.22 sec
            Start  8241: mpi/refine_and_coarsen_fixed_number_01.mpirun=10.release
            Start  8230: mpi/refine_and_coarsen_fixed_fraction_03.mpirun=4.debug
10587/10731 Test  #8230: mpi/refine_and_coarsen_fixed_fraction_03.mpirun=4.debug .........................   Passed    2.55 sec
10588/10731 Test  #8241: mpi/refine_and_coarsen_fixed_number_01.mpirun=10.release ........................   Passed   16.33 sec
            Start  8244: mpi/refine_and_coarsen_fixed_number_02.mpirun=10.debug
            Start  8243: mpi/refine_and_coarsen_fixed_number_01.mpirun=4.release
10589/10731 Test  #8240: mpi/refine_and_coarsen_fixed_number_01.mpirun=10.debug ..........................   Passed   19.66 sec
            Start  8245: mpi/refine_and_coarsen_fixed_number_02.mpirun=10.release
10590/10731 Test  #8243: mpi/refine_and_coarsen_fixed_number_01.mpirun=4.release .........................   Passed    2.50 sec
            Start  8242: mpi/refine_and_coarsen_fixed_number_01.mpirun=4.debug
10591/10731 Test  #8242: mpi/refine_and_coarsen_fixed_number_01.mpirun=4.debug ...........................   Passed    2.67 sec
10592/10731 Test  #8245: mpi/refine_and_coarsen_fixed_number_02.mpirun=10.release ........................   Passed   16.57 sec
            Start  8248: mpi/refine_and_coarsen_fixed_number_03.mpirun=10.debug
            Start  8247: mpi/refine_and_coarsen_fixed_number_02.mpirun=4.release
10593/10731 Test  #8247: mpi/refine_and_coarsen_fixed_number_02.mpirun=4.release .........................   Passed    2.52 sec
10594/10731 Test  #8244: mpi/refine_and_coarsen_fixed_number_02.mpirun=10.debug ..........................   Passed   20.19 sec
            Start  8249: mpi/refine_and_coarsen_fixed_number_03.mpirun=10.release
            Start  8246: mpi/refine_and_coarsen_fixed_number_02.mpirun=4.debug
10595/10731 Test  #8246: mpi/refine_and_coarsen_fixed_number_02.mpirun=4.debug ...........................   Passed    2.54 sec
10596/10731 Test  #8248: mpi/refine_and_coarsen_fixed_number_03.mpirun=10.debug ..........................   Passed   20.26 sec
            Start  8258: mpi/refine_and_coarsen_fixed_number_06.mpirun=10.debug
            Start  8250: mpi/refine_and_coarsen_fixed_number_03.mpirun=4.debug
10597/10731 Test  #8249: mpi/refine_and_coarsen_fixed_number_03.mpirun=10.release ........................   Passed   16.76 sec
            Start  8259: mpi/refine_and_coarsen_fixed_number_06.mpirun=10.release
10598/10731 Test  #8250: mpi/refine_and_coarsen_fixed_number_03.mpirun=4.debug ...........................   Passed    2.72 sec
            Start  8251: mpi/refine_and_coarsen_fixed_number_03.mpirun=4.release
10599/10731 Test  #8259: mpi/refine_and_coarsen_fixed_number_06.mpirun=10.release ........................   Passed    2.73 sec
            Start  8264: mpi/refine_and_coarsen_fixed_number_07.mpirun=10.debug
10600/10731 Test  #8258: mpi/refine_and_coarsen_fixed_number_06.mpirun=10.debug ..........................   Passed    2.80 sec
            Start  8265: mpi/refine_and_coarsen_fixed_number_07.mpirun=10.release
10601/10731 Test  #8251: mpi/refine_and_coarsen_fixed_number_03.mpirun=4.release .........................   Passed    3.06 sec
            Start  8260: mpi/refine_and_coarsen_fixed_number_06.mpirun=4.debug
10602/10731 Test  #8265: mpi/refine_and_coarsen_fixed_number_07.mpirun=10.release ........................   Passed    4.40 sec
            Start  8294: mpi/renumber_z_order_01.mpirun=10.debug
10603/10731 Test  #8264: mpi/refine_and_coarsen_fixed_number_07.mpirun=10.debug ..........................   Passed    4.91 sec
            Start  8295: mpi/renumber_z_order_01.mpirun=10.release
10604/10731 Test  #8260: mpi/refine_and_coarsen_fixed_number_06.mpirun=4.debug ...........................   Passed    2.55 sec
            Start  8261: mpi/refine_and_coarsen_fixed_number_06.mpirun=4.release
10605/10731 Test  #8294: mpi/renumber_z_order_01.mpirun=10.debug .........................................   Passed    2.65 sec
            Start  8300: mpi/renumber_z_order_02.mpirun=10.debug
10606/10731 Test  #8295: mpi/renumber_z_order_01.mpirun=10.release .......................................   Passed    2.57 sec
            Start  8301: mpi/renumber_z_order_02.mpirun=10.release
10607/10731 Test  #8261: mpi/refine_and_coarsen_fixed_number_06.mpirun=4.release .........................   Passed    2.47 sec
            Start  8266: mpi/refine_and_coarsen_fixed_number_07.mpirun=4.debug
10608/10731 Test  #8300: mpi/renumber_z_order_02.mpirun=10.debug .........................................   Passed    2.62 sec
            Start  8360: mpi/tria_ghost_owners_02.mpirun=11.debug
10609/10731 Test  #8301: mpi/renumber_z_order_02.mpirun=10.release .......................................   Passed    2.52 sec
            Start  8361: mpi/tria_ghost_owners_02.mpirun=11.release
10610/10731 Test  #8266: mpi/refine_and_coarsen_fixed_number_07.mpirun=4.debug ...........................   Passed    3.07 sec
            Start  8267: mpi/refine_and_coarsen_fixed_number_07.mpirun=4.release
10611/10731 Test  #8267: mpi/refine_and_coarsen_fixed_number_07.mpirun=4.release .........................   Passed    2.48 sec
            Start  8296: mpi/renumber_z_order_01.mpirun=4.debug
10612/10731 Test  #8296: mpi/renumber_z_order_01.mpirun=4.debug ..........................................   Passed    2.54 sec
            Start  8297: mpi/renumber_z_order_01.mpirun=4.release
10613/10731 Test  #8297: mpi/renumber_z_order_01.mpirun=4.release ........................................   Passed    2.35 sec
            Start  8302: mpi/renumber_z_order_02.mpirun=4.debug
10614/10731 Test  #8302: mpi/renumber_z_order_02.mpirun=4.debug ..........................................   Passed    2.53 sec
            Start  8303: mpi/renumber_z_order_02.mpirun=4.release
10615/10731 Test  #8303: mpi/renumber_z_order_02.mpirun=4.release ........................................   Passed    2.37 sec
10616/10731 Test  #8361: mpi/tria_ghost_owners_02.mpirun=11.release ......................................   Passed   17.49 sec
            Start  8366: mpi/tria_signals_01.mpirun=11.debug
            Start  8363: mpi/tria_ghost_owners_02.mpirun=5.release
10617/10731 Test  #8363: mpi/tria_ghost_owners_02.mpirun=5.release .......................................   Passed    3.79 sec
10618/10731 Test  #8366: mpi/tria_signals_01.mpirun=11.debug .............................................   Passed    6.00 sec
            Start  8367: mpi/tria_signals_01.mpirun=11.release
            Start  8368: mpi/tria_signals_01.mpirun=4.debug
10619/10731 Test  #8368: mpi/tria_signals_01.mpirun=4.debug ..............................................   Passed    3.33 sec
10620/10731 Test  #8367: mpi/tria_signals_01.mpirun=11.release ...........................................   Passed    4.83 sec
            Start  8372: mpi/tria_signals_02.mpirun=11.debug
            Start  8369: mpi/tria_signals_01.mpirun=4.release
10621/10731 Test  #8369: mpi/tria_signals_01.mpirun=4.release ............................................   Passed    3.20 sec
10622/10731 Test  #8360: mpi/tria_ghost_owners_02.mpirun=11.debug ........................................   Passed   34.47 sec
            Start  8373: mpi/tria_signals_02.mpirun=11.release
            Start  8362: mpi/tria_ghost_owners_02.mpirun=5.debug
10623/10731 Test  #8372: mpi/tria_signals_02.mpirun=11.debug .............................................   Passed    5.89 sec
            Start  8378: mpi/tria_signals_03.mpirun=11.debug
10624/10731 Test  #8373: mpi/tria_signals_02.mpirun=11.release ...........................................   Passed    3.10 sec
            Start  8379: mpi/tria_signals_03.mpirun=11.release
10625/10731 Test  #8379: mpi/tria_signals_03.mpirun=11.release ...........................................   Passed   12.92 sec
            Start  8384: mpi/tria_signals_04.mpirun=11.debug
10626/10731 Test  #8362: mpi/tria_ghost_owners_02.mpirun=5.debug .........................................   Passed   20.21 sec
            Start  8374: mpi/tria_signals_02.mpirun=4.debug
10627/10731 Test  #8374: mpi/tria_signals_02.mpirun=4.debug ..............................................   Passed    5.19 sec
            Start  8375: mpi/tria_signals_02.mpirun=4.release
10628/10731 Test  #8375: mpi/tria_signals_02.mpirun=4.release ............................................   Passed    6.07 sec
            Start  8381: mpi/tria_signals_03.mpirun=4.release
10629/10731 Test  #8378: mpi/tria_signals_03.mpirun=11.debug .............................................   Passed   36.95 sec
            Start  8385: mpi/tria_signals_04.mpirun=11.release
10630/10731 Test  #8381: mpi/tria_signals_03.mpirun=4.release ............................................   Passed    6.35 sec
            Start  8380: mpi/tria_signals_03.mpirun=4.debug
10631/10731 Test  #8385: mpi/tria_signals_04.mpirun=11.release ...........................................   Passed   11.65 sec
            Start  8390: mpi/tria_signals_05.mpirun=11.debug
10632/10731 Test  #8390: mpi/tria_signals_05.mpirun=11.debug .............................................   Passed    7.51 sec
            Start  8391: mpi/tria_signals_05.mpirun=11.release
10633/10731 Test  #8384: mpi/tria_signals_04.mpirun=11.debug .............................................   Passed   40.20 sec
            Start  8400: mpi/trilinos_02.mpirun=10.debug
10634/10731 Test  #8391: mpi/tria_signals_05.mpirun=11.release ...........................................   Passed    2.51 sec
            Start  8401: mpi/trilinos_02.mpirun=10.release
10635/10731 Test  #8400: mpi/trilinos_02.mpirun=10.debug .................................................   Passed   12.43 sec
            Start  8440: mpi/trilinos_ghost_01.mpirun=10.debug
10636/10731 Test  #8401: mpi/trilinos_02.mpirun=10.release ...............................................   Passed   10.55 sec
            Start  8441: mpi/trilinos_ghost_01.mpirun=10.release
10637/10731 Test  #8441: mpi/trilinos_ghost_01.mpirun=10.release .........................................   Passed   10.53 sec
            Start  8444: mpi/trilinos_ghost_02.mpirun=10.debug
10638/10731 Test  #8440: mpi/trilinos_ghost_01.mpirun=10.debug ...........................................   Passed   12.49 sec
            Start  8445: mpi/trilinos_ghost_02.mpirun=10.release
10639/10731 Test  #8380: mpi/tria_signals_03.mpirun=4.debug ..............................................   Passed   44.53 sec
            Start  8386: mpi/tria_signals_04.mpirun=4.debug
10640/10731 Test  #8445: mpi/trilinos_ghost_02.mpirun=10.release .........................................   Passed   10.40 sec
            Start  8448: mpi/trilinos_ghost_03.mpirun=10.debug
10641/10731 Test  #8444: mpi/trilinos_ghost_02.mpirun=10.debug ...........................................   Passed   12.44 sec
            Start  8450: mpi/trilinos_ghost_03_linfty.mpirun=10.debug
10642/10731 Test  #8448: mpi/trilinos_ghost_03.mpirun=10.debug ...........................................   Passed   12.55 sec
            Start  8452: mpi/trilinos_ghost_05.mpirun=10.debug
10643/10731 Test  #8450: mpi/trilinos_ghost_03_linfty.mpirun=10.debug ....................................   Passed   12.52 sec
            Start  8453: mpi/trilinos_ghost_05.mpirun=10.release
10644/10731 Test  #8453: mpi/trilinos_ghost_05.mpirun=10.release .........................................   Passed   10.19 sec
            Start  7092: matrix_free/matrix_vector_faces_16.mpirun=11.debug
10645/10731 Test  #8452: mpi/trilinos_ghost_05.mpirun=10.debug ...........................................   Passed   12.46 sec
            Start  7093: matrix_free/matrix_vector_faces_16.mpirun=11.release
10646/10731 Test  #8386: mpi/tria_signals_04.mpirun=4.debug ..............................................   Passed   46.15 sec
            Start  8387: mpi/tria_signals_04.mpirun=4.release
10647/10731 Test  #8387: mpi/tria_signals_04.mpirun=4.release ............................................   Passed    4.03 sec
            Start  8392: mpi/tria_signals_05.mpirun=4.debug
10648/10731 Test  #8392: mpi/tria_signals_05.mpirun=4.debug ..............................................   Passed    2.72 sec
            Start  8393: mpi/tria_signals_05.mpirun=4.release
10649/10731 Test  #8393: mpi/tria_signals_05.mpirun=4.release ............................................   Passed    2.38 sec
            Start  8402: mpi/trilinos_02.mpirun=4.debug
10650/10731 Test  #8402: mpi/trilinos_02.mpirun=4.debug ..................................................   Passed    2.39 sec
            Start  8403: mpi/trilinos_02.mpirun=4.release
10651/10731 Test  #8403: mpi/trilinos_02.mpirun=4.release ................................................   Passed    2.38 sec
            Start  8442: mpi/trilinos_ghost_01.mpirun=4.debug
10652/10731 Test  #8442: mpi/trilinos_ghost_01.mpirun=4.debug ............................................   Passed    4.14 sec
            Start  8443: mpi/trilinos_ghost_01.mpirun=4.release
10653/10731 Test  #7093: matrix_free/matrix_vector_faces_16.mpirun=11.release ............................   Passed   32.19 sec
            Start  7619: mpi/fe_tools_extrapolate_06.mpirun=10.debug
10654/10731 Test  #7092: matrix_free/matrix_vector_faces_16.mpirun=11.debug ..............................   Passed   34.11 sec
            Start  7620: mpi/fe_tools_extrapolate_06.mpirun=10.release
10655/10731 Test  #8443: mpi/trilinos_ghost_01.mpirun=4.release ..........................................   Passed    2.80 sec
            Start  8446: mpi/trilinos_ghost_02.mpirun=4.debug
10656/10731 Test  #8446: mpi/trilinos_ghost_02.mpirun=4.debug ............................................   Passed    4.17 sec
            Start  8447: mpi/trilinos_ghost_02.mpirun=4.release
10657/10731 Test  #8447: mpi/trilinos_ghost_02.mpirun=4.release ..........................................   Passed    5.10 sec
            Start  8449: mpi/trilinos_ghost_03.mpirun=4.debug
10658/10731 Test  #7620: mpi/fe_tools_extrapolate_06.mpirun=10.release ...................................   Passed   12.59 sec
            Start  7625: mpi/has_active_dofs_01.mpirun=10.debug
10659/10731 Test  #8449: mpi/trilinos_ghost_03.mpirun=4.debug ............................................   Passed    3.22 sec
            Start  8451: mpi/trilinos_ghost_03_linfty.mpirun=4.debug
10660/10731 Test  #7619: mpi/fe_tools_extrapolate_06.mpirun=10.debug .....................................   Passed   14.20 sec
            Start  7626: mpi/has_active_dofs_01.mpirun=10.release
10661/10731 Test  #8451: mpi/trilinos_ghost_03_linfty.mpirun=4.debug .....................................   Passed    2.54 sec
            Start  8454: mpi/trilinos_ghost_05.mpirun=4.debug
10662/10731 Test  #8454: mpi/trilinos_ghost_05.mpirun=4.debug ............................................   Passed    2.47 sec
            Start  8455: mpi/trilinos_ghost_05.mpirun=4.release
10663/10731 Test  #8455: mpi/trilinos_ghost_05.mpirun=4.release ..........................................   Passed    2.36 sec
10664/10731 Test  #7626: mpi/has_active_dofs_01.mpirun=10.release ........................................   Passed   17.53 sec
            Start  8691: multigrid/transfer_matrix_free_06.mpirun=15.debug
10665/10731 Test  #7625: mpi/has_active_dofs_01.mpirun=10.debug ..........................................   Passed   20.21 sec
            Start  7627: mpi/has_active_dofs_02.mpirun=10.debug
10666/10731 Test  #7627: mpi/has_active_dofs_02.mpirun=10.debug ..........................................   Passed   18.27 sec
            Start  7628: mpi/has_active_dofs_02.mpirun=10.release
10667/10731 Test  #7628: mpi/has_active_dofs_02.mpirun=10.release ........................................   Passed   17.20 sec
            Start  7711: mpi/hp_unify_dof_indices_09.mpirun=10.debug
10668/10731 Test  #8691: multigrid/transfer_matrix_free_06.mpirun=15.debug ...............................   Passed   41.36 sec
            Start  8692: multigrid/transfer_matrix_free_06.mpirun=15.release
10669/10731 Test  #7711: mpi/hp_unify_dof_indices_09.mpirun=10.debug .....................................   Passed   19.90 sec
            Start  7712: mpi/hp_unify_dof_indices_09.mpirun=10.release
10670/10731 Test  #8692: multigrid/transfer_matrix_free_06.mpirun=15.release .............................   Passed   22.89 sec
            Start  7797: mpi/mg_05.mpirun=10.debug
            Start  8693: multigrid/transfer_matrix_free_06.mpirun=5.debug
10671/10731 Test  #7712: mpi/hp_unify_dof_indices_09.mpirun=10.release ...................................   Passed   16.45 sec
            Start  7798: mpi/mg_05.mpirun=10.release
10672/10731 Test  #8693: multigrid/transfer_matrix_free_06.mpirun=5.debug ................................   Passed   20.72 sec
            Start  8694: multigrid/transfer_matrix_free_06.mpirun=5.release
10673/10731 Test  #7797: mpi/mg_05.mpirun=10.debug .......................................................   Passed   21.00 sec
            Start  7847: mpi/no_flux_constraints_03.mpirun=9.debug
10674/10731 Test  #8694: multigrid/transfer_matrix_free_06.mpirun=5.release ..............................   Passed    1.63 sec
            Start  8334: mpi/step-37.mpirun=7.debug
10675/10731 Test  #7847: mpi/no_flux_constraints_03.mpirun=9.debug .......................................   Passed    4.35 sec
            Start  7848: mpi/no_flux_constraints_03.mpirun=9.release
10676/10731 Test  #7798: mpi/mg_05.mpirun=10.release .....................................................   Passed   18.20 sec
            Start  7849: mpi/normal_flux_constraints.mpirun=9.debug
10677/10731 Test  #7848: mpi/no_flux_constraints_03.mpirun=9.release .....................................   Passed    4.54 sec
            Start  7850: mpi/normal_flux_constraints.mpirun=9.release
10678/10731 Test  #8334: mpi/step-37.mpirun=7.debug ......................................................   Passed   24.17 sec
            Start  7992: mpi/p_adaptivity_fixed_number.mpirun=8.debug
10679/10731 Test  #7850: mpi/normal_flux_constraints.mpirun=9.release ....................................   Passed   18.71 sec
            Start  7993: mpi/p_adaptivity_fixed_number.mpirun=8.release
10680/10731 Test  #7992: mpi/p_adaptivity_fixed_number.mpirun=8.debug ....................................   Passed    3.34 sec
            Start  7998: mpi/p_refinement_and_coarsening.mpirun=8.debug
10681/10731 Test  #7993: mpi/p_adaptivity_fixed_number.mpirun=8.release ..................................   Passed    2.98 sec
            Start  7999: mpi/p_refinement_and_coarsening.mpirun=8.release
10682/10731 Test  #7849: mpi/normal_flux_constraints.mpirun=9.debug ......................................   Passed   25.63 sec
            Start  8194: mpi/periodicity_05.mpirun=9.debug
10683/10731 Test  #7998: mpi/p_refinement_and_coarsening.mpirun=8.debug ..................................   Passed    2.89 sec
            Start  8195: mpi/periodicity_05.mpirun=9.release
10684/10731 Test  #7999: mpi/p_refinement_and_coarsening.mpirun=8.release ................................   Passed    2.58 sec
            Start  8335: mpi/step-37.mpirun=7.release
10685/10731 Test  #8335: mpi/step-37.mpirun=7.release ....................................................   Passed    3.48 sec
            Start  8342: mpi/step-39.mpirun=6.debug
10686/10731 Test  #8342: mpi/step-39.mpirun=6.debug ......................................................   Passed    4.11 sec
            Start  8343: mpi/step-39.mpirun=6.release
10687/10731 Test  #8343: mpi/step-39.mpirun=6.release ....................................................   Passed    3.09 sec
            Start  8358: mpi/tria_ghost_owners_01.mpirun=7.debug
10688/10731 Test  #8195: mpi/periodicity_05.mpirun=9.release .............................................   Passed   18.37 sec
            Start  8044: mpi/parallel_block_vector_13.mpirun=10.debug
10689/10731 Test  #8194: mpi/periodicity_05.mpirun=9.debug ...............................................   Passed   23.34 sec
            Start  8359: mpi/tria_ghost_owners_01.mpirun=7.release
10690/10731 Test  #8044: mpi/parallel_block_vector_13.mpirun=10.debug ....................................   Passed   12.94 sec
            Start  8045: mpi/parallel_block_vector_13.mpirun=10.release
10691/10731 Test  #8359: mpi/tria_ghost_owners_01.mpirun=7.release .......................................   Passed   19.10 sec
            Start  8512: multigrid/constrained_dofs_02.mpirun=8.debug
10692/10731 Test  #8045: mpi/parallel_block_vector_13.mpirun=10.release ..................................   Passed   11.57 sec
            Start  8398: mpi/trilinos_01.mpirun=10.debug
10693/10731 Test  #8512: multigrid/constrained_dofs_02.mpirun=8.debug ....................................   Passed    1.15 sec
            Start  8513: multigrid/constrained_dofs_02.mpirun=8.release
10694/10731 Test  #8513: multigrid/constrained_dofs_02.mpirun=8.release ..................................   Passed    0.64 sec
            Start  8619: multigrid/step-16-50-mpi.mpirun=7.debug
10695/10731 Test  #8398: mpi/trilinos_01.mpirun=10.debug .................................................   Passed    6.87 sec
            Start  8198: mpi/periodicity_07.mpirun=13.debug
10696/10731 Test  #8619: multigrid/step-16-50-mpi.mpirun=7.debug .........................................   Passed    6.73 sec
            Start  8620: multigrid/step-16-50-mpi.mpirun=7.release
10697/10731 Test  #8620: multigrid/step-16-50-mpi.mpirun=7.release .......................................   Passed    1.10 sec
            Start  8669: multigrid/transfer_matrix_free_01.mpirun=7.debug
10698/10731 Test  #8358: mpi/tria_ghost_owners_01.mpirun=7.debug .........................................   Passed   65.60 sec
            Start  8670: multigrid/transfer_matrix_free_01.mpirun=7.release
10699/10731 Test  #8669: multigrid/transfer_matrix_free_01.mpirun=7.debug ................................   Passed   25.79 sec
            Start  8685: multigrid/transfer_matrix_free_04.mpirun=7.debug
10700/10731 Test  #8198: mpi/periodicity_07.mpirun=13.debug ..............................................   Passed   29.58 sec
            Start  8199: mpi/periodicity_07.mpirun=13.release
10701/10731 Test  #8670: multigrid/transfer_matrix_free_01.mpirun=7.release ..............................   Passed    2.92 sec
            Start  8686: multigrid/transfer_matrix_free_04.mpirun=7.release
10702/10731 Test  #8686: multigrid/transfer_matrix_free_04.mpirun=7.release ..............................   Passed    1.80 sec
10703/10731 Test  #8685: multigrid/transfer_matrix_free_04.mpirun=7.debug ................................   Passed   23.98 sec
            Start  8399: mpi/trilinos_01.mpirun=10.release
10704/10731 Test  #8199: mpi/periodicity_07.mpirun=13.release ............................................   Passed   24.23 sec
            Start  8639: multigrid/step-50_01.mpirun=8.debug
10705/10731 Test  #8639: multigrid/step-50_01.mpirun=8.debug .............................................   Passed    3.15 sec
            Start  8640: multigrid/step-50_01.mpirun=8.release
10706/10731 Test  #8399: mpi/trilinos_01.mpirun=10.release ...............................................   Passed    5.44 sec
            Start 10272: trilinos/n_nonzeros_02_parallel.mpirun=9.debug
            Start 10273: trilinos/n_nonzeros_02_parallel.mpirun=9.release
10707/10731 Test  #8640: multigrid/step-50_01.mpirun=8.release ...........................................   Passed    0.82 sec
10708/10731 Test #10273: trilinos/n_nonzeros_02_parallel.mpirun=9.release ................................   Passed   15.37 sec
10709/10731 Test #10272: trilinos/n_nonzeros_02_parallel.mpirun=9.debug ..................................   Passed   18.51 sec
            Start  7811: mpi/mg_ghost_dofs_periodic_05.mpirun=28.debug
10710/10731 Test  #7811: mpi/mg_ghost_dofs_periodic_05.mpirun=28.debug ...................................   Passed   44.71 sec
            Start  7812: mpi/mg_ghost_dofs_periodic_05.mpirun=28.release
10711/10731 Test  #7812: mpi/mg_ghost_dofs_periodic_05.mpirun=28.release .................................   Passed   21.42 sec
            Start  7963: mpi/p4est_3d_refine_04.mpirun=24.debug
10712/10731 Test  #7963: mpi/p4est_3d_refine_04.mpirun=24.debug ..........................................   Passed    6.43 sec
            Start  7964: mpi/p4est_3d_refine_04.mpirun=24.release
10713/10731 Test  #7964: mpi/p4est_3d_refine_04.mpirun=24.release ........................................   Passed    2.84 sec
            Start  8274: mpi/refinement_listener_01.mpirun=20.debug
            Start  7965: mpi/p4est_3d_refine_04.mpirun=4.debug
10714/10731 Test  #8274: mpi/refinement_listener_01.mpirun=20.debug ......................................   Passed    3.14 sec
            Start  8275: mpi/refinement_listener_01.mpirun=20.release
10715/10731 Test  #8275: mpi/refinement_listener_01.mpirun=20.release ....................................   Passed    2.65 sec
            Start  8280: mpi/refinement_listener_02.mpirun=20.debug
10716/10731 Test  #7965: mpi/p4est_3d_refine_04.mpirun=4.debug ...........................................   Passed    7.10 sec
            Start  7966: mpi/p4est_3d_refine_04.mpirun=4.release
10717/10731 Test  #8280: mpi/refinement_listener_02.mpirun=20.debug ......................................   Passed    3.23 sec
            Start  8281: mpi/refinement_listener_02.mpirun=20.release
10718/10731 Test  #7966: mpi/p4est_3d_refine_04.mpirun=4.release .........................................   Passed    2.75 sec
            Start  8276: mpi/refinement_listener_01.mpirun=4.debug
10719/10731 Test  #8281: mpi/refinement_listener_02.mpirun=20.release ....................................   Passed    2.62 sec
            Start  8529: multigrid/distribute_bug_01.mpirun=20.debug
10720/10731 Test  #8276: mpi/refinement_listener_01.mpirun=4.debug .......................................   Passed    2.79 sec
            Start  8277: mpi/refinement_listener_01.mpirun=4.release
10721/10731 Test  #8277: mpi/refinement_listener_01.mpirun=4.release .....................................   Passed    3.59 sec
            Start  8282: mpi/refinement_listener_02.mpirun=4.debug
10722/10731 Test  #8529: multigrid/distribute_bug_01.mpirun=20.debug .....................................   Passed    5.20 sec
            Start  8530: multigrid/distribute_bug_01.mpirun=20.release
10723/10731 Test  #8530: multigrid/distribute_bug_01.mpirun=20.release ...................................   Passed    1.07 sec
            Start  7813: mpi/mg_ghost_dofs_periodic_05.mpirun=6.debug
            Start  7814: mpi/mg_ghost_dofs_periodic_05.mpirun=6.release
            Start  8283: mpi/refinement_listener_02.mpirun=4.release
10724/10731 Test  #8282: mpi/refinement_listener_02.mpirun=4.debug .......................................   Passed    3.13 sec
            Start  8531: multigrid/distribute_bug_01.mpirun=6.debug
10725/10731 Test  #8283: mpi/refinement_listener_02.mpirun=4.release .....................................   Passed    3.52 sec
            Start  8532: multigrid/distribute_bug_01.mpirun=6.release
10726/10731 Test  #7814: mpi/mg_ghost_dofs_periodic_05.mpirun=6.release ..................................   Passed    5.04 sec
10727/10731 Test  #8532: multigrid/distribute_bug_01.mpirun=6.release ....................................   Passed    1.72 sec
10728/10731 Test  #8531: multigrid/distribute_bug_01.mpirun=6.debug ......................................   Passed    3.79 sec
10729/10731 Test  #7813: mpi/mg_ghost_dofs_periodic_05.mpirun=6.debug ....................................   Passed   32.11 sec
            Start  7819: mpi/mg_ghost_dofs_periodic_07.mpirun=43.debug
10730/10731 Test  #7819: mpi/mg_ghost_dofs_periodic_07.mpirun=43.debug ...................................   Passed    6.55 sec
            Start  7820: mpi/mg_ghost_dofs_periodic_07.mpirun=43.release
10731/10731 Test  #7820: mpi/mg_ghost_dofs_periodic_07.mpirun=43.release .................................   Passed    3.59 sec

99% tests passed, 16 tests failed out of 10731

Total Test time (real) = 17946.75 sec

The following tests FAILED:
	2697 - cuda/array_view_access_data.debug (Failed)
	2698 - cuda/array_view_wrong_memory.debug (Failed)
	2745 - cuda/matrix_free_matrix_vector_10.mpirun=2.debug (Failed)
	2749 - cuda/matrix_free_matrix_vector_10a.mpirun=2.debug (Failed)
	2801 - cuda/precondition_03.mpirun=2.debug (Failed)
	2817 - cuda/solver_08.debug (Failed)
	2818 - cuda/solver_08.release (Failed)
	3045 - distributed_grids/3d_coarse_grid_02.debug (Failed)
	4684 - grid/build_global_description_tree.mpirun=1.debug (Failed)
	4685 - grid/build_global_description_tree.mpirun=1.release (Failed)
	4686 - grid/build_global_description_tree.mpirun=2.debug (Failed)
	4687 - grid/build_global_description_tree.mpirun=2.release (Failed)
	5034 - grid/grid_tools_cache_04.mpirun=4.debug (Failed)
	5035 - grid/grid_tools_cache_04.mpirun=4.release (Failed)
	5285 - grid/twisted_parallelepiped_02.release (Failed)
	5425 - hp/distribute_dofs_linear_time.debug (Timeout)
-- Running CTEST_SUBMIT()
	Add file: /home/build/revision.log
	Add file: /home/build/summary.log
	Add file: /home/build/detailed.log
	Add file: /home/build/include/deal.II/base/config.h
Submit files
   Send to group: Continuous
   SubmitURL: https://cdash.43-1.org/submit.php?project=deal.II
   Uploaded: /home/build/Testing/20200812-0405/Update.xml
   Uploaded: /home/build/Testing/20200812-0405/Configure.xml
   Uploaded: /home/build/Testing/20200812-0405/Build.xml
   Uploaded: /home/build/Testing/20200812-0405/Test.xml
   Uploaded: /home/build/Testing/20200812-0405/Notes.xml
   Uploaded: /home/build/Testing/20200812-0405/Done.xml
   Submission successful
-- Submission successful. Goodbye!
rm: cannot remove '/var/jenkins/workspace/deal.II-CUDA11.0/build': No such file or directory
+ docker stop cuda11_deal_ci
cuda11_deal_ci
+ docker rm -f cuda11_deal_ci
cuda11_deal_ci
[WARNINGS] Parsing warnings in console log with parser GNU Make + GNU C Compiler (gcc)
No credentials specified
<Git Blamer> Using GitBlamer to create author and commit information for all warnings.
<Git Blamer> GIT_COMMIT=b261f808e75274172a8876bc86d9cd39285de17e, workspace=/var/jenkins/workspace/deal.II-CUDA11.0
INFO: Starting to record.
INFO: Processing CTest-Version 3.x (default)
INFO: [CTest-Version 3.x (default)] - 1 test report file(s) were found with the pattern 'build/Testing/**/Test.xml' relative to '/var/jenkins/workspace/deal.II-CUDA11.0' for the testing framework 'CTest-Version 3.x (default)'.
INFO: Check 'Failed Tests' threshold.
INFO: The total number of tests for the threshold 'Failed Tests' exceeds the specified "failure threshold" value.
INFO: Setting the build status to FAILURE
INFO: Stopping recording.
Build step 'Publish xUnit test result report' changed build result to FAILURE
Finished: FAILURE