Console Output

Skipping 1,873 KB.. Full Log
 9804/10570 Test  #8046: mpi/parallel_block_vector_08.mpirun=4.release ...................................   Passed    6.37 sec
            Start  8054: mpi/parallel_block_vector_10.mpirun=4.release
 9805/10570 Test  #8049: mpi/parallel_block_vector_09.mpirun=5.debug .....................................   Passed    9.39 sec
            Start  8055: mpi/parallel_block_vector_11.mpirun=4.debug
 9806/10570 Test  #7998: mpi/p4est_save_05.mpirun=5.release ..............................................   Passed   34.44 sec
            Start  8056: mpi/parallel_block_vector_11.mpirun=4.release
 9807/10570 Test  #8050: mpi/parallel_block_vector_09.mpirun=5.release ...................................   Passed    8.92 sec
            Start  8057: mpi/parallel_block_vector_12.mpirun=4.debug
 9808/10570 Test  #8054: mpi/parallel_block_vector_10.mpirun=4.release ...................................   Passed    7.32 sec
            Start  8058: mpi/parallel_block_vector_12.mpirun=4.release
 9809/10570 Test  #8053: mpi/parallel_block_vector_10.mpirun=4.debug .....................................   Passed    9.31 sec
            Start  8073: mpi/parallel_partitioner_03b.mpirun=4.debug
 9810/10570 Test  #7997: mpi/p4est_save_05.mpirun=5.debug ................................................   Passed   39.24 sec
            Start  8074: mpi/parallel_partitioner_03b.mpirun=4.release
 9811/10570 Test  #8073: mpi/parallel_partitioner_03b.mpirun=4.debug .....................................   Passed   19.19 sec
            Start  8079: mpi/parallel_partitioner_05.mpirun=4.debug
 9812/10570 Test  #8074: mpi/parallel_partitioner_03b.mpirun=4.release ...................................   Passed   16.73 sec
            Start  8080: mpi/parallel_partitioner_05.mpirun=4.release
 9813/10570 Test  #8058: mpi/parallel_block_vector_12.mpirun=4.release ...................................   Passed   35.61 sec
            Start  8081: mpi/parallel_partitioner_06.mpirun=4.debug
 9814/10570 Test  #8080: mpi/parallel_partitioner_05.mpirun=4.release ....................................   Passed   17.54 sec
            Start  8082: mpi/parallel_partitioner_06.mpirun=4.release
 9815/10570 Test  #8079: mpi/parallel_partitioner_05.mpirun=4.debug ......................................   Passed   19.09 sec
            Start  8083: mpi/parallel_partitioner_07.mpirun=4.debug
 9816/10570 Test  #8056: mpi/parallel_block_vector_11.mpirun=4.release ...................................   Passed   41.26 sec
            Start  8084: mpi/parallel_partitioner_07.mpirun=4.release
 9817/10570 Test  #8055: mpi/parallel_block_vector_11.mpirun=4.debug .....................................   Passed   43.46 sec
            Start  8177: mpi/parallel_vector_23.mpirun=4.debug
 9818/10570 Test  #8057: mpi/parallel_block_vector_12.mpirun=4.debug .....................................   Passed   42.65 sec
            Start  8178: mpi/parallel_vector_23.mpirun=4.release
 9819/10570 Test  #8081: mpi/parallel_partitioner_06.mpirun=4.debug ......................................   Passed   20.22 sec
            Start  8181: mpi/parallel_vector_back_interpolate.mpirun=4.debug
 9820/10570 Test  #8082: mpi/parallel_partitioner_06.mpirun=4.release ....................................   Passed   18.68 sec
            Start  8182: mpi/parallel_vector_back_interpolate.mpirun=4.release
 9821/10570 Test  #8083: mpi/parallel_partitioner_07.mpirun=4.debug ......................................   Passed   20.00 sec
            Start  8183: mpi/parallel_vector_back_interpolate_02.mpirun=4.debug
 9822/10570 Test  #8084: mpi/parallel_partitioner_07.mpirun=4.release ....................................   Passed   18.83 sec
            Start  8184: mpi/parallel_vector_back_interpolate_02.mpirun=4.release
 9823/10570 Test  #8178: mpi/parallel_vector_23.mpirun=4.release .........................................   Passed   18.13 sec
            Start  8185: mpi/parallel_vector_interpolate.mpirun=4.debug
 9824/10570 Test  #8177: mpi/parallel_vector_23.mpirun=4.debug ...........................................   Passed   20.49 sec
            Start  8186: mpi/parallel_vector_interpolate.mpirun=4.release
 9825/10570 Test  #8182: mpi/parallel_vector_back_interpolate.mpirun=4.release ...........................   Passed   25.05 sec
            Start  8229: mpi/project_bv_div_conf.mpirun=4.debug
 9826/10570 Test  #8181: mpi/parallel_vector_back_interpolate.mpirun=4.debug .............................   Passed   29.13 sec
            Start  8230: mpi/project_bv_div_conf.mpirun=4.release
 9827/10570 Test  #8184: mpi/parallel_vector_back_interpolate_02.mpirun=4.release ........................   Passed   27.88 sec
            Start  8293: mpi/renumber_cuthill_mckee.mpirun=4.debug
 9828/10570 Test  #8186: mpi/parallel_vector_interpolate.mpirun=4.release ................................   Passed   25.73 sec
            Start  8294: mpi/renumber_cuthill_mckee.mpirun=4.release
 9829/10570 Test  #8229: mpi/project_bv_div_conf.mpirun=4.debug ..........................................   Passed    7.74 sec
            Start  8295: mpi/renumber_cuthill_mckee_02.mpirun=4.debug
 9830/10570 Test  #8185: mpi/parallel_vector_interpolate.mpirun=4.debug ..................................   Passed   28.60 sec
            Start  8296: mpi/renumber_cuthill_mckee_02.mpirun=4.release
 9831/10570 Test  #8183: mpi/parallel_vector_back_interpolate_02.mpirun=4.debug ..........................   Passed   30.72 sec
            Start  8313: mpi/renumber_z_order_04.mpirun=4.debug
 9832/10570 Test  #8230: mpi/project_bv_div_conf.mpirun=4.release ........................................   Passed    6.73 sec
            Start  8314: mpi/renumber_z_order_04.mpirun=4.release
 9833/10570 Test  #8294: mpi/renumber_cuthill_mckee.mpirun=4.release .....................................   Passed    6.30 sec
            Start  8315: mpi/renumber_z_order_05.mpirun=4.debug
 9834/10570 Test  #8293: mpi/renumber_cuthill_mckee.mpirun=4.debug .......................................   Passed    8.40 sec
            Start  8316: mpi/renumber_z_order_05.mpirun=4.release
 9835/10570 Test  #8314: mpi/renumber_z_order_04.mpirun=4.release ........................................   Passed   25.65 sec
            Start  8317: mpi/renumber_z_order_06.mpirun=4.debug
 9836/10570 Test  #8313: mpi/renumber_z_order_04.mpirun=4.debug ..........................................   Passed   28.46 sec
            Start  8318: mpi/renumber_z_order_06.mpirun=4.release
 9837/10570 Test  #8316: mpi/renumber_z_order_05.mpirun=4.release ........................................   Passed   26.36 sec
            Start  8337: mpi/solution_transfer_05.mpirun=4.debug
 9838/10570 Test  #8296: mpi/renumber_cuthill_mckee_02.mpirun=4.release ..................................   Passed   32.67 sec
            Start  8338: mpi/solution_transfer_05.mpirun=4.release
 9839/10570 Test  #8315: mpi/renumber_z_order_05.mpirun=4.debug ..........................................   Passed   30.80 sec
            Start  8363: mpi/tria_copy_triangulation.mpirun=4.debug
 9840/10570 Test  #8295: mpi/renumber_cuthill_mckee_02.mpirun=4.debug ....................................   Passed   35.41 sec
            Start  8364: mpi/tria_copy_triangulation.mpirun=4.release
 9841/10570 Test  #8338: mpi/solution_transfer_05.mpirun=4.release .......................................   Passed    6.43 sec
            Start  8401: mpi/tria_signals_06.mpirun=4.debug
 9842/10570 Test  #8337: mpi/solution_transfer_05.mpirun=4.debug .........................................   Passed    8.28 sec
            Start  8402: mpi/tria_signals_06.mpirun=4.release
 9843/10570 Test  #8363: mpi/tria_copy_triangulation.mpirun=4.debug ......................................   Passed    6.65 sec
            Start  8505: mpi/trilinos_vector_ghosts_01.mpirun=4.debug
 9844/10570 Test  #8364: mpi/tria_copy_triangulation.mpirun=4.release ....................................   Passed    6.37 sec
            Start  8506: mpi/trilinos_vector_ghosts_01.mpirun=4.release
 9845/10570 Test  #8318: mpi/renumber_z_order_06.mpirun=4.release ........................................   Passed   24.25 sec
            Start  8592: multigrid/renumbering_05.mpirun=5.debug
 9846/10570 Test  #8317: mpi/renumber_z_order_06.mpirun=4.debug ..........................................   Passed   30.20 sec
            Start  8593: multigrid/renumbering_05.mpirun=5.release
 9847/10570 Test  #8506: mpi/trilinos_vector_ghosts_01.mpirun=4.release ..................................   Passed   24.70 sec
            Start  8678: multigrid/transfer_matrix_free_02.mpirun=5.debug
 9848/10570 Test  #8402: mpi/tria_signals_06.mpirun=4.release ............................................   Passed   29.42 sec
            Start  8679: multigrid/transfer_matrix_free_02.mpirun=5.release
 9849/10570 Test  #8505: mpi/trilinos_vector_ghosts_01.mpirun=4.debug ....................................   Passed   30.54 sec
            Start  8680: multigrid/transfer_matrix_free_02_block.mpirun=5.debug
 9850/10570 Test  #8592: multigrid/renumbering_05.mpirun=5.debug .........................................   Passed   50.65 sec
            Start  8681: multigrid/transfer_matrix_free_02_block.mpirun=5.release
 9851/10570 Test  #8593: multigrid/renumbering_05.mpirun=5.release .......................................   Passed   53.51 sec
            Start  8682: multigrid/transfer_matrix_free_02_block_02.mpirun=5.debug
 9852/10570 Test  #8679: multigrid/transfer_matrix_free_02.mpirun=5.release ..............................   Passed   90.46 sec
            Start  8683: multigrid/transfer_matrix_free_02_block_02.mpirun=5.release
 9853/10570 Test  #8401: mpi/tria_signals_06.mpirun=4.debug ..............................................   Passed  226.61 sec
            Start  8684: multigrid/transfer_matrix_free_03.mpirun=5.debug
 9854/10570 Test  #8681: multigrid/transfer_matrix_free_02_block.mpirun=5.release ........................   Passed  221.15 sec
            Start  8685: multigrid/transfer_matrix_free_03.mpirun=5.release
 9855/10570 Test  #8678: multigrid/transfer_matrix_free_02.mpirun=5.debug ................................   Passed  379.71 sec
            Start  8694: multigrid/transfer_matrix_free_05.mpirun=5.debug
 9856/10570 Test  #8683: multigrid/transfer_matrix_free_02_block_02.mpirun=5.release .....................   Passed  334.60 sec
            Start  8695: multigrid/transfer_matrix_free_05.mpirun=5.release
 9857/10570 Test  #8680: multigrid/transfer_matrix_free_02_block.mpirun=5.debug ..........................   Passed  441.10 sec
            Start  8700: multigrid/transfer_matrix_free_07.mpirun=5.debug
 9858/10570 Test  #8695: multigrid/transfer_matrix_free_05.mpirun=5.release ..............................   Passed  139.78 sec
            Start  8701: multigrid/transfer_matrix_free_07.mpirun=5.release
 9859/10570 Test  #8682: multigrid/transfer_matrix_free_02_block_02.mpirun=5.debug .......................***Timeout 600.23 sec
            Start  9006: numerics/project_parallel_q_01.mpirun=4.debug
 9860/10570 Test  #9006: numerics/project_parallel_q_01.mpirun=4.debug ...................................   Passed   66.58 sec
            Start  9007: numerics/project_parallel_q_01.mpirun=4.release
 9861/10570 Test  #9007: numerics/project_parallel_q_01.mpirun=4.release .................................   Passed   31.38 sec
            Start  9008: numerics/project_parallel_q_02.mpirun=4.debug
 9862/10570 Test  #8694: multigrid/transfer_matrix_free_05.mpirun=5.debug ................................   Passed  397.22 sec
            Start  9009: numerics/project_parallel_q_02.mpirun=4.release
 9863/10570 Test  #8701: multigrid/transfer_matrix_free_07.mpirun=5.release ..............................   Passed  218.42 sec
            Start  9010: numerics/project_parallel_q_03.mpirun=4.debug
 9864/10570 Test  #8684: multigrid/transfer_matrix_free_03.mpirun=5.debug ................................***Timeout 600.10 sec
            Start  9011: numerics/project_parallel_q_03.mpirun=4.release
 9865/10570 Test  #8685: multigrid/transfer_matrix_free_03.mpirun=5.release ..............................   Passed  544.24 sec
            Start  9012: numerics/project_parallel_q_04.mpirun=4.debug
 9866/10570 Test  #9008: numerics/project_parallel_q_02.mpirun=4.debug ...................................   Passed   71.96 sec
            Start  9013: numerics/project_parallel_q_04.mpirun=4.release
 9867/10570 Test  #9009: numerics/project_parallel_q_02.mpirun=4.release .................................   Passed   46.37 sec
            Start  9014: numerics/project_parallel_q_05.mpirun=4.debug
 9868/10570 Test  #8700: multigrid/transfer_matrix_free_07.mpirun=5.debug ................................   Passed  379.76 sec
            Start  9015: numerics/project_parallel_q_05.mpirun=4.release
 9869/10570 Test  #9010: numerics/project_parallel_q_03.mpirun=4.debug ...................................   Passed   48.60 sec
            Start 10037: trilinos/assemble_matrix_parallel_02.mpirun=4.debug
 9870/10570 Test  #9011: numerics/project_parallel_q_03.mpirun=4.release .................................   Passed   36.64 sec
            Start 10038: trilinos/assemble_matrix_parallel_02.mpirun=4.release
 9871/10570 Test  #9012: numerics/project_parallel_q_04.mpirun=4.debug ...................................   Passed   36.14 sec
            Start 10039: trilinos/assemble_matrix_parallel_03.mpirun=4.debug
 9872/10570 Test #10038: trilinos/assemble_matrix_parallel_02.mpirun=4.release ...........................   Passed    6.23 sec
            Start 10040: trilinos/assemble_matrix_parallel_03.mpirun=4.release
 9873/10570 Test  #9013: numerics/project_parallel_q_04.mpirun=4.release .................................   Passed   34.16 sec
            Start 10041: trilinos/assemble_matrix_parallel_04.mpirun=4.debug
 9874/10570 Test #10037: trilinos/assemble_matrix_parallel_02.mpirun=4.debug .............................   Passed   16.97 sec
            Start 10042: trilinos/assemble_matrix_parallel_04.mpirun=4.release
 9875/10570 Test  #9014: numerics/project_parallel_q_05.mpirun=4.debug ...................................   Passed   34.84 sec
            Start 10045: trilinos/assemble_matrix_parallel_05.mpirun=4.debug
 9876/10570 Test  #9015: numerics/project_parallel_q_05.mpirun=4.release .................................   Passed   33.04 sec
            Start 10046: trilinos/assemble_matrix_parallel_05.mpirun=4.release
 9877/10570 Test #10046: trilinos/assemble_matrix_parallel_05.mpirun=4.release ...........................   Passed    5.83 sec
            Start 10047: trilinos/assemble_matrix_parallel_06.mpirun=4.debug
 9878/10570 Test #10045: trilinos/assemble_matrix_parallel_05.mpirun=4.debug .............................   Passed   14.58 sec
            Start 10048: trilinos/assemble_matrix_parallel_06.mpirun=4.release
 9879/10570 Test #10040: trilinos/assemble_matrix_parallel_03.mpirun=4.release ...........................   Passed   34.68 sec
            Start 10049: trilinos/assemble_matrix_parallel_07.mpirun=4.debug
 9880/10570 Test #10039: trilinos/assemble_matrix_parallel_03.mpirun=4.debug .............................   Passed   44.89 sec
            Start 10050: trilinos/assemble_matrix_parallel_07.mpirun=4.release
 9881/10570 Test #10042: trilinos/assemble_matrix_parallel_04.mpirun=4.release ...........................   Passed   42.86 sec
            Start 10073: trilinos/copy_to_dealvec_block.mpirun=4.debug
 9882/10570 Test #10041: trilinos/assemble_matrix_parallel_04.mpirun=4.debug .............................   Passed   51.06 sec
            Start 10074: trilinos/copy_to_dealvec_block.mpirun=4.release
 9883/10570 Test #10048: trilinos/assemble_matrix_parallel_06.mpirun=4.release ...........................   Passed   44.72 sec
            Start 10285: trilinos/trilinos_sparsity_pattern_02.mpirun=4.debug
 9884/10570 Test #10047: trilinos/assemble_matrix_parallel_06.mpirun=4.debug .............................   Passed   52.09 sec
            Start 10286: trilinos/trilinos_sparsity_pattern_02.mpirun=4.release
 9885/10570 Test #10073: trilinos/copy_to_dealvec_block.mpirun=4.debug ...................................   Passed   25.26 sec
            Start 10287: trilinos/trilinos_sparsity_pattern_03.mpirun=4.debug
 9886/10570 Test #10074: trilinos/copy_to_dealvec_block.mpirun=4.release .................................   Passed   20.56 sec
            Start 10288: trilinos/trilinos_sparsity_pattern_03.mpirun=4.release
 9887/10570 Test #10050: trilinos/assemble_matrix_parallel_07.mpirun=4.release ...........................   Passed   43.65 sec
 9888/10570 Test #10049: trilinos/assemble_matrix_parallel_07.mpirun=4.debug .............................   Passed   57.72 sec
            Start  1514: base/mpi_all_gather_01.mpirun=6.debug
 9889/10570 Test #10288: trilinos/trilinos_sparsity_pattern_03.mpirun=4.release ..........................   Passed   16.18 sec
            Start  1515: base/mpi_all_gather_01.mpirun=6.release
 9890/10570 Test  #1514: base/mpi_all_gather_01.mpirun=6.debug ...........................................   Passed    5.12 sec
            Start  1534: base/mpi_gather_01.mpirun=6.debug
 9891/10570 Test #10287: trilinos/trilinos_sparsity_pattern_03.mpirun=4.debug ............................   Passed   19.90 sec
 9892/10570 Test  #1515: base/mpi_all_gather_01.mpirun=6.release .........................................   Passed    4.66 sec
            Start  7807: mpi/mg_04.mpirun=10.debug
 9893/10570 Test  #1534: base/mpi_gather_01.mpirun=6.debug ...............................................   Passed    4.72 sec
            Start  1535: base/mpi_gather_01.mpirun=6.release
 9894/10570 Test #10286: trilinos/trilinos_sparsity_pattern_02.mpirun=4.release ..........................   Passed   27.26 sec
 9895/10570 Test #10285: trilinos/trilinos_sparsity_pattern_02.mpirun=4.debug ............................   Passed   28.66 sec
            Start  1552: base/mpi_some_to_some_01.mpirun=6.debug
 9896/10570 Test  #7807: mpi/mg_04.mpirun=10.debug .......................................................   Passed    7.59 sec
            Start  8532: multigrid/distribute_bug_01.mpirun=13.debug
 9897/10570 Test  #1535: base/mpi_gather_01.mpirun=6.release .............................................   Passed    5.82 sec
            Start  7809: mpi/mg_04.mpirun=2.debug
 9898/10570 Test  #1552: base/mpi_some_to_some_01.mpirun=6.debug .........................................   Passed    5.12 sec
            Start  7808: mpi/mg_04.mpirun=10.release
 9899/10570 Test  #7809: mpi/mg_04.mpirun=2.debug ........................................................   Passed    3.97 sec
 9900/10570 Test  #7808: mpi/mg_04.mpirun=10.release .....................................................   Passed    5.05 sec
            Start  8533: multigrid/distribute_bug_01.mpirun=13.release
 9901/10570 Test  #8533: multigrid/distribute_bug_01.mpirun=13.release ...................................   Passed   37.90 sec
            Start  7977: mpi/p4est_3d_refine_04.mpirun=10.debug
            Start  8535: multigrid/distribute_bug_01.mpirun=2.release
 9902/10570 Test  #8535: multigrid/distribute_bug_01.mpirun=2.release ....................................   Passed    3.27 sec
            Start  7810: mpi/mg_04.mpirun=2.release
 9903/10570 Test  #8532: multigrid/distribute_bug_01.mpirun=13.debug .....................................   Passed   53.58 sec
            Start  7978: mpi/p4est_3d_refine_04.mpirun=10.release
            Start  8534: multigrid/distribute_bug_01.mpirun=2.debug
 9904/10570 Test  #7810: mpi/mg_04.mpirun=2.release ......................................................   Passed    6.86 sec
 9905/10570 Test  #8534: multigrid/distribute_bug_01.mpirun=2.debug ......................................   Passed   11.97 sec
            Start  7811: mpi/mg_04.mpirun=4.debug
 9906/10570 Test  #7978: mpi/p4est_3d_refine_04.mpirun=10.release ........................................   Passed   12.06 sec
            Start  8215: mpi/point_to_point_pattern_01.mpirun=10.debug
 9907/10570 Test  #7977: mpi/p4est_3d_refine_04.mpirun=10.debug ..........................................   Passed   21.95 sec
            Start  8216: mpi/point_to_point_pattern_01.mpirun=10.release
 9908/10570 Test  #7811: mpi/mg_04.mpirun=4.debug ........................................................   Passed    4.28 sec
            Start  7812: mpi/mg_04.mpirun=4.release
 9909/10570 Test  #7812: mpi/mg_04.mpirun=4.release ......................................................   Passed    3.85 sec
 9910/10570 Test  #8216: mpi/point_to_point_pattern_01.mpirun=10.release .................................   Passed   13.72 sec
            Start  8279: mpi/refinement_listener_01.mpirun=10.debug
            Start  8218: mpi/point_to_point_pattern_01.mpirun=3.release
 9911/10570 Test  #8215: mpi/point_to_point_pattern_01.mpirun=10.debug ...................................   Passed   16.25 sec
            Start  8280: mpi/refinement_listener_01.mpirun=10.release
            Start  8217: mpi/point_to_point_pattern_01.mpirun=3.debug
 9912/10570 Test  #8218: mpi/point_to_point_pattern_01.mpirun=3.release ..................................   Passed    4.03 sec
 9913/10570 Test  #8217: mpi/point_to_point_pattern_01.mpirun=3.debug ....................................   Passed    3.87 sec
            Start  8219: mpi/point_to_point_pattern_01.mpirun=4.debug
 9914/10570 Test  #8219: mpi/point_to_point_pattern_01.mpirun=4.debug ....................................   Passed    3.86 sec
            Start  8220: mpi/point_to_point_pattern_01.mpirun=4.release
 9915/10570 Test  #8220: mpi/point_to_point_pattern_01.mpirun=4.release ..................................   Passed    3.85 sec
 9916/10570 Test  #8280: mpi/refinement_listener_01.mpirun=10.release ....................................   Passed   22.85 sec
            Start  8285: mpi/refinement_listener_02.mpirun=10.debug
 9917/10570 Test  #8279: mpi/refinement_listener_01.mpirun=10.debug ......................................   Passed   28.37 sec
            Start  8286: mpi/refinement_listener_02.mpirun=10.release
 9918/10570 Test  #8286: mpi/refinement_listener_02.mpirun=10.release ....................................   Passed   28.94 sec
            Start  8325: mpi/simple_mpi_01.mpirun=10.debug
 9919/10570 Test  #8285: mpi/refinement_listener_02.mpirun=10.debug ......................................   Passed   33.22 sec
            Start  8326: mpi/simple_mpi_01.mpirun=10.release
 9920/10570 Test  #8326: mpi/simple_mpi_01.mpirun=10.release .............................................   Passed   13.45 sec
            Start  8353: mpi/tria_01.mpirun=10.debug
            Start  8328: mpi/simple_mpi_01.mpirun=3.release
 9921/10570 Test  #8325: mpi/simple_mpi_01.mpirun=10.debug ...............................................   Passed   16.18 sec
            Start  8354: mpi/tria_01.mpirun=10.release
            Start  8327: mpi/simple_mpi_01.mpirun=3.debug
 9922/10570 Test  #8328: mpi/simple_mpi_01.mpirun=3.release ..............................................   Passed    5.46 sec
 9923/10570 Test  #8327: mpi/simple_mpi_01.mpirun=3.debug ................................................   Passed    4.04 sec
            Start  8329: mpi/simple_mpi_01.mpirun=4.debug
 9924/10570 Test  #8329: mpi/simple_mpi_01.mpirun=4.debug ................................................   Passed    4.00 sec
            Start  8330: mpi/simple_mpi_01.mpirun=4.release
 9925/10570 Test  #8330: mpi/simple_mpi_01.mpirun=4.release ..............................................   Passed    3.60 sec
 9926/10570 Test  #8354: mpi/tria_01.mpirun=10.release ...................................................   Passed   22.19 sec
            Start  8417: mpi/trilinos_distribute_01.mpirun=10.debug
            Start  8356: mpi/tria_01.mpirun=2.release
 9927/10570 Test  #8353: mpi/tria_01.mpirun=10.debug .....................................................   Passed   27.47 sec
            Start  8418: mpi/trilinos_distribute_01.mpirun=10.release
            Start  8355: mpi/tria_01.mpirun=2.debug
 9928/10570 Test  #8356: mpi/tria_01.mpirun=2.release ....................................................   Passed    5.19 sec
 9929/10570 Test  #8417: mpi/trilinos_distribute_01.mpirun=10.debug ......................................   Passed    6.94 sec
            Start  8425: mpi/trilinos_distribute_01_block.mpirun=10.debug
            Start  8419: mpi/trilinos_distribute_01.mpirun=2.debug
 9930/10570 Test  #8355: mpi/tria_01.mpirun=2.debug ......................................................   Passed    6.14 sec
 9931/10570 Test  #8418: mpi/trilinos_distribute_01.mpirun=10.release ....................................   Passed    7.02 sec
            Start  8426: mpi/trilinos_distribute_01_block.mpirun=10.release
            Start  8420: mpi/trilinos_distribute_01.mpirun=2.release
 9932/10570 Test  #8419: mpi/trilinos_distribute_01.mpirun=2.debug .......................................   Passed    5.29 sec
 9933/10570 Test  #8425: mpi/trilinos_distribute_01_block.mpirun=10.debug ................................   Passed    8.70 sec
            Start  8433: mpi/trilinos_distribute_01_inhomogenous.mpirun=10.debug
            Start  8427: mpi/trilinos_distribute_01_block.mpirun=2.debug
 9934/10570 Test  #8420: mpi/trilinos_distribute_01.mpirun=2.release .....................................   Passed    6.68 sec
 9935/10570 Test  #8426: mpi/trilinos_distribute_01_block.mpirun=10.release ..............................   Passed    7.68 sec
            Start  8434: mpi/trilinos_distribute_01_inhomogenous.mpirun=10.release
            Start  8428: mpi/trilinos_distribute_01_block.mpirun=2.release
 9936/10570 Test  #8427: mpi/trilinos_distribute_01_block.mpirun=2.debug .................................   Passed    6.96 sec
 9937/10570 Test  #8433: mpi/trilinos_distribute_01_inhomogenous.mpirun=10.debug .........................   Passed    7.44 sec
            Start  3171: distributed_grids/grid_tools_exchange_bounding_boxes_1.mpirun=12.debug
 9938/10570 Test  #8428: mpi/trilinos_distribute_01_block.mpirun=2.release ...............................   Passed    5.95 sec
            Start  8435: mpi/trilinos_distribute_01_inhomogenous.mpirun=2.debug
 9939/10570 Test  #8434: mpi/trilinos_distribute_01_inhomogenous.mpirun=10.release .......................   Passed    6.89 sec
            Start  7048: matrix_free/matrix_vector_10.mpirun=10.debug
 9940/10570 Test  #8435: mpi/trilinos_distribute_01_inhomogenous.mpirun=2.debug ..........................   Passed    6.79 sec
            Start  8436: mpi/trilinos_distribute_01_inhomogenous.mpirun=2.release
 9941/10570 Test  #8436: mpi/trilinos_distribute_01_inhomogenous.mpirun=2.release ........................   Passed    6.62 sec
 9942/10570 Test  #7048: matrix_free/matrix_vector_10.mpirun=10.debug ....................................   Passed   22.09 sec
            Start  3172: distributed_grids/grid_tools_exchange_bounding_boxes_1.mpirun=12.release
 9943/10570 Test  #3171: distributed_grids/grid_tools_exchange_bounding_boxes_1.mpirun=12.debug ..........   Passed   30.36 sec
            Start  7049: matrix_free/matrix_vector_10.mpirun=10.release
 9944/10570 Test  #7049: matrix_free/matrix_vector_10.mpirun=10.release ..................................   Passed   10.49 sec
            Start  7052: matrix_free/matrix_vector_11.mpirun=10.debug
 9945/10570 Test  #3172: distributed_grids/grid_tools_exchange_bounding_boxes_1.mpirun=12.release ........   Passed   21.93 sec
            Start  7053: matrix_free/matrix_vector_11.mpirun=10.release
            Start  3173: distributed_grids/grid_tools_exchange_bounding_boxes_1.mpirun=4.debug
 9946/10570 Test  #3173: distributed_grids/grid_tools_exchange_bounding_boxes_1.mpirun=4.debug ...........   Passed    1.26 sec
            Start  3174: distributed_grids/grid_tools_exchange_bounding_boxes_1.mpirun=4.release
 9947/10570 Test  #3174: distributed_grids/grid_tools_exchange_bounding_boxes_1.mpirun=4.release .........   Passed    1.10 sec
            Start  7050: matrix_free/matrix_vector_10.mpirun=4.debug
 9948/10570 Test  #7050: matrix_free/matrix_vector_10.mpirun=4.debug .....................................   Passed    5.46 sec
            Start  7051: matrix_free/matrix_vector_10.mpirun=4.release
 9949/10570 Test  #7051: matrix_free/matrix_vector_10.mpirun=4.release ...................................   Passed    2.00 sec
            Start  8357: mpi/tria_01.mpirun=4.debug
 9950/10570 Test  #8357: mpi/tria_01.mpirun=4.debug ......................................................   Passed    3.82 sec
            Start  8358: mpi/tria_01.mpirun=4.release
 9951/10570 Test  #8358: mpi/tria_01.mpirun=4.release ....................................................   Passed    3.80 sec
            Start  8421: mpi/trilinos_distribute_01.mpirun=4.debug
 9952/10570 Test  #8421: mpi/trilinos_distribute_01.mpirun=4.debug .......................................   Passed    3.66 sec
            Start  8422: mpi/trilinos_distribute_01.mpirun=4.release
 9953/10570 Test  #8422: mpi/trilinos_distribute_01.mpirun=4.release .....................................   Passed    3.78 sec
            Start  8429: mpi/trilinos_distribute_01_block.mpirun=4.debug
 9954/10570 Test  #8429: mpi/trilinos_distribute_01_block.mpirun=4.debug .................................   Passed    3.85 sec
            Start  8430: mpi/trilinos_distribute_01_block.mpirun=4.release
 9955/10570 Test  #8430: mpi/trilinos_distribute_01_block.mpirun=4.release ...............................   Passed    4.55 sec
            Start  8437: mpi/trilinos_distribute_01_inhomogenous.mpirun=4.debug
 9956/10570 Test  #8437: mpi/trilinos_distribute_01_inhomogenous.mpirun=4.debug ..........................   Passed   10.23 sec
            Start  8438: mpi/trilinos_distribute_01_inhomogenous.mpirun=4.release
 9957/10570 Test  #8438: mpi/trilinos_distribute_01_inhomogenous.mpirun=4.release ........................   Passed   10.96 sec
 9958/10570 Test  #7053: matrix_free/matrix_vector_11.mpirun=10.release ..................................   Passed   88.21 sec
            Start  7058: matrix_free/matrix_vector_12.mpirun=10.debug
            Start  7055: matrix_free/matrix_vector_11.mpirun=4.release
 9959/10570 Test  #7052: matrix_free/matrix_vector_11.mpirun=10.debug ....................................   Passed   96.54 sec
            Start  7059: matrix_free/matrix_vector_12.mpirun=10.release
 9960/10570 Test  #7055: matrix_free/matrix_vector_11.mpirun=4.release ...................................   Passed   11.71 sec
            Start  7054: matrix_free/matrix_vector_11.mpirun=4.debug
 9961/10570 Test  #7059: matrix_free/matrix_vector_12.mpirun=10.release ..................................   Passed   50.53 sec
            Start  7265: matrix_free/step-48.mpirun=10.debug
 9962/10570 Test  #7054: matrix_free/matrix_vector_11.mpirun=4.debug .....................................   Passed   61.91 sec
            Start  7061: matrix_free/matrix_vector_12.mpirun=3.release
 9963/10570 Test  #7058: matrix_free/matrix_vector_12.mpirun=10.debug ....................................   Passed   74.74 sec
            Start  7266: matrix_free/step-48.mpirun=10.release
            Start  7060: matrix_free/matrix_vector_12.mpirun=3.debug
 9964/10570 Test  #7061: matrix_free/matrix_vector_12.mpirun=3.release ...................................   Passed    6.56 sec
 9965/10570 Test  #7265: matrix_free/step-48.mpirun=10.debug .............................................   Passed   41.08 sec
            Start  7368: mpi/collective_01.mpirun=10.debug
 9966/10570 Test  #7060: matrix_free/matrix_vector_12.mpirun=3.debug .....................................   Passed   20.49 sec
            Start  7267: matrix_free/step-48.mpirun=4.debug
 9967/10570 Test  #7266: matrix_free/step-48.mpirun=10.release ...........................................   Passed   22.56 sec
            Start  7369: mpi/collective_01.mpirun=10.release
 9968/10570 Test  #7368: mpi/collective_01.mpirun=10.debug ...............................................   Passed    8.20 sec
            Start  7374: mpi/collective_02.mpirun=10.debug
 9969/10570 Test  #7267: matrix_free/step-48.mpirun=4.debug ..............................................   Passed    9.27 sec
            Start  7268: matrix_free/step-48.mpirun=4.release
 9970/10570 Test  #7369: mpi/collective_01.mpirun=10.release .............................................   Passed    7.60 sec
            Start  7375: mpi/collective_02.mpirun=10.release
 9971/10570 Test  #7268: matrix_free/step-48.mpirun=4.release ............................................   Passed    3.04 sec
            Start  7370: mpi/collective_01.mpirun=4.debug
 9972/10570 Test  #7374: mpi/collective_02.mpirun=10.debug ...............................................   Passed    5.34 sec
            Start  7380: mpi/collective_02_array.mpirun=10.debug
 9973/10570 Test  #7375: mpi/collective_02.mpirun=10.release .............................................   Passed    4.65 sec
            Start  7381: mpi/collective_02_array.mpirun=10.release
 9974/10570 Test  #7370: mpi/collective_01.mpirun=4.debug ................................................   Passed    4.17 sec
            Start  7371: mpi/collective_01.mpirun=4.release
 9975/10570 Test  #7380: mpi/collective_02_array.mpirun=10.debug .........................................   Passed    5.17 sec
            Start  7386: mpi/collective_02_array_in_place.mpirun=10.debug
 9976/10570 Test  #7381: mpi/collective_02_array.mpirun=10.release .......................................   Passed    4.61 sec
            Start  7387: mpi/collective_02_array_in_place.mpirun=10.release
 9977/10570 Test  #7371: mpi/collective_01.mpirun=4.release ..............................................   Passed    4.19 sec
            Start  7376: mpi/collective_02.mpirun=4.debug
 9978/10570 Test  #7386: mpi/collective_02_array_in_place.mpirun=10.debug ................................   Passed    4.87 sec
            Start  7400: mpi/collective_02_vector.mpirun=10.debug
 9979/10570 Test  #7387: mpi/collective_02_array_in_place.mpirun=10.release ..............................   Passed    4.98 sec
            Start  7401: mpi/collective_02_vector.mpirun=10.release
 9980/10570 Test  #7376: mpi/collective_02.mpirun=4.debug ................................................   Passed    4.63 sec
            Start  7377: mpi/collective_02.mpirun=4.release
 9981/10570 Test  #7400: mpi/collective_02_vector.mpirun=10.debug ........................................   Passed    4.89 sec
            Start  7406: mpi/collective_02_vector_in_place.mpirun=10.debug
 9982/10570 Test  #7401: mpi/collective_02_vector.mpirun=10.release ......................................   Passed    4.68 sec
            Start  7407: mpi/collective_02_vector_in_place.mpirun=10.release
 9983/10570 Test  #7377: mpi/collective_02.mpirun=4.release ..............................................   Passed    4.38 sec
            Start  7382: mpi/collective_02_array.mpirun=4.debug
 9984/10570 Test  #7406: mpi/collective_02_vector_in_place.mpirun=10.debug ...............................   Passed    5.08 sec
            Start  7412: mpi/collective_full_matrix.mpirun=10.debug
 9985/10570 Test  #7407: mpi/collective_02_vector_in_place.mpirun=10.release .............................   Passed    5.19 sec
            Start  7413: mpi/collective_full_matrix.mpirun=10.release
 9986/10570 Test  #7382: mpi/collective_02_array.mpirun=4.debug ..........................................   Passed    4.33 sec
            Start  7383: mpi/collective_02_array.mpirun=4.release
 9987/10570 Test  #7412: mpi/collective_full_matrix.mpirun=10.debug ......................................   Passed    5.49 sec
            Start  7422: mpi/collective_max.mpirun=10.debug
 9988/10570 Test  #7383: mpi/collective_02_array.mpirun=4.release ........................................   Passed    4.98 sec
            Start  7388: mpi/collective_02_array_in_place.mpirun=4.debug
 9989/10570 Test  #7413: mpi/collective_full_matrix.mpirun=10.release ....................................   Passed    5.52 sec
            Start  7423: mpi/collective_max.mpirun=10.release
 9990/10570 Test  #7422: mpi/collective_max.mpirun=10.debug ..............................................   Passed    5.20 sec
            Start  7428: mpi/collective_max_array.mpirun=10.debug
 9991/10570 Test  #7388: mpi/collective_02_array_in_place.mpirun=4.debug .................................   Passed    4.98 sec
            Start  7389: mpi/collective_02_array_in_place.mpirun=4.release
 9992/10570 Test  #7423: mpi/collective_max.mpirun=10.release ............................................   Passed    4.76 sec
            Start  7429: mpi/collective_max_array.mpirun=10.release
 9993/10570 Test  #7428: mpi/collective_max_array.mpirun=10.debug ........................................   Passed    5.39 sec
            Start  7434: mpi/collective_max_array_in_place.mpirun=10.debug
 9994/10570 Test  #7429: mpi/collective_max_array.mpirun=10.release ......................................   Passed    5.43 sec
            Start  7435: mpi/collective_max_array_in_place.mpirun=10.release
 9995/10570 Test  #7389: mpi/collective_02_array_in_place.mpirun=4.release ...............................   Passed    5.48 sec
            Start  7402: mpi/collective_02_vector.mpirun=4.debug
 9996/10570 Test  #7434: mpi/collective_max_array_in_place.mpirun=10.debug ...............................   Passed    5.22 sec
            Start  7440: mpi/collective_max_vector.mpirun=10.debug
 9997/10570 Test  #7402: mpi/collective_02_vector.mpirun=4.debug .........................................   Passed    5.05 sec
            Start  7403: mpi/collective_02_vector.mpirun=4.release
 9998/10570 Test  #7435: mpi/collective_max_array_in_place.mpirun=10.release .............................   Passed    5.25 sec
            Start  7441: mpi/collective_max_vector.mpirun=10.release
 9999/10570 Test  #7403: mpi/collective_02_vector.mpirun=4.release .......................................   Passed    4.93 sec
            Start  7408: mpi/collective_02_vector_in_place.mpirun=4.debug
10000/10570 Test  #7440: mpi/collective_max_vector.mpirun=10.debug .......................................   Passed    5.44 sec
            Start  7446: mpi/collective_max_vector_in_place.mpirun=10.debug
10001/10570 Test  #7441: mpi/collective_max_vector.mpirun=10.release .....................................   Passed    5.22 sec
            Start  7447: mpi/collective_max_vector_in_place.mpirun=10.release
10002/10570 Test  #7408: mpi/collective_02_vector_in_place.mpirun=4.debug ................................   Passed    4.85 sec
            Start  7409: mpi/collective_02_vector_in_place.mpirun=4.release
10003/10570 Test  #7446: mpi/collective_max_vector_in_place.mpirun=10.debug ..............................   Passed    5.00 sec
            Start  7454: mpi/collective_min.mpirun=10.debug
10004/10570 Test  #7447: mpi/collective_max_vector_in_place.mpirun=10.release ............................   Passed    4.96 sec
            Start  7455: mpi/collective_min.mpirun=10.release
10005/10570 Test  #7409: mpi/collective_02_vector_in_place.mpirun=4.release ..............................   Passed    3.78 sec
            Start  7414: mpi/collective_full_matrix.mpirun=3.debug
            Start  7415: mpi/collective_full_matrix.mpirun=3.release
10006/10570 Test  #7455: mpi/collective_min.mpirun=10.release ............................................   Passed    4.99 sec
            Start  7460: mpi/collective_min_array.mpirun=10.debug
10007/10570 Test  #7454: mpi/collective_min.mpirun=10.debug ..............................................   Passed    5.27 sec
            Start  7461: mpi/collective_min_array.mpirun=10.release
10008/10570 Test  #7414: mpi/collective_full_matrix.mpirun=3.debug .......................................   Passed    4.69 sec
10009/10570 Test  #7415: mpi/collective_full_matrix.mpirun=3.release .....................................   Passed    4.81 sec
            Start  7424: mpi/collective_max.mpirun=4.debug
10010/10570 Test  #7460: mpi/collective_min_array.mpirun=10.debug ........................................   Passed    5.15 sec
            Start  7466: mpi/collective_min_array_in_place.mpirun=10.debug
10011/10570 Test  #7461: mpi/collective_min_array.mpirun=10.release ......................................   Passed    4.97 sec
            Start  7467: mpi/collective_min_array_in_place.mpirun=10.release
10012/10570 Test  #7424: mpi/collective_max.mpirun=4.debug ...............................................   Passed    4.52 sec
            Start  7425: mpi/collective_max.mpirun=4.release
10013/10570 Test  #7467: mpi/collective_min_array_in_place.mpirun=10.release .............................   Passed    4.93 sec
            Start  7472: mpi/collective_min_vector.mpirun=10.debug
10014/10570 Test  #7466: mpi/collective_min_array_in_place.mpirun=10.debug ...............................   Passed    5.27 sec
            Start  7473: mpi/collective_min_vector.mpirun=10.release
10015/10570 Test  #7425: mpi/collective_max.mpirun=4.release .............................................   Passed    4.61 sec
            Start  7430: mpi/collective_max_array.mpirun=4.debug
10016/10570 Test  #7473: mpi/collective_min_vector.mpirun=10.release .....................................   Passed    4.88 sec
            Start  7478: mpi/collective_min_vector_in_place.mpirun=10.debug
10017/10570 Test  #7472: mpi/collective_min_vector.mpirun=10.debug .......................................   Passed    5.27 sec
            Start  7479: mpi/collective_min_vector_in_place.mpirun=10.release
10018/10570 Test  #7430: mpi/collective_max_array.mpirun=4.debug .........................................   Passed    4.45 sec
            Start  7431: mpi/collective_max_array.mpirun=4.release
10019/10570 Test  #7479: mpi/collective_min_vector_in_place.mpirun=10.release ............................   Passed    4.95 sec
            Start  7488: mpi/collective_tensor.mpirun=10.debug
10020/10570 Test  #7478: mpi/collective_min_vector_in_place.mpirun=10.debug ..............................   Passed    5.25 sec
            Start  7489: mpi/collective_tensor.mpirun=10.release
10021/10570 Test  #7431: mpi/collective_max_array.mpirun=4.release .......................................   Passed    4.60 sec
            Start  7436: mpi/collective_max_array_in_place.mpirun=4.debug
10022/10570 Test  #7489: mpi/collective_tensor.mpirun=10.release .........................................   Passed    5.75 sec
            Start  7514: mpi/compute_mean_value.mpirun=10.debug
10023/10570 Test  #7488: mpi/collective_tensor.mpirun=10.debug ...........................................   Passed    5.98 sec
            Start  7515: mpi/compute_mean_value.mpirun=10.release
10024/10570 Test  #7436: mpi/collective_max_array_in_place.mpirun=4.debug ................................   Passed    5.48 sec
            Start  7437: mpi/collective_max_array_in_place.mpirun=4.release
10025/10570 Test  #7437: mpi/collective_max_array_in_place.mpirun=4.release ..............................   Passed    3.86 sec
            Start  7442: mpi/collective_max_vector.mpirun=4.debug
10026/10570 Test  #7442: mpi/collective_max_vector.mpirun=4.debug ........................................   Passed    3.86 sec
            Start  7443: mpi/collective_max_vector.mpirun=4.release
10027/10570 Test  #7443: mpi/collective_max_vector.mpirun=4.release ......................................   Passed    3.60 sec
            Start  7448: mpi/collective_max_vector_in_place.mpirun=4.debug
10028/10570 Test  #7448: mpi/collective_max_vector_in_place.mpirun=4.debug ...............................   Passed    4.02 sec
            Start  7449: mpi/collective_max_vector_in_place.mpirun=4.release
10029/10570 Test  #7449: mpi/collective_max_vector_in_place.mpirun=4.release .............................   Passed    3.83 sec
            Start  7456: mpi/collective_min.mpirun=4.debug
10030/10570 Test  #7456: mpi/collective_min.mpirun=4.debug ...............................................   Passed    4.97 sec
            Start  7457: mpi/collective_min.mpirun=4.release
10031/10570 Test  #7515: mpi/compute_mean_value.mpirun=10.release ........................................   Passed   32.59 sec
            Start  7524: mpi/constraint_matrix_trilinos_bug.mpirun=10.debug
10032/10570 Test  #7457: mpi/collective_min.mpirun=4.release .............................................   Passed   10.58 sec
            Start  7462: mpi/collective_min_array.mpirun=4.debug
10033/10570 Test  #7514: mpi/compute_mean_value.mpirun=10.debug ..........................................   Passed   36.82 sec
            Start  7530: mpi/count_dofs_per_block_01.mpirun=10.debug
10034/10570 Test  #7462: mpi/collective_min_array.mpirun=4.debug .........................................   Passed    4.42 sec
            Start  7463: mpi/collective_min_array.mpirun=4.release
10035/10570 Test  #7463: mpi/collective_min_array.mpirun=4.release .......................................   Passed    3.82 sec
            Start  7468: mpi/collective_min_array_in_place.mpirun=4.debug
10036/10570 Test  #7468: mpi/collective_min_array_in_place.mpirun=4.debug ................................   Passed    3.82 sec
            Start  7469: mpi/collective_min_array_in_place.mpirun=4.release
10037/10570 Test  #7469: mpi/collective_min_array_in_place.mpirun=4.release ..............................   Passed    4.20 sec
            Start  7474: mpi/collective_min_vector.mpirun=4.debug
10038/10570 Test  #7474: mpi/collective_min_vector.mpirun=4.debug ........................................   Passed    3.75 sec
            Start  7475: mpi/collective_min_vector.mpirun=4.release
10039/10570 Test  #7475: mpi/collective_min_vector.mpirun=4.release ......................................   Passed    3.77 sec
            Start  7480: mpi/collective_min_vector_in_place.mpirun=4.debug
10040/10570 Test  #7524: mpi/constraint_matrix_trilinos_bug.mpirun=10.debug ..............................   Passed   34.90 sec
            Start  7531: mpi/count_dofs_per_block_01.mpirun=10.release
10041/10570 Test  #7480: mpi/collective_min_vector_in_place.mpirun=4.debug ...............................   Passed    8.81 sec
            Start  7481: mpi/collective_min_vector_in_place.mpirun=4.release
10042/10570 Test  #7481: mpi/collective_min_vector_in_place.mpirun=4.release .............................   Passed    7.51 sec
            Start  7490: mpi/collective_tensor.mpirun=4.debug
10043/10570 Test  #7530: mpi/count_dofs_per_block_01.mpirun=10.debug .....................................   Passed   41.49 sec
            Start  7534: mpi/count_dofs_per_block_02.mpirun=10.debug
10044/10570 Test  #7490: mpi/collective_tensor.mpirun=4.debug ............................................   Passed    4.81 sec
            Start  7491: mpi/collective_tensor.mpirun=4.release
10045/10570 Test  #7491: mpi/collective_tensor.mpirun=4.release ..........................................   Passed    3.61 sec
            Start  7516: mpi/compute_mean_value.mpirun=4.debug
10046/10570 Test  #7516: mpi/compute_mean_value.mpirun=4.debug ...........................................   Passed    4.87 sec
            Start  7517: mpi/compute_mean_value.mpirun=4.release
10047/10570 Test  #7517: mpi/compute_mean_value.mpirun=4.release .........................................   Passed    3.88 sec
            Start  7525: mpi/constraint_matrix_trilinos_bug.mpirun=4.debug
10048/10570 Test  #7531: mpi/count_dofs_per_block_01.mpirun=10.release ...................................   Passed   30.51 sec
            Start  7535: mpi/count_dofs_per_block_02.mpirun=10.release
10049/10570 Test  #7525: mpi/constraint_matrix_trilinos_bug.mpirun=4.debug ...............................   Passed    6.02 sec
            Start  7532: mpi/count_dofs_per_block_01.mpirun=4.debug
10050/10570 Test  #7532: mpi/count_dofs_per_block_01.mpirun=4.debug ......................................   Passed   17.18 sec
            Start  7533: mpi/count_dofs_per_block_01.mpirun=4.release
10051/10570 Test  #7534: mpi/count_dofs_per_block_02.mpirun=10.debug .....................................   Passed   40.64 sec
            Start  7538: mpi/count_dofs_per_component_01.mpirun=10.debug
10052/10570 Test  #7533: mpi/count_dofs_per_block_01.mpirun=4.release ....................................   Passed    5.71 sec
            Start  7536: mpi/count_dofs_per_block_02.mpirun=4.debug
10053/10570 Test  #7536: mpi/count_dofs_per_block_02.mpirun=4.debug ......................................   Passed    6.45 sec
10054/10570 Test  #7535: mpi/count_dofs_per_block_02.mpirun=10.release ...................................   Passed   35.13 sec
            Start  7539: mpi/count_dofs_per_component_01.mpirun=10.release
            Start  7537: mpi/count_dofs_per_block_02.mpirun=4.release
10055/10570 Test  #7537: mpi/count_dofs_per_block_02.mpirun=4.release ....................................   Passed    3.99 sec
10056/10570 Test  #7538: mpi/count_dofs_per_component_01.mpirun=10.debug .................................   Passed   29.83 sec
            Start  7542: mpi/crash_01.mpirun=10.debug
            Start  7540: mpi/count_dofs_per_component_01.mpirun=4.debug
10057/10570 Test  #7540: mpi/count_dofs_per_component_01.mpirun=4.debug ..................................   Passed    4.26 sec
10058/10570 Test  #7539: mpi/count_dofs_per_component_01.mpirun=10.release ...............................   Passed   26.49 sec
            Start  7543: mpi/crash_01.mpirun=10.release
            Start  7541: mpi/count_dofs_per_component_01.mpirun=4.release
10059/10570 Test  #7541: mpi/count_dofs_per_component_01.mpirun=4.release ................................   Passed    3.86 sec
10060/10570 Test  #7542: mpi/crash_01.mpirun=10.debug ....................................................   Passed   24.30 sec
            Start  7548: mpi/crash_03.mpirun=10.debug
            Start  7544: mpi/crash_01.mpirun=4.debug
10061/10570 Test  #7544: mpi/crash_01.mpirun=4.debug .....................................................   Passed    4.26 sec
10062/10570 Test  #7543: mpi/crash_01.mpirun=10.release ..................................................   Passed   22.57 sec
            Start  7549: mpi/crash_03.mpirun=10.release
            Start  7545: mpi/crash_01.mpirun=4.release
10063/10570 Test  #7545: mpi/crash_01.mpirun=4.release ...................................................   Passed    4.00 sec
10064/10570 Test  #7548: mpi/crash_03.mpirun=10.debug ....................................................   Passed   24.43 sec
            Start  7589: mpi/distribute_sp_01.mpirun=10.debug
            Start  7550: mpi/crash_03.mpirun=4.debug
10065/10570 Test  #7549: mpi/crash_03.mpirun=10.release ..................................................   Passed   20.39 sec
            Start  7590: mpi/distribute_sp_01.mpirun=10.release
10066/10570 Test  #7550: mpi/crash_03.mpirun=4.debug .....................................................   Passed    5.23 sec
            Start  7551: mpi/crash_03.mpirun=4.release
10067/10570 Test  #7551: mpi/crash_03.mpirun=4.release ...................................................   Passed    3.93 sec
10068/10570 Test  #7589: mpi/distribute_sp_01.mpirun=10.debug ............................................   Passed   17.64 sec
            Start  7593: mpi/distribute_sp_02.mpirun=10.debug
            Start  7591: mpi/distribute_sp_01.mpirun=4.debug
10069/10570 Test  #7590: mpi/distribute_sp_01.mpirun=10.release ..........................................   Passed   14.77 sec
            Start  7594: mpi/distribute_sp_02.mpirun=10.release
10070/10570 Test  #7591: mpi/distribute_sp_01.mpirun=4.debug .............................................   Passed    4.00 sec
            Start  7592: mpi/distribute_sp_01.mpirun=4.release
10071/10570 Test  #7592: mpi/distribute_sp_01.mpirun=4.release ...........................................   Passed    3.80 sec
10072/10570 Test  #7593: mpi/distribute_sp_02.mpirun=10.debug ............................................   Passed   18.94 sec
            Start  7597: mpi/dof_handler_number_cache.mpirun=10.debug
            Start  7595: mpi/distribute_sp_02.mpirun=4.debug
10073/10570 Test  #7594: mpi/distribute_sp_02.mpirun=10.release ..........................................   Passed   17.20 sec
            Start  7598: mpi/dof_handler_number_cache.mpirun=10.release
10074/10570 Test  #7595: mpi/distribute_sp_02.mpirun=4.debug .............................................   Passed    4.15 sec
            Start  7596: mpi/distribute_sp_02.mpirun=4.release
10075/10570 Test  #7596: mpi/distribute_sp_02.mpirun=4.release ...........................................   Passed    4.00 sec
10076/10570 Test  #7598: mpi/dof_handler_number_cache.mpirun=10.release ..................................   Passed   38.26 sec
            Start  7601: mpi/extract_boundary_dofs.mpirun=10.debug
            Start  7600: mpi/dof_handler_number_cache.mpirun=4.release
10077/10570 Test  #7597: mpi/dof_handler_number_cache.mpirun=10.debug ....................................   Passed   44.85 sec
            Start  7602: mpi/extract_boundary_dofs.mpirun=10.release
10078/10570 Test  #7600: mpi/dof_handler_number_cache.mpirun=4.release ...................................   Passed    6.25 sec
            Start  7599: mpi/dof_handler_number_cache.mpirun=4.debug
10079/10570 Test  #7599: mpi/dof_handler_number_cache.mpirun=4.debug .....................................   Passed    6.38 sec
10080/10570 Test  #7601: mpi/extract_boundary_dofs.mpirun=10.debug .......................................   Passed   32.39 sec
            Start  7605: mpi/extract_constant_modes_01.mpirun=10.debug
            Start  7603: mpi/extract_boundary_dofs.mpirun=4.debug
10081/10570 Test  #7602: mpi/extract_boundary_dofs.mpirun=10.release .....................................   Passed   26.52 sec
            Start  7606: mpi/extract_constant_modes_01.mpirun=10.release
10082/10570 Test  #7603: mpi/extract_boundary_dofs.mpirun=4.debug ........................................   Passed    5.11 sec
            Start  7604: mpi/extract_boundary_dofs.mpirun=4.release
10083/10570 Test  #7604: mpi/extract_boundary_dofs.mpirun=4.release ......................................   Passed    4.33 sec
10084/10570 Test  #7606: mpi/extract_constant_modes_01.mpirun=10.release .................................   Passed   24.45 sec
            Start  7611: mpi/extract_locally_active_dofs.mpirun=10.debug
            Start  7608: mpi/extract_constant_modes_01.mpirun=4.release
10085/10570 Test  #7605: mpi/extract_constant_modes_01.mpirun=10.debug ...................................   Passed   25.06 sec
            Start  7612: mpi/extract_locally_active_dofs.mpirun=10.release
10086/10570 Test  #7608: mpi/extract_constant_modes_01.mpirun=4.release ..................................   Passed    4.02 sec
            Start  7607: mpi/extract_constant_modes_01.mpirun=4.debug
10087/10570 Test  #7607: mpi/extract_constant_modes_01.mpirun=4.debug ....................................   Passed    4.00 sec
10088/10570 Test  #7612: mpi/extract_locally_active_dofs.mpirun=10.release ...............................   Passed   25.35 sec
            Start  7615: mpi/fe_field_function_01.mpirun=10.debug
            Start  7614: mpi/extract_locally_active_dofs.mpirun=4.release
10089/10570 Test  #7611: mpi/extract_locally_active_dofs.mpirun=10.debug .................................   Passed   29.35 sec
            Start  7616: mpi/fe_field_function_01.mpirun=10.release
10090/10570 Test  #7614: mpi/extract_locally_active_dofs.mpirun=4.release ................................   Passed    5.29 sec
            Start  7613: mpi/extract_locally_active_dofs.mpirun=4.debug
10091/10570 Test  #7613: mpi/extract_locally_active_dofs.mpirun=4.debug ..................................   Passed    4.87 sec
10092/10570 Test  #7616: mpi/fe_field_function_01.mpirun=10.release ......................................   Passed   39.20 sec
            Start  7629: mpi/fe_tools_extrapolate_03.mpirun=10.debug
            Start  7618: mpi/fe_field_function_01.mpirun=4.release
10093/10570 Test  #7618: mpi/fe_field_function_01.mpirun=4.release .......................................   Passed   13.35 sec
10094/10570 Test  #7615: mpi/fe_field_function_01.mpirun=10.debug ........................................   Passed   88.75 sec
            Start  7630: mpi/fe_tools_extrapolate_03.mpirun=10.release
            Start  7617: mpi/fe_field_function_01.mpirun=4.debug
10095/10570 Test  #7617: mpi/fe_field_function_01.mpirun=4.debug .........................................   Passed   90.71 sec
10096/10570 Test  #7630: mpi/fe_tools_extrapolate_03.mpirun=10.release ...................................   Passed  152.92 sec
            Start  7691: mpi/hp_integrate_difference.mpirun=10.debug
            Start  7632: mpi/fe_tools_extrapolate_03.mpirun=3.release
10097/10570 Test  #7629: mpi/fe_tools_extrapolate_03.mpirun=10.debug .....................................   Passed  206.05 sec
            Start  7692: mpi/hp_integrate_difference.mpirun=10.release
            Start  7631: mpi/fe_tools_extrapolate_03.mpirun=3.debug
10098/10570 Test  #7632: mpi/fe_tools_extrapolate_03.mpirun=3.release ....................................   Passed    7.85 sec
10099/10570 Test  #7631: mpi/fe_tools_extrapolate_03.mpirun=3.debug ......................................   Passed    6.96 sec
10100/10570 Test  #7692: mpi/hp_integrate_difference.mpirun=10.release ...................................   Passed   36.59 sec
            Start  7737: mpi/integrate_difference.mpirun=10.debug
            Start  7694: mpi/hp_integrate_difference.mpirun=4.release
10101/10570 Test  #7691: mpi/hp_integrate_difference.mpirun=10.debug .....................................   Passed   43.78 sec
            Start  7738: mpi/integrate_difference.mpirun=10.release
10102/10570 Test  #7694: mpi/hp_integrate_difference.mpirun=4.release ....................................   Passed    4.19 sec
            Start  7693: mpi/hp_integrate_difference.mpirun=4.debug
10103/10570 Test  #7693: mpi/hp_integrate_difference.mpirun=4.debug ......................................   Passed    5.78 sec
10104/10570 Test  #7738: mpi/integrate_difference.mpirun=10.release ......................................   Passed   33.98 sec
            Start  7741: mpi/interpolate_01.mpirun=10.debug
            Start  7740: mpi/integrate_difference.mpirun=4.release
10105/10570 Test  #7737: mpi/integrate_difference.mpirun=10.debug ........................................   Passed   37.89 sec
            Start  7742: mpi/interpolate_01.mpirun=10.release
10106/10570 Test  #7740: mpi/integrate_difference.mpirun=4.release .......................................   Passed    5.63 sec
            Start  7739: mpi/integrate_difference.mpirun=4.debug
10107/10570 Test  #7739: mpi/integrate_difference.mpirun=4.debug .........................................   Passed    4.74 sec
10108/10570 Test  #7741: mpi/interpolate_01.mpirun=10.debug ..............................................   Passed   32.41 sec
            Start  7745: mpi/interpolate_03.mpirun=10.debug
            Start  7743: mpi/interpolate_01.mpirun=4.debug
10109/10570 Test  #7742: mpi/interpolate_01.mpirun=10.release ............................................   Passed   28.64 sec
            Start  7746: mpi/interpolate_03.mpirun=10.release
10110/10570 Test  #7743: mpi/interpolate_01.mpirun=4.debug ...............................................   Passed    4.33 sec
            Start  7744: mpi/interpolate_01.mpirun=4.release
10111/10570 Test  #7744: mpi/interpolate_01.mpirun=4.release .............................................   Passed    3.82 sec
10112/10570 Test  #7746: mpi/interpolate_03.mpirun=10.release ............................................   Passed   21.12 sec
            Start  7755: mpi/is_locally_owned.mpirun=10.debug
            Start  7748: mpi/interpolate_03.mpirun=4.release
10113/10570 Test  #7745: mpi/interpolate_03.mpirun=10.debug ..............................................   Passed   26.18 sec
            Start  7756: mpi/is_locally_owned.mpirun=10.release
10114/10570 Test  #7748: mpi/interpolate_03.mpirun=4.release .............................................   Passed    5.25 sec
            Start  7747: mpi/interpolate_03.mpirun=4.debug
10115/10570 Test  #7747: mpi/interpolate_03.mpirun=4.debug ...............................................   Passed    4.42 sec
10116/10570 Test  #7755: mpi/is_locally_owned.mpirun=10.debug ............................................   Passed   25.71 sec
            Start  7765: mpi/make_zero_boundary_values.mpirun=10.debug
            Start  7757: mpi/is_locally_owned.mpirun=4.debug
10117/10570 Test  #7756: mpi/is_locally_owned.mpirun=10.release ..........................................   Passed   22.49 sec
            Start  7766: mpi/make_zero_boundary_values.mpirun=10.release
10118/10570 Test  #7757: mpi/is_locally_owned.mpirun=4.debug .............................................   Passed    4.42 sec
            Start  7758: mpi/is_locally_owned.mpirun=4.release
10119/10570 Test  #7758: mpi/is_locally_owned.mpirun=4.release ...........................................   Passed    4.08 sec
10120/10570 Test  #7766: mpi/make_zero_boundary_values.mpirun=10.release .................................   Passed   28.00 sec
            Start  7769: mpi/map_dofs_to_support_points.mpirun=10.debug
            Start  7768: mpi/make_zero_boundary_values.mpirun=4.release
10121/10570 Test  #7765: mpi/make_zero_boundary_values.mpirun=10.debug ...................................   Passed   29.84 sec
            Start  7770: mpi/map_dofs_to_support_points.mpirun=10.release
10122/10570 Test  #7768: mpi/make_zero_boundary_values.mpirun=4.release ..................................   Passed    4.20 sec
            Start  7767: mpi/make_zero_boundary_values.mpirun=4.debug
10123/10570 Test  #7767: mpi/make_zero_boundary_values.mpirun=4.debug ....................................   Passed    4.98 sec
10124/10570 Test  #7770: mpi/map_dofs_to_support_points.mpirun=10.release ................................   Passed   25.89 sec
            Start  7791: mpi/mg_01.mpirun=10.debug
            Start  7772: mpi/map_dofs_to_support_points.mpirun=4.release
10125/10570 Test  #7769: mpi/map_dofs_to_support_points.mpirun=10.debug ..................................   Passed   27.56 sec
            Start  7792: mpi/mg_01.mpirun=10.release
10126/10570 Test  #7772: mpi/map_dofs_to_support_points.mpirun=4.release .................................   Passed    4.87 sec
            Start  7771: mpi/map_dofs_to_support_points.mpirun=4.debug
10127/10570 Test  #7771: mpi/map_dofs_to_support_points.mpirun=4.debug ...................................   Passed    4.24 sec
10128/10570 Test  #7792: mpi/mg_01.mpirun=10.release .....................................................   Passed   18.97 sec
            Start  7795: mpi/mg_02.mpirun=10.debug
            Start  7794: mpi/mg_01.mpirun=4.release
10129/10570 Test  #7791: mpi/mg_01.mpirun=10.debug .......................................................   Passed   24.78 sec
            Start  7796: mpi/mg_02.mpirun=10.release
10130/10570 Test  #7794: mpi/mg_01.mpirun=4.release ......................................................   Passed    5.25 sec
            Start  7793: mpi/mg_01.mpirun=4.debug
10131/10570 Test  #7793: mpi/mg_01.mpirun=4.debug ........................................................   Passed    3.91 sec
10132/10570 Test  #7795: mpi/mg_02.mpirun=10.debug .......................................................   Passed   30.30 sec
            Start  7801: mpi/mg_03.mpirun=10.debug
            Start  7797: mpi/mg_02.mpirun=4.debug
10133/10570 Test  #7796: mpi/mg_02.mpirun=10.release .....................................................   Passed   29.13 sec
            Start  7802: mpi/mg_03.mpirun=10.release
10134/10570 Test  #7797: mpi/mg_02.mpirun=4.debug ........................................................   Passed    6.50 sec
            Start  7798: mpi/mg_02.mpirun=4.release
10135/10570 Test  #7801: mpi/mg_03.mpirun=10.debug .......................................................   Passed    7.55 sec
            Start  7871: mpi/p4est_2d_coarse_01.mpirun=10.debug
10136/10570 Test  #7802: mpi/mg_03.mpirun=10.release .....................................................   Passed    7.27 sec
            Start  7872: mpi/p4est_2d_coarse_01.mpirun=10.release
10137/10570 Test  #7798: mpi/mg_02.mpirun=4.release ......................................................   Passed    5.19 sec
            Start  7803: mpi/mg_03.mpirun=4.debug
10138/10570 Test  #7803: mpi/mg_03.mpirun=4.debug ........................................................   Passed    4.07 sec
            Start  7804: mpi/mg_03.mpirun=4.release
10139/10570 Test  #7804: mpi/mg_03.mpirun=4.release ......................................................   Passed    3.81 sec
10140/10570 Test  #7872: mpi/p4est_2d_coarse_01.mpirun=10.release ........................................   Passed   23.02 sec
            Start  7875: mpi/p4est_2d_constraintmatrix_01.mpirun=10.debug
            Start  7874: mpi/p4est_2d_coarse_01.mpirun=4.release
10141/10570 Test  #7874: mpi/p4est_2d_coarse_01.mpirun=4.release .........................................   Passed   11.75 sec
10142/10570 Test  #7871: mpi/p4est_2d_coarse_01.mpirun=10.debug ..........................................   Passed   53.17 sec
            Start  7876: mpi/p4est_2d_constraintmatrix_01.mpirun=10.release
            Start  7873: mpi/p4est_2d_coarse_01.mpirun=4.debug
10143/10570 Test  #7875: mpi/p4est_2d_constraintmatrix_01.mpirun=10.debug ................................   Passed   37.25 sec
            Start  7879: mpi/p4est_2d_constraintmatrix_02.mpirun=10.debug
10144/10570 Test  #7873: mpi/p4est_2d_coarse_01.mpirun=4.debug ...........................................   Passed   22.15 sec
            Start  7877: mpi/p4est_2d_constraintmatrix_01.mpirun=4.debug
10145/10570 Test  #7876: mpi/p4est_2d_constraintmatrix_01.mpirun=10.release ..............................   Passed   25.36 sec
            Start  7880: mpi/p4est_2d_constraintmatrix_02.mpirun=10.release
10146/10570 Test  #7877: mpi/p4est_2d_constraintmatrix_01.mpirun=4.debug .................................   Passed    5.06 sec
            Start  7878: mpi/p4est_2d_constraintmatrix_01.mpirun=4.release
10147/10570 Test  #7878: mpi/p4est_2d_constraintmatrix_01.mpirun=4.release ...............................   Passed    4.20 sec
10148/10570 Test  #7879: mpi/p4est_2d_constraintmatrix_02.mpirun=10.debug ................................   Passed   29.13 sec
            Start  7883: mpi/p4est_2d_constraintmatrix_03.mpirun=10.debug
            Start  7881: mpi/p4est_2d_constraintmatrix_02.mpirun=4.debug
10149/10570 Test  #7881: mpi/p4est_2d_constraintmatrix_02.mpirun=4.debug .................................   Passed    4.16 sec
10150/10570 Test  #7880: mpi/p4est_2d_constraintmatrix_02.mpirun=10.release ..............................   Passed   23.68 sec
            Start  7884: mpi/p4est_2d_constraintmatrix_03.mpirun=10.release
            Start  7882: mpi/p4est_2d_constraintmatrix_02.mpirun=4.release
10151/10570 Test  #7882: mpi/p4est_2d_constraintmatrix_02.mpirun=4.release ...............................   Passed    4.11 sec
10152/10570 Test  #7883: mpi/p4est_2d_constraintmatrix_03.mpirun=10.debug ................................   Passed   33.89 sec
            Start  7887: mpi/p4est_2d_constraintmatrix_04.mpirun=10.debug
            Start  7885: mpi/p4est_2d_constraintmatrix_03.mpirun=4.debug
10153/10570 Test  #7885: mpi/p4est_2d_constraintmatrix_03.mpirun=4.debug .................................   Passed   10.57 sec
10154/10570 Test  #7884: mpi/p4est_2d_constraintmatrix_03.mpirun=10.release ..............................   Passed   35.95 sec
            Start  7888: mpi/p4est_2d_constraintmatrix_04.mpirun=10.release
            Start  7886: mpi/p4est_2d_constraintmatrix_03.mpirun=4.release
10155/10570 Test  #7886: mpi/p4est_2d_constraintmatrix_03.mpirun=4.release ...............................   Passed    4.14 sec
10156/10570 Test  #7887: mpi/p4est_2d_constraintmatrix_04.mpirun=10.debug ................................   Passed   39.88 sec
            Start  7893: mpi/p4est_2d_dofhandler_01.mpirun=10.debug
            Start  7889: mpi/p4est_2d_constraintmatrix_04.mpirun=4.debug
10157/10570 Test  #7888: mpi/p4est_2d_constraintmatrix_04.mpirun=10.release ..............................   Passed   32.86 sec
            Start  7894: mpi/p4est_2d_dofhandler_01.mpirun=10.release
10158/10570 Test  #7889: mpi/p4est_2d_constraintmatrix_04.mpirun=4.debug .................................   Passed    8.27 sec
            Start  7890: mpi/p4est_2d_constraintmatrix_04.mpirun=4.release
10159/10570 Test  #7890: mpi/p4est_2d_constraintmatrix_04.mpirun=4.release ...............................   Passed    4.06 sec
10160/10570 Test  #7894: mpi/p4est_2d_dofhandler_01.mpirun=10.release ....................................   Passed   23.22 sec
            Start  7897: mpi/p4est_2d_dofhandler_02.mpirun=10.debug
            Start  7896: mpi/p4est_2d_dofhandler_01.mpirun=4.release
10161/10570 Test  #7893: mpi/p4est_2d_dofhandler_01.mpirun=10.debug ......................................   Passed   31.07 sec
            Start  7898: mpi/p4est_2d_dofhandler_02.mpirun=10.release
10162/10570 Test  #7896: mpi/p4est_2d_dofhandler_01.mpirun=4.release .....................................   Passed    4.61 sec
            Start  7895: mpi/p4est_2d_dofhandler_01.mpirun=4.debug
10163/10570 Test  #7895: mpi/p4est_2d_dofhandler_01.mpirun=4.debug .......................................   Passed    3.84 sec
10164/10570 Test  #7898: mpi/p4est_2d_dofhandler_02.mpirun=10.release ....................................   Passed   29.91 sec
            Start  7901: mpi/p4est_2d_dofhandler_03.mpirun=10.debug
            Start  7900: mpi/p4est_2d_dofhandler_02.mpirun=4.release
10165/10570 Test  #7900: mpi/p4est_2d_dofhandler_02.mpirun=4.release .....................................   Passed    9.04 sec
10166/10570 Test  #7897: mpi/p4est_2d_dofhandler_02.mpirun=10.debug ......................................   Passed   42.85 sec
            Start  7902: mpi/p4est_2d_dofhandler_03.mpirun=10.release
            Start  7899: mpi/p4est_2d_dofhandler_02.mpirun=4.debug
10167/10570 Test  #7899: mpi/p4est_2d_dofhandler_02.mpirun=4.debug .......................................   Passed    7.30 sec
10168/10570 Test  #7902: mpi/p4est_2d_dofhandler_03.mpirun=10.release ....................................   Passed   38.32 sec
            Start  7905: mpi/p4est_2d_dofhandler_04.mpirun=10.debug
            Start  7904: mpi/p4est_2d_dofhandler_03.mpirun=4.release
10169/10570 Test  #7901: mpi/p4est_2d_dofhandler_03.mpirun=10.debug ......................................   Passed   48.81 sec
            Start  7906: mpi/p4est_2d_dofhandler_04.mpirun=10.release
10170/10570 Test  #7904: mpi/p4est_2d_dofhandler_03.mpirun=4.release .....................................   Passed    4.06 sec
            Start  7903: mpi/p4est_2d_dofhandler_03.mpirun=4.debug
10171/10570 Test  #7903: mpi/p4est_2d_dofhandler_03.mpirun=4.debug .......................................   Passed    7.64 sec
10172/10570 Test  #7906: mpi/p4est_2d_dofhandler_04.mpirun=10.release ....................................   Passed   26.04 sec
            Start  7909: mpi/p4est_2d_dofhandler_05.mpirun=10.debug
            Start  7908: mpi/p4est_2d_dofhandler_04.mpirun=4.release
10173/10570 Test  #7908: mpi/p4est_2d_dofhandler_04.mpirun=4.release .....................................   Passed    7.21 sec
10174/10570 Test  #7905: mpi/p4est_2d_dofhandler_04.mpirun=10.debug ......................................   Passed   44.48 sec
            Start  7910: mpi/p4est_2d_dofhandler_05.mpirun=10.release
            Start  7907: mpi/p4est_2d_dofhandler_04.mpirun=4.debug
10175/10570 Test  #7907: mpi/p4est_2d_dofhandler_04.mpirun=4.debug .......................................   Passed    7.84 sec
10176/10570 Test  #7909: mpi/p4est_2d_dofhandler_05.mpirun=10.debug ......................................   Passed   30.35 sec
            Start  7913: mpi/p4est_2d_ghost_01.mpirun=10.debug
            Start  7911: mpi/p4est_2d_dofhandler_05.mpirun=4.debug
10177/10570 Test  #7911: mpi/p4est_2d_dofhandler_05.mpirun=4.debug .......................................   Passed    4.24 sec
10178/10570 Test  #7910: mpi/p4est_2d_dofhandler_05.mpirun=10.release ....................................   Passed   22.64 sec
            Start  7914: mpi/p4est_2d_ghost_01.mpirun=10.release
            Start  7912: mpi/p4est_2d_dofhandler_05.mpirun=4.release
10179/10570 Test  #7912: mpi/p4est_2d_dofhandler_05.mpirun=4.release .....................................   Passed    3.91 sec
10180/10570 Test  #7913: mpi/p4est_2d_ghost_01.mpirun=10.debug ...........................................   Passed   25.64 sec
            Start  7917: mpi/p4est_2d_ghost_02.mpirun=10.debug
            Start  7915: mpi/p4est_2d_ghost_01.mpirun=4.debug
10181/10570 Test  #7915: mpi/p4est_2d_ghost_01.mpirun=4.debug ............................................   Passed    4.05 sec
10182/10570 Test  #7914: mpi/p4est_2d_ghost_01.mpirun=10.release .........................................   Passed   21.00 sec
            Start  7918: mpi/p4est_2d_ghost_02.mpirun=10.release
            Start  7916: mpi/p4est_2d_ghost_01.mpirun=4.release
10183/10570 Test  #7916: mpi/p4est_2d_ghost_01.mpirun=4.release ..........................................   Passed    3.82 sec
10184/10570 Test  #7918: mpi/p4est_2d_ghost_02.mpirun=10.release .........................................   Passed   24.53 sec
            Start  7921: mpi/p4est_2d_refine_01.mpirun=10.debug
            Start  7920: mpi/p4est_2d_ghost_02.mpirun=4.release
10185/10570 Test  #7917: mpi/p4est_2d_ghost_02.mpirun=10.debug ...........................................   Passed   30.56 sec
            Start  7922: mpi/p4est_2d_refine_01.mpirun=10.release
10186/10570 Test  #7920: mpi/p4est_2d_ghost_02.mpirun=4.release ..........................................   Passed    4.09 sec
            Start  7919: mpi/p4est_2d_ghost_02.mpirun=4.debug
10187/10570 Test  #7919: mpi/p4est_2d_ghost_02.mpirun=4.debug ............................................   Passed    4.49 sec
10188/10570 Test  #7922: mpi/p4est_2d_refine_01.mpirun=10.release ........................................   Passed   21.65 sec
            Start  7925: mpi/p4est_2d_refine_02.mpirun=10.debug
            Start  7924: mpi/p4est_2d_refine_01.mpirun=4.release
10189/10570 Test  #7921: mpi/p4est_2d_refine_01.mpirun=10.debug ..........................................   Passed   26.16 sec
            Start  7926: mpi/p4est_2d_refine_02.mpirun=10.release
10190/10570 Test  #7924: mpi/p4est_2d_refine_01.mpirun=4.release .........................................   Passed    4.45 sec
            Start  7923: mpi/p4est_2d_refine_01.mpirun=4.debug
10191/10570 Test  #7923: mpi/p4est_2d_refine_01.mpirun=4.debug ...........................................   Passed    4.14 sec
10192/10570 Test  #7925: mpi/p4est_2d_refine_02.mpirun=10.debug ..........................................   Passed   25.61 sec
            Start  7929: mpi/p4est_2d_refine_03.mpirun=10.debug
            Start  7927: mpi/p4est_2d_refine_02.mpirun=4.debug
10193/10570 Test  #7926: mpi/p4est_2d_refine_02.mpirun=10.release ........................................   Passed   23.35 sec
            Start  7930: mpi/p4est_2d_refine_03.mpirun=10.release
10194/10570 Test  #7927: mpi/p4est_2d_refine_02.mpirun=4.debug ...........................................   Passed    4.67 sec
            Start  7928: mpi/p4est_2d_refine_02.mpirun=4.release
10195/10570 Test  #7928: mpi/p4est_2d_refine_02.mpirun=4.release .........................................   Passed    3.76 sec
10196/10570 Test  #7930: mpi/p4est_2d_refine_03.mpirun=10.release ........................................   Passed   23.25 sec
            Start  7933: mpi/p4est_2d_renumber_01.mpirun=10.debug
            Start  7932: mpi/p4est_2d_refine_03.mpirun=4.release
10197/10570 Test  #7932: mpi/p4est_2d_refine_03.mpirun=4.release .........................................   Passed    8.23 sec
10198/10570 Test  #7929: mpi/p4est_2d_refine_03.mpirun=10.debug ..........................................   Passed   33.53 sec
            Start  7934: mpi/p4est_2d_renumber_01.mpirun=10.release
            Start  7931: mpi/p4est_2d_refine_03.mpirun=4.debug
10199/10570 Test  #7931: mpi/p4est_2d_refine_03.mpirun=4.debug ...........................................   Passed    6.04 sec
10200/10570 Test  #7933: mpi/p4est_2d_renumber_01.mpirun=10.debug ........................................   Passed   36.22 sec
            Start  7937: mpi/p4est_2d_renumber_02.mpirun=10.debug
            Start  7935: mpi/p4est_2d_renumber_01.mpirun=4.debug
10201/10570 Test  #7934: mpi/p4est_2d_renumber_01.mpirun=10.release ......................................   Passed   28.28 sec
            Start  7938: mpi/p4est_2d_renumber_02.mpirun=10.release
10202/10570 Test  #7935: mpi/p4est_2d_renumber_01.mpirun=4.debug .........................................   Passed    4.25 sec
            Start  7936: mpi/p4est_2d_renumber_01.mpirun=4.release
10203/10570 Test  #7936: mpi/p4est_2d_renumber_01.mpirun=4.release .......................................   Passed    3.87 sec
10204/10570 Test  #7938: mpi/p4est_2d_renumber_02.mpirun=10.release ......................................   Passed   26.36 sec
            Start  7941: mpi/p4est_2d_simple.mpirun=10.debug
            Start  7940: mpi/p4est_2d_renumber_02.mpirun=4.release
10205/10570 Test  #7937: mpi/p4est_2d_renumber_02.mpirun=10.debug ........................................   Passed   30.68 sec
            Start  7942: mpi/p4est_2d_simple.mpirun=10.release
10206/10570 Test  #7940: mpi/p4est_2d_renumber_02.mpirun=4.release .......................................   Passed    4.76 sec
            Start  7939: mpi/p4est_2d_renumber_02.mpirun=4.debug
10207/10570 Test  #7939: mpi/p4est_2d_renumber_02.mpirun=4.debug .........................................   Passed    4.12 sec
10208/10570 Test  #7942: mpi/p4est_2d_simple.mpirun=10.release ...........................................   Passed   17.20 sec
            Start  7945: mpi/p4est_3d_constraintmatrix_01.mpirun=10.debug
            Start  7944: mpi/p4est_2d_simple.mpirun=4.release
10209/10570 Test  #7941: mpi/p4est_2d_simple.mpirun=10.debug .............................................   Passed   22.41 sec
            Start  7946: mpi/p4est_3d_constraintmatrix_01.mpirun=10.release
10210/10570 Test  #7944: mpi/p4est_2d_simple.mpirun=4.release ............................................   Passed    4.37 sec
            Start  7943: mpi/p4est_2d_simple.mpirun=4.debug
10211/10570 Test  #7943: mpi/p4est_2d_simple.mpirun=4.debug ..............................................   Passed    4.09 sec
10212/10570 Test  #7946: mpi/p4est_3d_constraintmatrix_01.mpirun=10.release ..............................   Passed   26.69 sec
            Start  7949: mpi/p4est_3d_constraintmatrix_02.mpirun=10.debug
            Start  7948: mpi/p4est_3d_constraintmatrix_01.mpirun=4.release
10213/10570 Test  #7945: mpi/p4est_3d_constraintmatrix_01.mpirun=10.debug ................................   Passed   34.84 sec
            Start  7950: mpi/p4est_3d_constraintmatrix_02.mpirun=10.release
10214/10570 Test  #7948: mpi/p4est_3d_constraintmatrix_01.mpirun=4.release ...............................   Passed    7.07 sec
            Start  7947: mpi/p4est_3d_constraintmatrix_01.mpirun=4.debug
10215/10570 Test  #7947: mpi/p4est_3d_constraintmatrix_01.mpirun=4.debug .................................   Passed    6.38 sec
10216/10570 Test  #7950: mpi/p4est_3d_constraintmatrix_02.mpirun=10.release ..............................   Passed   35.06 sec
            Start  7953: mpi/p4est_3d_constraintmatrix_03.mpirun=10.debug
            Start  7952: mpi/p4est_3d_constraintmatrix_02.mpirun=4.release
10217/10570 Test  #7949: mpi/p4est_3d_constraintmatrix_02.mpirun=10.debug ................................   Passed   41.94 sec
            Start  7954: mpi/p4est_3d_constraintmatrix_03.mpirun=10.release
10218/10570 Test  #7952: mpi/p4est_3d_constraintmatrix_02.mpirun=4.release ...............................   Passed    4.00 sec
            Start  7951: mpi/p4est_3d_constraintmatrix_02.mpirun=4.debug
10219/10570 Test  #7951: mpi/p4est_3d_constraintmatrix_02.mpirun=4.debug .................................   Passed    4.48 sec
10220/10570 Test  #7954: mpi/p4est_3d_constraintmatrix_03.mpirun=10.release ..............................   Passed   44.03 sec
            Start  7959: mpi/p4est_3d_ghost_01.mpirun=10.debug
            Start  7956: mpi/p4est_3d_constraintmatrix_03.mpirun=4.release
10221/10570 Test  #7956: mpi/p4est_3d_constraintmatrix_03.mpirun=4.release ...............................   Passed   19.62 sec
10222/10570 Test  #7959: mpi/p4est_3d_ghost_01.mpirun=10.debug ...........................................   Passed   47.63 sec
            Start  7960: mpi/p4est_3d_ghost_01.mpirun=10.release
            Start  7961: mpi/p4est_3d_ghost_01.mpirun=4.debug
10223/10570 Test  #7961: mpi/p4est_3d_ghost_01.mpirun=4.debug ............................................   Passed    9.93 sec
10224/10570 Test  #7953: mpi/p4est_3d_constraintmatrix_03.mpirun=10.debug ................................   Passed  115.64 sec
            Start  7963: mpi/p4est_3d_refine_01.mpirun=10.debug
            Start  7955: mpi/p4est_3d_constraintmatrix_03.mpirun=4.debug
10225/10570 Test  #7960: mpi/p4est_3d_ghost_01.mpirun=10.release .........................................   Passed   32.83 sec
            Start  7964: mpi/p4est_3d_refine_01.mpirun=10.release
10226/10570 Test  #7964: mpi/p4est_3d_refine_01.mpirun=10.release ........................................   Passed   34.42 sec
            Start  7967: mpi/p4est_3d_refine_02.mpirun=10.debug
10227/10570 Test  #7963: mpi/p4est_3d_refine_01.mpirun=10.debug ..........................................   Passed   57.73 sec
            Start  7968: mpi/p4est_3d_refine_02.mpirun=10.release
10228/10570 Test  #7967: mpi/p4est_3d_refine_02.mpirun=10.debug ..........................................   Passed   34.24 sec
            Start  7971: mpi/p4est_3d_refine_03.mpirun=10.debug
10229/10570 Test  #7955: mpi/p4est_3d_constraintmatrix_03.mpirun=4.debug .................................   Passed   79.92 sec
            Start  7962: mpi/p4est_3d_ghost_01.mpirun=4.release
10230/10570 Test  #7968: mpi/p4est_3d_refine_02.mpirun=10.release ........................................   Passed   23.76 sec
            Start  7972: mpi/p4est_3d_refine_03.mpirun=10.release
10231/10570 Test  #7962: mpi/p4est_3d_ghost_01.mpirun=4.release ..........................................   Passed    4.32 sec
            Start  7965: mpi/p4est_3d_refine_01.mpirun=4.debug
10232/10570 Test  #7965: mpi/p4est_3d_refine_01.mpirun=4.debug ...........................................   Passed   13.78 sec
            Start  7966: mpi/p4est_3d_refine_01.mpirun=4.release
10233/10570 Test  #7966: mpi/p4est_3d_refine_01.mpirun=4.release .........................................   Passed    5.42 sec
            Start  7969: mpi/p4est_3d_refine_02.mpirun=4.debug
10234/10570 Test  #7972: mpi/p4est_3d_refine_03.mpirun=10.release ........................................   Passed   22.40 sec
            Start  7983: mpi/p4est_data_out_01.mpirun=10.debug
10235/10570 Test  #7971: mpi/p4est_3d_refine_03.mpirun=10.debug ..........................................   Passed   26.73 sec
            Start  7984: mpi/p4est_data_out_01.mpirun=10.release
10236/10570 Test  #7969: mpi/p4est_3d_refine_02.mpirun=4.debug ...........................................   Passed    4.14 sec
            Start  7970: mpi/p4est_3d_refine_02.mpirun=4.release
10237/10570 Test  #7970: mpi/p4est_3d_refine_02.mpirun=4.release .........................................   Passed    3.81 sec
            Start  7973: mpi/p4est_3d_refine_03.mpirun=4.debug
10238/10570 Test  #7973: mpi/p4est_3d_refine_03.mpirun=4.debug ...........................................   Passed    4.15 sec
            Start  7974: mpi/p4est_3d_refine_03.mpirun=4.release
10239/10570 Test  #7974: mpi/p4est_3d_refine_03.mpirun=4.release .........................................   Passed    3.73 sec
10240/10570 Test  #7984: mpi/p4est_data_out_01.mpirun=10.release .........................................   Passed   23.45 sec
            Start  7987: mpi/p4est_get_subdomain_association.mpirun=10.debug
            Start  7986: mpi/p4est_data_out_01.mpirun=4.release
10241/10570 Test  #7983: mpi/p4est_data_out_01.mpirun=10.debug ...........................................   Passed   29.01 sec
            Start  7988: mpi/p4est_get_subdomain_association.mpirun=10.release
10242/10570 Test  #7986: mpi/p4est_data_out_01.mpirun=4.release ..........................................   Passed    5.32 sec
            Start  7985: mpi/p4est_data_out_01.mpirun=4.debug
10243/10570 Test  #7985: mpi/p4est_data_out_01.mpirun=4.debug ............................................   Passed    4.12 sec
10244/10570 Test  #7988: mpi/p4est_get_subdomain_association.mpirun=10.release ...........................   Passed   23.01 sec
            Start  7993: mpi/p4est_save_01.mpirun=10.debug
            Start  7990: mpi/p4est_get_subdomain_association.mpirun=4.release
10245/10570 Test  #7987: mpi/p4est_get_subdomain_association.mpirun=10.debug .............................   Passed   30.36 sec
            Start  7994: mpi/p4est_save_01.mpirun=10.release
10246/10570 Test  #7990: mpi/p4est_get_subdomain_association.mpirun=4.release ............................   Passed    4.56 sec
            Start  7989: mpi/p4est_get_subdomain_association.mpirun=4.debug
10247/10570 Test  #7989: mpi/p4est_get_subdomain_association.mpirun=4.debug ..............................   Passed    4.10 sec
10248/10570 Test  #7994: mpi/p4est_save_01.mpirun=10.release .............................................   Passed   22.66 sec
            Start  8017: mpi/parallel_block_vector_01.mpirun=10.debug
            Start  7996: mpi/p4est_save_01.mpirun=4.release
10249/10570 Test  #7993: mpi/p4est_save_01.mpirun=10.debug ...............................................   Passed   28.51 sec
            Start  8018: mpi/parallel_block_vector_01.mpirun=10.release
10250/10570 Test  #7996: mpi/p4est_save_01.mpirun=4.release ..............................................   Passed    7.11 sec
            Start  7995: mpi/p4est_save_01.mpirun=4.debug
10251/10570 Test  #8017: mpi/parallel_block_vector_01.mpirun=10.debug ....................................   Passed    8.05 sec
            Start  8023: mpi/parallel_block_vector_02.mpirun=10.debug
10252/10570 Test  #8018: mpi/parallel_block_vector_01.mpirun=10.release ..................................   Passed    7.01 sec
            Start  8024: mpi/parallel_block_vector_02.mpirun=10.release
10253/10570 Test  #7995: mpi/p4est_save_01.mpirun=4.debug ................................................   Passed    6.66 sec
            Start  8019: mpi/parallel_block_vector_01.mpirun=4.debug
10254/10570 Test  #8023: mpi/parallel_block_vector_02.mpirun=10.debug ....................................   Passed    6.07 sec
            Start  8029: mpi/parallel_block_vector_04.mpirun=10.debug
10255/10570 Test  #8024: mpi/parallel_block_vector_02.mpirun=10.release ..................................   Passed    5.33 sec
            Start  8030: mpi/parallel_block_vector_04.mpirun=10.release
10256/10570 Test  #8019: mpi/parallel_block_vector_01.mpirun=4.debug .....................................   Passed    5.33 sec
            Start  8020: mpi/parallel_block_vector_01.mpirun=4.release
10257/10570 Test  #8029: mpi/parallel_block_vector_04.mpirun=10.debug ....................................   Passed    7.17 sec
            Start  8061: mpi/parallel_partitioner_01.mpirun=10.debug
10258/10570 Test  #8030: mpi/parallel_block_vector_04.mpirun=10.release ..................................   Passed    6.78 sec
            Start  8062: mpi/parallel_partitioner_01.mpirun=10.release
10259/10570 Test  #8020: mpi/parallel_block_vector_01.mpirun=4.release ...................................   Passed    4.97 sec
            Start  8025: mpi/parallel_block_vector_02.mpirun=4.debug
10260/10570 Test  #8025: mpi/parallel_block_vector_02.mpirun=4.debug .....................................   Passed    4.01 sec
            Start  8026: mpi/parallel_block_vector_02.mpirun=4.release
10261/10570 Test  #8026: mpi/parallel_block_vector_02.mpirun=4.release ...................................   Passed    3.80 sec
            Start  8031: mpi/parallel_block_vector_04.mpirun=4.debug
10262/10570 Test  #8031: mpi/parallel_block_vector_04.mpirun=4.debug .....................................   Passed    3.95 sec
            Start  8032: mpi/parallel_block_vector_04.mpirun=4.release
10263/10570 Test  #8062: mpi/parallel_partitioner_01.mpirun=10.release ...................................   Passed   15.70 sec
            Start  8065: mpi/parallel_partitioner_02.mpirun=10.debug
10264/10570 Test  #8061: mpi/parallel_partitioner_01.mpirun=10.debug .....................................   Passed   17.99 sec
            Start  8066: mpi/parallel_partitioner_02.mpirun=10.release
10265/10570 Test  #8032: mpi/parallel_block_vector_04.mpirun=4.release ...................................   Passed    4.98 sec
            Start  8063: mpi/parallel_partitioner_01.mpirun=4.debug
10266/10570 Test  #8063: mpi/parallel_partitioner_01.mpirun=4.debug ......................................   Passed    3.85 sec
            Start  8064: mpi/parallel_partitioner_01.mpirun=4.release
10267/10570 Test  #8064: mpi/parallel_partitioner_01.mpirun=4.release ....................................   Passed    3.63 sec
10268/10570 Test  #8066: mpi/parallel_partitioner_02.mpirun=10.release ...................................   Passed   14.75 sec
            Start  8069: mpi/parallel_partitioner_03.mpirun=10.debug
            Start  8068: mpi/parallel_partitioner_02.mpirun=4.release
10269/10570 Test  #8065: mpi/parallel_partitioner_02.mpirun=10.debug .....................................   Passed   17.84 sec
            Start  8070: mpi/parallel_partitioner_03.mpirun=10.release
10270/10570 Test  #8068: mpi/parallel_partitioner_02.mpirun=4.release ....................................   Passed    4.46 sec
            Start  8067: mpi/parallel_partitioner_02.mpirun=4.debug
10271/10570 Test  #8067: mpi/parallel_partitioner_02.mpirun=4.debug ......................................   Passed    3.96 sec
10272/10570 Test  #8070: mpi/parallel_partitioner_03.mpirun=10.release ...................................   Passed   14.49 sec
            Start  8075: mpi/parallel_partitioner_04.mpirun=10.debug
            Start  8072: mpi/parallel_partitioner_03.mpirun=4.release
10273/10570 Test  #8069: mpi/parallel_partitioner_03.mpirun=10.debug .....................................   Passed   18.64 sec
            Start  8076: mpi/parallel_partitioner_04.mpirun=10.release
10274/10570 Test  #8072: mpi/parallel_partitioner_03.mpirun=4.release ....................................   Passed    4.44 sec
            Start  8071: mpi/parallel_partitioner_03.mpirun=4.debug
10275/10570 Test  #8071: mpi/parallel_partitioner_03.mpirun=4.debug ......................................   Passed    3.92 sec
10276/10570 Test  #8075: mpi/parallel_partitioner_04.mpirun=10.debug .....................................   Passed   17.83 sec
            Start  8089: mpi/parallel_vector_01.mpirun=10.debug
            Start  8077: mpi/parallel_partitioner_04.mpirun=4.debug
10277/10570 Test  #8076: mpi/parallel_partitioner_04.mpirun=10.release ...................................   Passed   16.06 sec
            Start  8090: mpi/parallel_vector_01.mpirun=10.release
10278/10570 Test  #8077: mpi/parallel_partitioner_04.mpirun=4.debug ......................................   Passed    4.12 sec
            Start  8078: mpi/parallel_partitioner_04.mpirun=4.release
10279/10570 Test  #8078: mpi/parallel_partitioner_04.mpirun=4.release ....................................   Passed    3.74 sec
10280/10570 Test  #8090: mpi/parallel_vector_01.mpirun=10.release ........................................   Passed   13.54 sec
            Start  8093: mpi/parallel_vector_02.mpirun=10.debug
            Start  8092: mpi/parallel_vector_01.mpirun=4.release
10281/10570 Test  #8089: mpi/parallel_vector_01.mpirun=10.debug ..........................................   Passed   16.94 sec
            Start  8094: mpi/parallel_vector_02.mpirun=10.release
10282/10570 Test  #8092: mpi/parallel_vector_01.mpirun=4.release .........................................   Passed    4.34 sec
            Start  8091: mpi/parallel_vector_01.mpirun=4.debug
10283/10570 Test  #8091: mpi/parallel_vector_01.mpirun=4.debug ...........................................   Passed    3.91 sec
10284/10570 Test  #8093: mpi/parallel_vector_02.mpirun=10.debug ..........................................   Passed   16.62 sec
            Start  8097: mpi/parallel_vector_03.mpirun=10.debug
            Start  8095: mpi/parallel_vector_02.mpirun=4.debug
10285/10570 Test  #8094: mpi/parallel_vector_02.mpirun=10.release ........................................   Passed   15.80 sec
            Start  8098: mpi/parallel_vector_03.mpirun=10.release
10286/10570 Test  #8095: mpi/parallel_vector_02.mpirun=4.debug ...........................................   Passed    4.45 sec
            Start  8096: mpi/parallel_vector_02.mpirun=4.release
10287/10570 Test  #8096: mpi/parallel_vector_02.mpirun=4.release .........................................   Passed    3.76 sec
10288/10570 Test  #8097: mpi/parallel_vector_03.mpirun=10.debug ..........................................   Passed   16.55 sec
            Start  8103: mpi/parallel_vector_04.mpirun=10.debug
            Start  8099: mpi/parallel_vector_03.mpirun=4.debug
10289/10570 Test  #8098: mpi/parallel_vector_03.mpirun=10.release ........................................   Passed   15.92 sec
            Start  8104: mpi/parallel_vector_04.mpirun=10.release
10290/10570 Test  #8099: mpi/parallel_vector_03.mpirun=4.debug ...........................................   Passed    4.87 sec
            Start  8100: mpi/parallel_vector_03.mpirun=4.release
10291/10570 Test  #8100: mpi/parallel_vector_03.mpirun=4.release .........................................   Passed    3.72 sec
10292/10570 Test  #8103: mpi/parallel_vector_04.mpirun=10.debug ..........................................   Passed   18.00 sec
            Start  8107: mpi/parallel_vector_05.mpirun=10.debug
            Start  8105: mpi/parallel_vector_04.mpirun=4.debug
10293/10570 Test  #8104: mpi/parallel_vector_04.mpirun=10.release ........................................   Passed   16.18 sec
            Start  8108: mpi/parallel_vector_05.mpirun=10.release
10294/10570 Test  #8105: mpi/parallel_vector_04.mpirun=4.debug ...........................................   Passed    4.17 sec
            Start  8106: mpi/parallel_vector_04.mpirun=4.release
10295/10570 Test  #8106: mpi/parallel_vector_04.mpirun=4.release .........................................   Passed    3.84 sec
10296/10570 Test  #8108: mpi/parallel_vector_05.mpirun=10.release ........................................   Passed   14.57 sec
            Start  8113: mpi/parallel_vector_06.mpirun=10.debug
            Start  8110: mpi/parallel_vector_05.mpirun=4.release
10297/10570 Test  #8107: mpi/parallel_vector_05.mpirun=10.debug ..........................................   Passed   17.52 sec
            Start  8114: mpi/parallel_vector_06.mpirun=10.release
10298/10570 Test  #8110: mpi/parallel_vector_05.mpirun=4.release .........................................   Passed    6.25 sec
            Start  8109: mpi/parallel_vector_05.mpirun=4.debug
10299/10570 Test  #8113: mpi/parallel_vector_06.mpirun=10.debug ..........................................   Passed    6.55 sec
            Start  8117: mpi/parallel_vector_07.mpirun=10.debug
10300/10570 Test  #8114: mpi/parallel_vector_06.mpirun=10.release ........................................   Passed    6.04 sec
            Start  8118: mpi/parallel_vector_07.mpirun=10.release
10301/10570 Test  #8109: mpi/parallel_vector_05.mpirun=4.debug ...........................................   Passed    4.45 sec
            Start  8115: mpi/parallel_vector_06.mpirun=4.debug
10302/10570 Test  #8115: mpi/parallel_vector_06.mpirun=4.debug ...........................................   Passed    4.02 sec
            Start  8116: mpi/parallel_vector_06.mpirun=4.release
10303/10570 Test  #8116: mpi/parallel_vector_06.mpirun=4.release .........................................   Passed    3.78 sec
10304/10570 Test  #8117: mpi/parallel_vector_07.mpirun=10.debug ..........................................   Passed   17.54 sec
            Start  8121: mpi/parallel_vector_08.mpirun=10.debug
            Start  8119: mpi/parallel_vector_07.mpirun=4.debug
10305/10570 Test  #8118: mpi/parallel_vector_07.mpirun=10.release ........................................   Passed   16.06 sec
            Start  8122: mpi/parallel_vector_08.mpirun=10.release
10306/10570 Test  #8119: mpi/parallel_vector_07.mpirun=4.debug ...........................................   Passed    4.52 sec
            Start  8120: mpi/parallel_vector_07.mpirun=4.release
10307/10570 Test  #8120: mpi/parallel_vector_07.mpirun=4.release .........................................   Passed    3.98 sec
10308/10570 Test  #8122: mpi/parallel_vector_08.mpirun=10.release ........................................   Passed   15.87 sec
            Start  8125: mpi/parallel_vector_09.mpirun=10.debug
            Start  8124: mpi/parallel_vector_08.mpirun=4.release
10309/10570 Test  #8121: mpi/parallel_vector_08.mpirun=10.debug ..........................................   Passed   19.47 sec
            Start  8126: mpi/parallel_vector_09.mpirun=10.release
10310/10570 Test  #8124: mpi/parallel_vector_08.mpirun=4.release .........................................   Passed    4.85 sec
            Start  8123: mpi/parallel_vector_08.mpirun=4.debug
10311/10570 Test  #8123: mpi/parallel_vector_08.mpirun=4.debug ...........................................   Passed    3.85 sec
10312/10570 Test  #8125: mpi/parallel_vector_09.mpirun=10.debug ..........................................   Passed   17.02 sec
            Start  8129: mpi/parallel_vector_10.mpirun=10.debug
            Start  8127: mpi/parallel_vector_09.mpirun=4.debug
10313/10570 Test  #8126: mpi/parallel_vector_09.mpirun=10.release ........................................   Passed   15.56 sec
            Start  8130: mpi/parallel_vector_10.mpirun=10.release
10314/10570 Test  #8127: mpi/parallel_vector_09.mpirun=4.debug ...........................................   Passed    4.00 sec
            Start  8128: mpi/parallel_vector_09.mpirun=4.release
10315/10570 Test  #8128: mpi/parallel_vector_09.mpirun=4.release .........................................   Passed    3.81 sec
10316/10570 Test  #8130: mpi/parallel_vector_10.mpirun=10.release ........................................   Passed   15.96 sec
            Start  8133: mpi/parallel_vector_11.mpirun=10.debug
            Start  8132: mpi/parallel_vector_10.mpirun=4.release
10317/10570 Test  #8129: mpi/parallel_vector_10.mpirun=10.debug ..........................................   Passed   17.26 sec
            Start  8134: mpi/parallel_vector_11.mpirun=10.release
10318/10570 Test  #8132: mpi/parallel_vector_10.mpirun=4.release .........................................   Passed    4.07 sec
            Start  8131: mpi/parallel_vector_10.mpirun=4.debug
10319/10570 Test  #8131: mpi/parallel_vector_10.mpirun=4.debug ...........................................   Passed    3.82 sec
10320/10570 Test  #8134: mpi/parallel_vector_11.mpirun=10.release ........................................   Passed   15.08 sec
            Start  8139: mpi/parallel_vector_12.mpirun=10.debug
            Start  8136: mpi/parallel_vector_11.mpirun=4.release
10321/10570 Test  #8133: mpi/parallel_vector_11.mpirun=10.debug ..........................................   Passed   17.98 sec
            Start  8140: mpi/parallel_vector_12.mpirun=10.release
10322/10570 Test  #8136: mpi/parallel_vector_11.mpirun=4.release .........................................   Passed    5.22 sec
            Start  8135: mpi/parallel_vector_11.mpirun=4.debug
10323/10570 Test  #8139: mpi/parallel_vector_12.mpirun=10.debug ..........................................   Passed    6.85 sec
            Start  8143: mpi/parallel_vector_13.mpirun=10.debug
10324/10570 Test  #8140: mpi/parallel_vector_12.mpirun=10.release ........................................   Passed    5.84 sec
            Start  8144: mpi/parallel_vector_13.mpirun=10.release
10325/10570 Test  #8135: mpi/parallel_vector_11.mpirun=4.debug ...........................................   Passed    4.94 sec
            Start  8141: mpi/parallel_vector_12.mpirun=4.debug
10326/10570 Test  #8141: mpi/parallel_vector_12.mpirun=4.debug ...........................................   Passed    4.11 sec
            Start  8142: mpi/parallel_vector_12.mpirun=4.release
10327/10570 Test  #8142: mpi/parallel_vector_12.mpirun=4.release .........................................   Passed    3.94 sec
10328/10570 Test  #8144: mpi/parallel_vector_13.mpirun=10.release ........................................   Passed   15.10 sec
            Start  8159: mpi/parallel_vector_18.mpirun=10.debug
            Start  8146: mpi/parallel_vector_13.mpirun=4.release
10329/10570 Test  #8143: mpi/parallel_vector_13.mpirun=10.debug ..........................................   Passed   18.00 sec
            Start  8160: mpi/parallel_vector_18.mpirun=10.release
10330/10570 Test  #8146: mpi/parallel_vector_13.mpirun=4.release .........................................   Passed    4.61 sec
            Start  8145: mpi/parallel_vector_13.mpirun=4.debug
10331/10570 Test  #8159: mpi/parallel_vector_18.mpirun=10.debug ..........................................   Passed    6.03 sec
            Start  8165: mpi/parallel_vector_19.mpirun=10.debug
10332/10570 Test  #8160: mpi/parallel_vector_18.mpirun=10.release ........................................   Passed    5.81 sec
            Start  8166: mpi/parallel_vector_19.mpirun=10.release
10333/10570 Test  #8145: mpi/parallel_vector_13.mpirun=4.debug ...........................................   Passed    4.70 sec
            Start  8161: mpi/parallel_vector_18.mpirun=4.debug
10334/10570 Test  #8165: mpi/parallel_vector_19.mpirun=10.debug ..........................................   Passed    5.84 sec
            Start  8173: mpi/parallel_vector_22.mpirun=10.debug
10335/10570 Test  #8166: mpi/parallel_vector_19.mpirun=10.release ........................................   Passed    5.36 sec
            Start  8174: mpi/parallel_vector_22.mpirun=10.release
10336/10570 Test  #8161: mpi/parallel_vector_18.mpirun=4.debug ...........................................   Passed    4.61 sec
            Start  8162: mpi/parallel_vector_18.mpirun=4.release
10337/10570 Test  #8162: mpi/parallel_vector_18.mpirun=4.release .........................................   Passed    3.94 sec
            Start  8167: mpi/parallel_vector_19.mpirun=4.debug
10338/10570 Test  #8167: mpi/parallel_vector_19.mpirun=4.debug ...........................................   Passed    3.82 sec
            Start  8168: mpi/parallel_vector_19.mpirun=4.release
10339/10570 Test  #8168: mpi/parallel_vector_19.mpirun=4.release .........................................   Passed    3.91 sec
10340/10570 Test  #8174: mpi/parallel_vector_22.mpirun=10.release ........................................   Passed   15.11 sec
            Start  8231: mpi/refine_and_coarsen_fixed_fraction_01.mpirun=10.debug
            Start  8176: mpi/parallel_vector_22.mpirun=4.release
10341/10570 Test  #8173: mpi/parallel_vector_22.mpirun=10.debug ..........................................   Passed   17.82 sec
            Start  8232: mpi/refine_and_coarsen_fixed_fraction_01.mpirun=10.release
10342/10570 Test  #8176: mpi/parallel_vector_22.mpirun=4.release .........................................   Passed    4.12 sec
            Start  8175: mpi/parallel_vector_22.mpirun=4.debug
10343/10570 Test  #8175: mpi/parallel_vector_22.mpirun=4.debug ...........................................   Passed    4.18 sec
10344/10570 Test  #8232: mpi/refine_and_coarsen_fixed_fraction_01.mpirun=10.release ......................   Passed   23.83 sec
            Start  8235: mpi/refine_and_coarsen_fixed_fraction_02.mpirun=10.debug
            Start  8234: mpi/refine_and_coarsen_fixed_fraction_01.mpirun=4.release
10345/10570 Test  #8231: mpi/refine_and_coarsen_fixed_fraction_01.mpirun=10.debug ........................   Passed   27.57 sec
            Start  8236: mpi/refine_and_coarsen_fixed_fraction_02.mpirun=10.release
10346/10570 Test  #8234: mpi/refine_and_coarsen_fixed_fraction_01.mpirun=4.release .......................   Passed    4.46 sec
            Start  8233: mpi/refine_and_coarsen_fixed_fraction_01.mpirun=4.debug
10347/10570 Test  #8233: mpi/refine_and_coarsen_fixed_fraction_01.mpirun=4.debug .........................   Passed    4.33 sec
10348/10570 Test  #8236: mpi/refine_and_coarsen_fixed_fraction_02.mpirun=10.release ......................   Passed   21.71 sec
            Start  8239: mpi/refine_and_coarsen_fixed_fraction_03.mpirun=10.debug
            Start  8238: mpi/refine_and_coarsen_fixed_fraction_02.mpirun=4.release
10349/10570 Test  #8235: mpi/refine_and_coarsen_fixed_fraction_02.mpirun=10.debug ........................   Passed   28.07 sec
            Start  8240: mpi/refine_and_coarsen_fixed_fraction_03.mpirun=10.release
10350/10570 Test  #8238: mpi/refine_and_coarsen_fixed_fraction_02.mpirun=4.release .......................   Passed    5.32 sec
            Start  8237: mpi/refine_and_coarsen_fixed_fraction_02.mpirun=4.debug
10351/10570 Test  #8237: mpi/refine_and_coarsen_fixed_fraction_02.mpirun=4.debug .........................   Passed    4.55 sec
10352/10570 Test  #8239: mpi/refine_and_coarsen_fixed_fraction_03.mpirun=10.debug ........................   Passed   26.06 sec
            Start  8251: mpi/refine_and_coarsen_fixed_number_01.mpirun=10.debug
            Start  8241: mpi/refine_and_coarsen_fixed_fraction_03.mpirun=4.debug
10353/10570 Test  #8240: mpi/refine_and_coarsen_fixed_fraction_03.mpirun=10.release ......................   Passed   24.30 sec
            Start  8252: mpi/refine_and_coarsen_fixed_number_01.mpirun=10.release
10354/10570 Test  #8241: mpi/refine_and_coarsen_fixed_fraction_03.mpirun=4.debug .........................   Passed    5.09 sec
            Start  8242: mpi/refine_and_coarsen_fixed_fraction_03.mpirun=4.release
10355/10570 Test  #8242: mpi/refine_and_coarsen_fixed_fraction_03.mpirun=4.release .......................   Passed    3.88 sec
10356/10570 Test  #8252: mpi/refine_and_coarsen_fixed_number_01.mpirun=10.release ........................   Passed   22.43 sec
            Start  8255: mpi/refine_and_coarsen_fixed_number_02.mpirun=10.debug
            Start  8254: mpi/refine_and_coarsen_fixed_number_01.mpirun=4.release
10357/10570 Test  #8251: mpi/refine_and_coarsen_fixed_number_01.mpirun=10.debug ..........................   Passed   27.50 sec
            Start  8256: mpi/refine_and_coarsen_fixed_number_02.mpirun=10.release
10358/10570 Test  #8254: mpi/refine_and_coarsen_fixed_number_01.mpirun=4.release .........................   Passed    4.62 sec
            Start  8253: mpi/refine_and_coarsen_fixed_number_01.mpirun=4.debug
10359/10570 Test  #8253: mpi/refine_and_coarsen_fixed_number_01.mpirun=4.debug ...........................   Passed    4.06 sec
10360/10570 Test  #8256: mpi/refine_and_coarsen_fixed_number_02.mpirun=10.release ........................   Passed   21.42 sec
            Start  8259: mpi/refine_and_coarsen_fixed_number_03.mpirun=10.debug
            Start  8258: mpi/refine_and_coarsen_fixed_number_02.mpirun=4.release
10361/10570 Test  #8255: mpi/refine_and_coarsen_fixed_number_02.mpirun=10.debug ..........................   Passed   27.44 sec
            Start  8260: mpi/refine_and_coarsen_fixed_number_03.mpirun=10.release
10362/10570 Test  #8258: mpi/refine_and_coarsen_fixed_number_02.mpirun=4.release .........................   Passed    4.71 sec
            Start  8257: mpi/refine_and_coarsen_fixed_number_02.mpirun=4.debug
10363/10570 Test  #8257: mpi/refine_and_coarsen_fixed_number_02.mpirun=4.debug ...........................   Passed    4.20 sec
10364/10570 Test  #8260: mpi/refine_and_coarsen_fixed_number_03.mpirun=10.release ........................   Passed   22.27 sec
            Start  8269: mpi/refine_and_coarsen_fixed_number_06.mpirun=10.debug
            Start  8262: mpi/refine_and_coarsen_fixed_number_03.mpirun=4.release
10365/10570 Test  #8259: mpi/refine_and_coarsen_fixed_number_03.mpirun=10.debug ..........................   Passed   28.15 sec
            Start  8270: mpi/refine_and_coarsen_fixed_number_06.mpirun=10.release
10366/10570 Test  #8262: mpi/refine_and_coarsen_fixed_number_03.mpirun=4.release .........................   Passed    4.81 sec
            Start  8261: mpi/refine_and_coarsen_fixed_number_03.mpirun=4.debug
10367/10570 Test  #8269: mpi/refine_and_coarsen_fixed_number_06.mpirun=10.debug ..........................   Passed    6.84 sec
            Start  8275: mpi/refine_and_coarsen_fixed_number_07.mpirun=10.debug
10368/10570 Test  #8270: mpi/refine_and_coarsen_fixed_number_06.mpirun=10.release ........................   Passed    6.61 sec
            Start  8276: mpi/refine_and_coarsen_fixed_number_07.mpirun=10.release
10369/10570 Test  #8261: mpi/refine_and_coarsen_fixed_number_03.mpirun=4.debug ...........................   Passed    5.34 sec
            Start  8271: mpi/refine_and_coarsen_fixed_number_06.mpirun=4.debug
10370/10570 Test  #8271: mpi/refine_and_coarsen_fixed_number_06.mpirun=4.debug ...........................   Passed    9.54 sec
            Start  8272: mpi/refine_and_coarsen_fixed_number_06.mpirun=4.release
10371/10570 Test  #8276: mpi/refine_and_coarsen_fixed_number_07.mpirun=10.release ........................   Passed   18.18 sec
            Start  8301: mpi/renumber_z_order_01.mpirun=10.debug
10372/10570 Test  #8275: mpi/refine_and_coarsen_fixed_number_07.mpirun=10.debug ..........................   Passed   21.91 sec
            Start  8302: mpi/renumber_z_order_01.mpirun=10.release
10373/10570 Test  #8272: mpi/refine_and_coarsen_fixed_number_06.mpirun=4.release .........................   Passed    9.26 sec
            Start  8277: mpi/refine_and_coarsen_fixed_number_07.mpirun=4.debug
10374/10570 Test  #8301: mpi/renumber_z_order_01.mpirun=10.debug .........................................   Passed   10.01 sec
            Start  8307: mpi/renumber_z_order_02.mpirun=10.debug
10375/10570 Test  #8302: mpi/renumber_z_order_01.mpirun=10.release .......................................   Passed    9.35 sec
            Start  8308: mpi/renumber_z_order_02.mpirun=10.release
10376/10570 Test  #8277: mpi/refine_and_coarsen_fixed_number_07.mpirun=4.debug ...........................   Passed    9.24 sec
            Start  8278: mpi/refine_and_coarsen_fixed_number_07.mpirun=4.release
10377/10570 Test  #8278: mpi/refine_and_coarsen_fixed_number_07.mpirun=4.release .........................   Passed    8.01 sec
            Start  8303: mpi/renumber_z_order_01.mpirun=4.debug
10378/10570 Test  #8307: mpi/renumber_z_order_02.mpirun=10.debug .........................................   Passed    9.71 sec
            Start  8367: mpi/tria_ghost_owners_02.mpirun=11.debug
10379/10570 Test  #8308: mpi/renumber_z_order_02.mpirun=10.release .......................................   Passed    8.63 sec
            Start  8368: mpi/tria_ghost_owners_02.mpirun=11.release
10380/10570 Test  #8303: mpi/renumber_z_order_01.mpirun=4.debug ..........................................   Passed    4.35 sec
            Start  8304: mpi/renumber_z_order_01.mpirun=4.release
10381/10570 Test  #8304: mpi/renumber_z_order_01.mpirun=4.release ........................................   Passed    3.95 sec
            Start  8309: mpi/renumber_z_order_02.mpirun=4.debug
10382/10570 Test  #8309: mpi/renumber_z_order_02.mpirun=4.debug ..........................................   Passed    4.52 sec
            Start  8310: mpi/renumber_z_order_02.mpirun=4.release
10383/10570 Test  #8310: mpi/renumber_z_order_02.mpirun=4.release ........................................   Passed    3.81 sec
10384/10570 Test  #8368: mpi/tria_ghost_owners_02.mpirun=11.release ......................................   Passed   31.00 sec
            Start  8373: mpi/tria_signals_01.mpirun=11.debug
            Start  8370: mpi/tria_ghost_owners_02.mpirun=5.release
10385/10570 Test  #8370: mpi/tria_ghost_owners_02.mpirun=5.release .......................................   Passed   11.37 sec
10386/10570 Test  #8373: mpi/tria_signals_01.mpirun=11.debug .............................................   Passed   22.28 sec
            Start  8374: mpi/tria_signals_01.mpirun=11.release
            Start  8375: mpi/tria_signals_01.mpirun=4.debug
10387/10570 Test  #8374: mpi/tria_signals_01.mpirun=11.release ...........................................   Passed   14.49 sec
            Start  8379: mpi/tria_signals_02.mpirun=11.debug
10388/10570 Test  #8375: mpi/tria_signals_01.mpirun=4.debug ..............................................   Passed   14.58 sec
            Start  8376: mpi/tria_signals_01.mpirun=4.release
10389/10570 Test  #8367: mpi/tria_ghost_owners_02.mpirun=11.debug ........................................   Passed   75.45 sec
            Start  8380: mpi/tria_signals_02.mpirun=11.release
10390/10570 Test  #8376: mpi/tria_signals_01.mpirun=4.release ............................................   Passed   10.82 sec
            Start  8369: mpi/tria_ghost_owners_02.mpirun=5.debug
10391/10570 Test  #8379: mpi/tria_signals_02.mpirun=11.debug .............................................   Passed   12.48 sec
            Start  8385: mpi/tria_signals_03.mpirun=11.debug
10392/10570 Test  #8380: mpi/tria_signals_02.mpirun=11.release ...........................................   Passed    8.68 sec
            Start  8386: mpi/tria_signals_03.mpirun=11.release
10393/10570 Test  #8386: mpi/tria_signals_03.mpirun=11.release ...........................................   Passed   34.62 sec
            Start  8391: mpi/tria_signals_04.mpirun=11.debug
10394/10570 Test  #8369: mpi/tria_ghost_owners_02.mpirun=5.debug .........................................   Passed   59.76 sec
            Start  8381: mpi/tria_signals_02.mpirun=4.debug
10395/10570 Test  #8381: mpi/tria_signals_02.mpirun=4.debug ..............................................   Passed   19.80 sec
            Start  8382: mpi/tria_signals_02.mpirun=4.release
10396/10570 Test  #8382: mpi/tria_signals_02.mpirun=4.release ............................................   Passed   16.57 sec
            Start  8388: mpi/tria_signals_03.mpirun=4.release
10397/10570 Test  #8388: mpi/tria_signals_03.mpirun=4.release ............................................   Passed   25.28 sec
10398/10570 Test  #8385: mpi/tria_signals_03.mpirun=11.debug .............................................   Passed  167.96 sec
            Start  8392: mpi/tria_signals_04.mpirun=11.release
            Start  8387: mpi/tria_signals_03.mpirun=4.debug
10399/10570 Test  #8391: mpi/tria_signals_04.mpirun=11.debug .............................................   Passed  152.98 sec
            Start  8397: mpi/tria_signals_05.mpirun=11.debug
10400/10570 Test  #8392: mpi/tria_signals_04.mpirun=11.release ...........................................   Passed   29.81 sec
            Start  8398: mpi/tria_signals_05.mpirun=11.release
10401/10570 Test  #8397: mpi/tria_signals_05.mpirun=11.debug .............................................   Passed   19.87 sec
            Start  8403: mpi/trilinos_01.mpirun=10.debug
10402/10570 Test  #8398: mpi/tria_signals_05.mpirun=11.release ...........................................   Passed   15.27 sec
            Start  8404: mpi/trilinos_01.mpirun=10.release
10403/10570 Test  #8404: mpi/trilinos_01.mpirun=10.release ...............................................   Passed   20.91 sec
            Start  8407: mpi/trilinos_02.mpirun=10.debug
10404/10570 Test  #8403: mpi/trilinos_01.mpirun=10.debug .................................................   Passed   23.80 sec
            Start  8408: mpi/trilinos_02.mpirun=10.release
10405/10570 Test  #8408: mpi/trilinos_02.mpirun=10.release ...............................................   Passed   19.23 sec
            Start  8447: mpi/trilinos_ghost_01.mpirun=10.debug
10406/10570 Test  #8407: mpi/trilinos_02.mpirun=10.debug .................................................   Passed   21.43 sec
            Start  8448: mpi/trilinos_ghost_01.mpirun=10.release
10407/10570 Test  #8387: mpi/tria_signals_03.mpirun=4.debug ..............................................   Passed  101.19 sec
            Start  8393: mpi/tria_signals_04.mpirun=4.debug
10408/10570 Test  #8448: mpi/trilinos_ghost_01.mpirun=10.release .........................................   Passed   17.89 sec
            Start  8451: mpi/trilinos_ghost_02.mpirun=10.debug
10409/10570 Test  #8447: mpi/trilinos_ghost_01.mpirun=10.debug ...........................................   Passed   21.06 sec
            Start  8452: mpi/trilinos_ghost_02.mpirun=10.release
10410/10570 Test  #8452: mpi/trilinos_ghost_02.mpirun=10.release .........................................   Passed   17.59 sec
            Start  8455: mpi/trilinos_ghost_03.mpirun=10.debug
10411/10570 Test  #8451: mpi/trilinos_ghost_02.mpirun=10.debug ...........................................   Passed   23.46 sec
            Start  8457: mpi/trilinos_ghost_03_linfty.mpirun=10.debug
10412/10570 Test  #8455: mpi/trilinos_ghost_03.mpirun=10.debug ...........................................   Passed   22.64 sec
            Start  8459: mpi/trilinos_ghost_05.mpirun=10.debug
10413/10570 Test  #8457: mpi/trilinos_ghost_03_linfty.mpirun=10.debug ....................................   Passed   21.39 sec
            Start  8460: mpi/trilinos_ghost_05.mpirun=10.release
10414/10570 Test  #8459: mpi/trilinos_ghost_05.mpirun=10.debug ...........................................   Passed   23.35 sec
            Start  1553: base/mpi_some_to_some_01.mpirun=6.release
            Start  8394: mpi/tria_signals_04.mpirun=4.release
10415/10570 Test  #8460: mpi/trilinos_ghost_05.mpirun=10.release .........................................   Passed   22.98 sec
            Start  4740: fullydistributed_grids/copy_serial_tria_05.mpirun=9.debug
10416/10570 Test  #1553: base/mpi_some_to_some_01.mpirun=6.release .......................................   Passed    7.13 sec
            Start  4741: fullydistributed_grids/copy_serial_tria_05.mpirun=9.release
10417/10570 Test  #8394: mpi/tria_signals_04.mpirun=4.release ............................................   Passed   11.60 sec
            Start  8399: mpi/tria_signals_05.mpirun=4.debug
10418/10570 Test  #8399: mpi/tria_signals_05.mpirun=4.debug ..............................................   Passed    7.15 sec
            Start  8400: mpi/tria_signals_05.mpirun=4.release
10419/10570 Test  #8400: mpi/tria_signals_05.mpirun=4.release ............................................   Passed    6.56 sec
            Start  8405: mpi/trilinos_01.mpirun=4.debug
10420/10570 Test  #8393: mpi/tria_signals_04.mpirun=4.debug ..............................................   Passed   96.20 sec
            Start  8406: mpi/trilinos_01.mpirun=4.release
10421/10570 Test  #8405: mpi/trilinos_01.mpirun=4.debug ..................................................   Passed    7.57 sec
            Start  8409: mpi/trilinos_02.mpirun=4.debug
10422/10570 Test  #8406: mpi/trilinos_01.mpirun=4.release ................................................   Passed    7.70 sec
            Start  8410: mpi/trilinos_02.mpirun=4.release
10423/10570 Test  #4740: fullydistributed_grids/copy_serial_tria_05.mpirun=9.debug .......................   Passed   36.51 sec
            Start  4752: fullydistributed_grids/copy_serial_tria_grouped_01.mpirun=7.debug
10424/10570 Test  #8409: mpi/trilinos_02.mpirun=4.debug ..................................................   Passed    6.46 sec
            Start  4753: fullydistributed_grids/copy_serial_tria_grouped_01.mpirun=7.release
10425/10570 Test  #4741: fullydistributed_grids/copy_serial_tria_05.mpirun=9.release .....................   Passed   34.88 sec
            Start  6071: lac/diagonal_matrix_02.mpirun=7.debug
10426/10570 Test  #8410: mpi/trilinos_02.mpirun=4.release ................................................   Passed    7.69 sec
            Start  6072: lac/diagonal_matrix_02.mpirun=7.release
10427/10570 Test  #6071: lac/diagonal_matrix_02.mpirun=7.debug ...........................................   Passed   16.46 sec
            Start  6854: matrix_free/cell_categorization.mpirun=7.debug
10428/10570 Test  #6072: lac/diagonal_matrix_02.mpirun=7.release .........................................   Passed   16.31 sec
            Start  6855: matrix_free/cell_categorization.mpirun=7.release
10429/10570 Test  #6855: matrix_free/cell_categorization.mpirun=7.release ................................   Passed    8.91 sec
            Start  6860: matrix_free/cell_categorization_02.mpirun=7.debug
10430/10570 Test  #6854: matrix_free/cell_categorization.mpirun=7.debug ..................................   Passed   13.40 sec
            Start  6861: matrix_free/cell_categorization_02.mpirun=7.release
10431/10570 Test  #6861: matrix_free/cell_categorization_02.mpirun=7.release .............................   Passed   13.30 sec
            Start  6878: matrix_free/dg_pbc_01.mpirun=7.debug
10432/10570 Test  #6878: matrix_free/dg_pbc_01.mpirun=7.debug ............................................   Passed   19.89 sec
            Start  6879: matrix_free/dg_pbc_01.mpirun=7.release
10433/10570 Test  #6879: matrix_free/dg_pbc_01.mpirun=7.release ..........................................   Passed   10.93 sec
            Start  6882: matrix_free/dg_pbc_02.mpirun=7.debug
10434/10570 Test  #6860: matrix_free/cell_categorization_02.mpirun=7.debug ...............................   Passed   49.25 sec
            Start  6883: matrix_free/dg_pbc_02.mpirun=7.release
10435/10570 Test  #6883: matrix_free/dg_pbc_02.mpirun=7.release ..........................................   Passed   13.19 sec
            Start  7201: matrix_free/parallel_multigrid.mpirun=7.debug
10436/10570 Test  #6882: matrix_free/dg_pbc_02.mpirun=7.debug ............................................   Passed   16.52 sec
            Start  7202: matrix_free/parallel_multigrid.mpirun=7.release
10437/10570 Test  #7202: matrix_free/parallel_multigrid.mpirun=7.release .................................   Passed   71.49 sec
            Start  7205: matrix_free/parallel_multigrid_02.mpirun=7.debug
10438/10570 Test  #4753: fullydistributed_grids/copy_serial_tria_grouped_01.mpirun=7.release .............   Passed  177.01 sec
            Start  7206: matrix_free/parallel_multigrid_02.mpirun=7.release
10439/10570 Test  #4752: fullydistributed_grids/copy_serial_tria_grouped_01.mpirun=7.debug ...............   Passed  203.47 sec
            Start  7209: matrix_free/parallel_multigrid_adaptive_01.mpirun=7.debug
10440/10570 Test  #7206: matrix_free/parallel_multigrid_02.mpirun=7.release ..............................   Passed  258.80 sec
            Start  7210: matrix_free/parallel_multigrid_adaptive_01.mpirun=7.release
10441/10570 Test  #7205: matrix_free/parallel_multigrid_02.mpirun=7.debug ................................   Passed  379.19 sec
            Start  7213: matrix_free/parallel_multigrid_adaptive_02.mpirun=7.debug
10442/10570 Test  #7201: matrix_free/parallel_multigrid.mpirun=7.debug ...................................   Passed  539.46 sec
            Start  7214: matrix_free/parallel_multigrid_adaptive_02.mpirun=7.release
10443/10570 Test  #7209: matrix_free/parallel_multigrid_adaptive_01.mpirun=7.debug .......................***Timeout 601.02 sec
            Start  7231: matrix_free/parallel_multigrid_mf.mpirun=7.debug
10444/10570 Test  #7210: matrix_free/parallel_multigrid_adaptive_01.mpirun=7.release .....................***Timeout 600.23 sec
            Start  7232: matrix_free/parallel_multigrid_mf.mpirun=7.release
10445/10570 Test  #7213: matrix_free/parallel_multigrid_adaptive_02.mpirun=7.debug .......................***Timeout 600.15 sec
            Start  7571: mpi/derivative_approximation_02.mpirun=7.debug
10446/10570 Test  #7214: matrix_free/parallel_multigrid_adaptive_02.mpirun=7.release .....................   Passed  535.66 sec
            Start  7572: mpi/derivative_approximation_02.mpirun=7.release
10447/10570 Test  #7571: mpi/derivative_approximation_02.mpirun=7.debug ..................................   Passed   21.65 sec
            Start  7651: mpi/has_hanging_nodes.mpirun=7.debug
10448/10570 Test  #7231: matrix_free/parallel_multigrid_mf.mpirun=7.debug ................................   Passed  363.90 sec
            Start  7652: mpi/has_hanging_nodes.mpirun=7.release
10449/10570 Test  #7572: mpi/derivative_approximation_02.mpirun=7.release ................................   Passed   10.79 sec
            Start  7729: mpi/hp_unify_dof_indices_08.mpirun=7.debug
10450/10570 Test  #7652: mpi/has_hanging_nodes.mpirun=7.release ..........................................   Passed   11.03 sec
            Start  7730: mpi/hp_unify_dof_indices_08.mpirun=7.release
10451/10570 Test  #7651: mpi/has_hanging_nodes.mpirun=7.debug ............................................   Passed   13.52 sec
            Start  7815: mpi/mg_06.mpirun=7.debug
10452/10570 Test  #7730: mpi/hp_unify_dof_indices_08.mpirun=7.release ....................................   Passed   13.91 sec
            Start  7816: mpi/mg_06.mpirun=7.release
10453/10570 Test  #7815: mpi/mg_06.mpirun=7.debug ........................................................   Passed   80.90 sec
            Start  7819: mpi/mg_ghost_dofs_periodic_01.mpirun=7.debug
10454/10570 Test  #7816: mpi/mg_06.mpirun=7.release ......................................................   Passed   74.21 sec
            Start  7820: mpi/mg_ghost_dofs_periodic_01.mpirun=7.release
10455/10570 Test  #7232: matrix_free/parallel_multigrid_mf.mpirun=7.release ..............................   Passed  233.85 sec
            Start  7831: mpi/mg_ghost_dofs_periodic_06.mpirun=7.debug
10456/10570 Test  #7819: mpi/mg_ghost_dofs_periodic_01.mpirun=7.debug ....................................   Passed   20.16 sec
            Start  7832: mpi/mg_ghost_dofs_periodic_06.mpirun=7.release
10457/10570 Test  #7820: mpi/mg_ghost_dofs_periodic_01.mpirun=7.release ..................................   Passed   13.71 sec
            Start  7845: mpi/muelu_periodicity.mpirun=7.debug
10458/10570 Test  #7832: mpi/mg_ghost_dofs_periodic_06.mpirun=7.release ..................................   Passed   37.49 sec
            Start  7846: mpi/muelu_periodicity.mpirun=7.release
10459/10570 Test  #7729: mpi/hp_unify_dof_indices_08.mpirun=7.debug ......................................   Passed  144.24 sec
            Start  8199: mpi/periodicity_02.mpirun=7.debug
10460/10570 Test  #7831: mpi/mg_ghost_dofs_periodic_06.mpirun=7.debug ....................................   Passed   53.89 sec
            Start  8200: mpi/periodicity_02.mpirun=7.release
10461/10570 Test  #7845: mpi/muelu_periodicity.mpirun=7.debug ............................................   Passed   42.91 sec
            Start  8207: mpi/periodicity_04.mpirun=7.debug
10462/10570 Test  #8207: mpi/periodicity_04.mpirun=7.debug ...............................................   Passed  349.39 sec
            Start  8208: mpi/periodicity_04.mpirun=7.release
10463/10570 Test  #7846: mpi/muelu_periodicity.mpirun=7.release ..........................................   Passed  422.71 sec
            Start  8225: mpi/point_value_01.mpirun=6.debug
10464/10570 Test  #8208: mpi/periodicity_04.mpirun=7.release .............................................   Passed   81.10 sec
            Start  8226: mpi/point_value_01.mpirun=6.release
10465/10570 Test  #8199: mpi/periodicity_02.mpirun=7.debug ...............................................   Passed  436.55 sec
            Start  8341: mpi/step-37.mpirun=7.debug
10466/10570 Test  #8200: mpi/periodicity_02.mpirun=7.release .............................................   Passed  433.52 sec
            Start  8342: mpi/step-37.mpirun=7.release
10467/10570 Test  #8225: mpi/point_value_01.mpirun=6.debug ...............................................   Passed   17.06 sec
            Start  8349: mpi/step-39.mpirun=6.debug
10468/10570 Test  #8226: mpi/point_value_01.mpirun=6.release .............................................   Passed    5.08 sec
            Start  8350: mpi/step-39.mpirun=6.release
10469/10570 Test  #8342: mpi/step-37.mpirun=7.release ....................................................***Failed  120.12 sec
            Start  8365: mpi/tria_ghost_owners_01.mpirun=7.debug
10470/10570 Test  #8341: mpi/step-37.mpirun=7.debug ......................................................***Failed  296.80 sec
            Start  8366: mpi/tria_ghost_owners_01.mpirun=7.release
10471/10570 Test  #8350: mpi/step-39.mpirun=6.release ....................................................   Passed  303.19 sec
            Start  8449: mpi/trilinos_ghost_01.mpirun=4.debug
10472/10570 Test  #8449: mpi/trilinos_ghost_01.mpirun=4.debug ............................................   Passed   10.17 sec
            Start  8450: mpi/trilinos_ghost_01.mpirun=4.release
10473/10570 Test  #8450: mpi/trilinos_ghost_01.mpirun=4.release ..........................................   Passed    9.33 sec
            Start  8453: mpi/trilinos_ghost_02.mpirun=4.debug
10474/10570 Test  #8453: mpi/trilinos_ghost_02.mpirun=4.debug ............................................   Passed    8.84 sec
            Start  8454: mpi/trilinos_ghost_02.mpirun=4.release
10475/10570 Test  #8349: mpi/step-39.mpirun=6.debug ......................................................   Passed  334.97 sec
            Start  7321: mpi/attach_data_01.mpirun=8.debug
10476/10570 Test  #8454: mpi/trilinos_ghost_02.mpirun=4.release ..........................................   Passed    9.84 sec
            Start  8456: mpi/trilinos_ghost_03.mpirun=4.debug
10477/10570 Test  #8366: mpi/tria_ghost_owners_01.mpirun=7.release .......................................   Passed   50.32 sec
            Start  8458: mpi/trilinos_ghost_03_linfty.mpirun=4.debug
10478/10570 Test  #7321: mpi/attach_data_01.mpirun=8.debug ...............................................   Passed   13.51 sec
            Start  7132: matrix_free/matrix_vector_faces_16.mpirun=11.debug
10479/10570 Test  #8456: mpi/trilinos_ghost_03.mpirun=4.debug ............................................   Passed   10.50 sec
            Start  8461: mpi/trilinos_ghost_05.mpirun=4.debug
10480/10570 Test  #8458: mpi/trilinos_ghost_03_linfty.mpirun=4.debug .....................................   Passed    7.40 sec
            Start  8462: mpi/trilinos_ghost_05.mpirun=4.release
10481/10570 Test  #8461: mpi/trilinos_ghost_05.mpirun=4.debug ............................................   Passed    7.05 sec
10482/10570 Test  #8462: mpi/trilinos_ghost_05.mpirun=4.release ..........................................   Passed    6.72 sec
            Start  7322: mpi/attach_data_01.mpirun=8.release
10483/10570 Test  #7322: mpi/attach_data_01.mpirun=8.release .............................................   Passed    8.33 sec
            Start  7327: mpi/attach_data_02.mpirun=8.debug
10484/10570 Test  #8365: mpi/tria_ghost_owners_01.mpirun=7.debug .........................................   Passed  249.52 sec
            Start  8624: multigrid/step-16-50-mpi.mpirun=7.debug
10485/10570 Test  #7327: mpi/attach_data_02.mpirun=8.debug ...............................................   Passed    9.44 sec
            Start  7328: mpi/attach_data_02.mpirun=8.release
10486/10570 Test  #8624: multigrid/step-16-50-mpi.mpirun=7.debug .........................................   Passed   14.39 sec
            Start  8625: multigrid/step-16-50-mpi.mpirun=7.release
10487/10570 Test  #7328: mpi/attach_data_02.mpirun=8.release .............................................   Passed    5.55 sec
            Start  7335: mpi/cell_data_transfer_01.mpirun=8.debug
10488/10570 Test  #8625: multigrid/step-16-50-mpi.mpirun=7.release .......................................   Passed    3.44 sec
            Start  8674: multigrid/transfer_matrix_free_01.mpirun=7.debug
10489/10570 Test  #7335: mpi/cell_data_transfer_01.mpirun=8.debug ........................................   Passed   12.98 sec
            Start  7336: mpi/cell_data_transfer_01.mpirun=8.release
10490/10570 Test  #7336: mpi/cell_data_transfer_01.mpirun=8.release ......................................   Passed   17.58 sec
            Start  7339: mpi/cell_data_transfer_02.mpirun=8.debug
10491/10570 Test  #7132: matrix_free/matrix_vector_faces_16.mpirun=11.debug ..............................   Passed   77.78 sec
            Start  7133: matrix_free/matrix_vector_faces_16.mpirun=11.release
10492/10570 Test  #7339: mpi/cell_data_transfer_02.mpirun=8.debug ........................................   Passed   16.60 sec
            Start  7340: mpi/cell_data_transfer_02.mpirun=8.release
10493/10570 Test  #7340: mpi/cell_data_transfer_02.mpirun=8.release ......................................   Passed   13.08 sec
            Start  7343: mpi/cell_data_transfer_03.mpirun=8.debug
10494/10570 Test  #7343: mpi/cell_data_transfer_03.mpirun=8.debug ........................................   Passed   10.50 sec
            Start  7344: mpi/cell_data_transfer_03.mpirun=8.release
10495/10570 Test  #7344: mpi/cell_data_transfer_03.mpirun=8.release ......................................   Passed    9.36 sec
            Start  7577: mpi/distort_random_01.mpirun=8.debug
10496/10570 Test  #7577: mpi/distort_random_01.mpirun=8.debug ............................................   Passed   13.70 sec
            Start  7578: mpi/distort_random_01.mpirun=8.release
10497/10570 Test  #7578: mpi/distort_random_01.mpirun=8.release ..........................................   Passed   13.47 sec
            Start  7583: mpi/distort_random_02.mpirun=8.debug
10498/10570 Test  #7133: matrix_free/matrix_vector_faces_16.mpirun=11.release ............................   Passed   66.56 sec
            Start  7584: mpi/distort_random_02.mpirun=8.release
10499/10570 Test  #7583: mpi/distort_random_02.mpirun=8.debug ............................................   Passed   13.25 sec
            Start  7639: mpi/fe_tools_extrapolate_06.mpirun=10.debug
10500/10570 Test  #7584: mpi/distort_random_02.mpirun=8.release ..........................................   Passed   13.46 sec
            Start  7655: mpi/hp_active_fe_indices_transfer_01.mpirun=8.debug
10501/10570 Test  #7655: mpi/hp_active_fe_indices_transfer_01.mpirun=8.debug .............................   Passed   18.43 sec
            Start  7656: mpi/hp_active_fe_indices_transfer_01.mpirun=8.release
10502/10570 Test  #7656: mpi/hp_active_fe_indices_transfer_01.mpirun=8.release ...........................   Passed   15.39 sec
            Start  7659: mpi/hp_active_fe_indices_transfer_02.mpirun=8.debug
10503/10570 Test  #8674: multigrid/transfer_matrix_free_01.mpirun=7.debug ................................   Passed  162.55 sec
            Start  8675: multigrid/transfer_matrix_free_01.mpirun=7.release
10504/10570 Test  #7659: mpi/hp_active_fe_indices_transfer_02.mpirun=8.debug .............................   Passed   22.37 sec
            Start  7660: mpi/hp_active_fe_indices_transfer_02.mpirun=8.release
10505/10570 Test  #7660: mpi/hp_active_fe_indices_transfer_02.mpirun=8.release ...........................   Passed   21.55 sec
            Start  7663: mpi/hp_active_fe_indices_transfer_03.mpirun=8.debug
10506/10570 Test  #7663: mpi/hp_active_fe_indices_transfer_03.mpirun=8.debug .............................   Passed   15.83 sec
            Start  7664: mpi/hp_active_fe_indices_transfer_03.mpirun=8.release
10507/10570 Test  #7664: mpi/hp_active_fe_indices_transfer_03.mpirun=8.release ...........................   Passed   20.78 sec
            Start  7855: mpi/no_flux_constraints.mpirun=9.debug
10508/10570 Test  #7855: mpi/no_flux_constraints.mpirun=9.debug ..........................................   Passed   83.77 sec
            Start  7856: mpi/no_flux_constraints.mpirun=9.release
10509/10570 Test  #7639: mpi/fe_tools_extrapolate_06.mpirun=10.debug .....................................   Passed  199.62 sec
            Start  7640: mpi/fe_tools_extrapolate_06.mpirun=10.release
10510/10570 Test  #8675: multigrid/transfer_matrix_free_01.mpirun=7.release ..............................   Passed  158.65 sec
            Start  8690: multigrid/transfer_matrix_free_04.mpirun=7.debug
10511/10570 Test  #7856: mpi/no_flux_constraints.mpirun=9.release ........................................   Passed   51.29 sec
            Start  7859: mpi/no_flux_constraints_02.mpirun=9.debug
10512/10570 Test  #7859: mpi/no_flux_constraints_02.mpirun=9.debug .......................................   Passed   46.58 sec
            Start  7860: mpi/no_flux_constraints_02.mpirun=9.release
10513/10570 Test  #7860: mpi/no_flux_constraints_02.mpirun=9.release .....................................   Passed   24.80 sec
            Start  7863: mpi/no_flux_constraints_03.mpirun=9.debug
10514/10570 Test  #7640: mpi/fe_tools_extrapolate_06.mpirun=10.release ...................................   Passed  129.02 sec
            Start  7645: mpi/has_active_dofs_01.mpirun=10.debug
10515/10570 Test  #7863: mpi/no_flux_constraints_03.mpirun=9.debug .......................................   Passed   17.76 sec
            Start  7864: mpi/no_flux_constraints_03.mpirun=9.release
10516/10570 Test  #7864: mpi/no_flux_constraints_03.mpirun=9.release .....................................   Passed   12.43 sec
            Start  7865: mpi/normal_flux_constraints.mpirun=9.debug
10517/10570 Test  #7645: mpi/has_active_dofs_01.mpirun=10.debug ..........................................   Passed   44.98 sec
            Start  7646: mpi/has_active_dofs_01.mpirun=10.release
10518/10570 Test  #7865: mpi/normal_flux_constraints.mpirun=9.debug ......................................   Passed   58.77 sec
            Start  7866: mpi/normal_flux_constraints.mpirun=9.release
10519/10570 Test  #7646: mpi/has_active_dofs_01.mpirun=10.release ........................................   Passed   40.84 sec
            Start  7647: mpi/has_active_dofs_02.mpirun=10.debug
10520/10570 Test  #8690: multigrid/transfer_matrix_free_04.mpirun=7.debug ................................   Passed  212.48 sec
            Start  8691: multigrid/transfer_matrix_free_04.mpirun=7.release
10521/10570 Test  #8691: multigrid/transfer_matrix_free_04.mpirun=7.release ..............................   Passed    7.69 sec
10522/10570 Test  #7647: mpi/has_active_dofs_02.mpirun=10.debug ..........................................   Passed   28.92 sec
            Start  8696: multigrid/transfer_matrix_free_06.mpirun=15.debug
10523/10570 Test  #7866: mpi/normal_flux_constraints.mpirun=9.release ....................................   Passed   33.29 sec
            Start  7648: mpi/has_active_dofs_02.mpirun=10.release
10524/10570 Test  #7648: mpi/has_active_dofs_02.mpirun=10.release ........................................   Passed   20.07 sec
            Start  7731: mpi/hp_unify_dof_indices_09.mpirun=10.debug
10525/10570 Test  #7731: mpi/hp_unify_dof_indices_09.mpirun=10.debug .....................................   Passed   84.48 sec
            Start  7732: mpi/hp_unify_dof_indices_09.mpirun=10.release
10526/10570 Test  #7732: mpi/hp_unify_dof_indices_09.mpirun=10.release ...................................   Passed   57.09 sec
            Start  7813: mpi/mg_05.mpirun=10.debug
10527/10570 Test  #7813: mpi/mg_05.mpirun=10.debug .......................................................   Passed   67.84 sec
            Start  7814: mpi/mg_05.mpirun=10.release
10528/10570 Test  #7814: mpi/mg_05.mpirun=10.release .....................................................   Passed   52.97 sec
            Start  8007: mpi/p_adaptivity_fixed_number.mpirun=8.debug
10529/10570 Test  #8007: mpi/p_adaptivity_fixed_number.mpirun=8.debug ....................................   Passed   12.64 sec
            Start  8008: mpi/p_adaptivity_fixed_number.mpirun=8.release
10530/10570 Test  #8008: mpi/p_adaptivity_fixed_number.mpirun=8.release ..................................   Passed   12.37 sec
            Start  8013: mpi/p_refinement_and_coarsening.mpirun=8.debug
10531/10570 Test  #8013: mpi/p_refinement_and_coarsening.mpirun=8.debug ..................................   Passed   17.54 sec
            Start  8014: mpi/p_refinement_and_coarsening.mpirun=8.release
10532/10570 Test  #8014: mpi/p_refinement_and_coarsening.mpirun=8.release ................................   Passed   14.38 sec
            Start  8059: mpi/parallel_block_vector_13.mpirun=10.debug
10533/10570 Test  #8059: mpi/parallel_block_vector_13.mpirun=10.debug ....................................   Passed   49.58 sec
            Start  8060: mpi/parallel_block_vector_13.mpirun=10.release
10534/10570 Test  #8060: mpi/parallel_block_vector_13.mpirun=10.release ..................................   Passed   47.12 sec
            Start  8209: mpi/periodicity_05.mpirun=9.debug
10535/10570 Test  #8209: mpi/periodicity_05.mpirun=9.debug ...............................................   Passed   60.50 sec
            Start  8210: mpi/periodicity_05.mpirun=9.release
10536/10570 Test  #8210: mpi/periodicity_05.mpirun=9.release .............................................   Passed   41.84 sec
            Start  8519: multigrid/constrained_dofs_02.mpirun=8.debug
10537/10570 Test  #8519: multigrid/constrained_dofs_02.mpirun=8.debug ....................................   Passed   10.25 sec
            Start  8520: multigrid/constrained_dofs_02.mpirun=8.release
10538/10570 Test  #8520: multigrid/constrained_dofs_02.mpirun=8.release ..................................   Passed    8.45 sec
            Start  8644: multigrid/step-50_01.mpirun=8.debug
10539/10570 Test  #8696: multigrid/transfer_matrix_free_06.mpirun=15.debug ...............................***Timeout 600.22 sec
            Start  8697: multigrid/transfer_matrix_free_06.mpirun=15.release
10540/10570 Test  #8644: multigrid/step-50_01.mpirun=8.debug .............................................   Passed   45.60 sec
            Start  8645: multigrid/step-50_01.mpirun=8.release
10541/10570 Test  #8645: multigrid/step-50_01.mpirun=8.release ...........................................   Passed    3.57 sec
            Start  8698: multigrid/transfer_matrix_free_06.mpirun=5.debug
10542/10570 Test  #8698: multigrid/transfer_matrix_free_06.mpirun=5.debug ................................   Passed  146.51 sec
            Start 10111: trilinos/n_nonzeros_02_parallel.mpirun=9.debug
10543/10570 Test #10111: trilinos/n_nonzeros_02_parallel.mpirun=9.debug ..................................   Passed   47.57 sec
            Start 10112: trilinos/n_nonzeros_02_parallel.mpirun=9.release
10544/10570 Test #10112: trilinos/n_nonzeros_02_parallel.mpirun=9.release ................................   Passed   44.19 sec
10545/10570 Test  #8697: multigrid/transfer_matrix_free_06.mpirun=15.release .............................   Passed  588.33 sec
            Start  7827: mpi/mg_ghost_dofs_periodic_05.mpirun=28.debug
10546/10570 Test  #7827: mpi/mg_ghost_dofs_periodic_05.mpirun=28.debug ...................................   Passed  114.90 sec
            Start  7828: mpi/mg_ghost_dofs_periodic_05.mpirun=28.release
10547/10570 Test  #7828: mpi/mg_ghost_dofs_periodic_05.mpirun=28.release .................................   Passed   36.92 sec
            Start  7979: mpi/p4est_3d_refine_04.mpirun=24.debug
10548/10570 Test  #7979: mpi/p4est_3d_refine_04.mpirun=24.debug ..........................................   Passed   18.59 sec
            Start  7980: mpi/p4est_3d_refine_04.mpirun=24.release
10549/10570 Test  #7980: mpi/p4est_3d_refine_04.mpirun=24.release ........................................   Passed    6.86 sec
            Start  8281: mpi/refinement_listener_01.mpirun=20.debug
            Start  7981: mpi/p4est_3d_refine_04.mpirun=4.debug
10550/10570 Test  #8281: mpi/refinement_listener_01.mpirun=20.debug ......................................   Passed   15.28 sec
            Start  8282: mpi/refinement_listener_01.mpirun=20.release
10551/10570 Test  #7981: mpi/p4est_3d_refine_04.mpirun=4.debug ...........................................   Passed   20.46 sec
            Start  7982: mpi/p4est_3d_refine_04.mpirun=4.release
10552/10570 Test  #8282: mpi/refinement_listener_01.mpirun=20.release ....................................   Passed    9.54 sec
            Start  8287: mpi/refinement_listener_02.mpirun=20.debug
10553/10570 Test  #7982: mpi/p4est_3d_refine_04.mpirun=4.release .........................................   Passed    6.56 sec
            Start  8283: mpi/refinement_listener_01.mpirun=4.debug
10554/10570 Test  #8283: mpi/refinement_listener_01.mpirun=4.debug .......................................   Passed    9.31 sec
            Start  8284: mpi/refinement_listener_01.mpirun=4.release
10555/10570 Test  #8287: mpi/refinement_listener_02.mpirun=20.debug ......................................   Passed   14.09 sec
            Start  8288: mpi/refinement_listener_02.mpirun=20.release
10556/10570 Test  #8284: mpi/refinement_listener_01.mpirun=4.release .....................................   Passed    5.23 sec
            Start  8289: mpi/refinement_listener_02.mpirun=4.debug
10557/10570 Test  #8288: mpi/refinement_listener_02.mpirun=20.release ....................................   Passed   10.18 sec
            Start  8536: multigrid/distribute_bug_01.mpirun=20.debug
10558/10570 Test  #8289: mpi/refinement_listener_02.mpirun=4.debug .......................................   Passed    7.91 sec
            Start  8290: mpi/refinement_listener_02.mpirun=4.release
10559/10570 Test  #8290: mpi/refinement_listener_02.mpirun=4.release .....................................   Passed    8.71 sec
            Start  8699: multigrid/transfer_matrix_free_06.mpirun=5.release
10560/10570 Test  #8536: multigrid/distribute_bug_01.mpirun=20.debug .....................................   Passed   30.51 sec
            Start  8537: multigrid/distribute_bug_01.mpirun=20.release
10561/10570 Test  #8699: multigrid/transfer_matrix_free_06.mpirun=5.release ..............................   Passed   22.15 sec
10562/10570 Test  #8537: multigrid/distribute_bug_01.mpirun=20.release ...................................   Passed    6.70 sec
            Start  7829: mpi/mg_ghost_dofs_periodic_05.mpirun=6.debug
            Start  7830: mpi/mg_ghost_dofs_periodic_05.mpirun=6.release
            Start  8213: mpi/periodicity_07.mpirun=13.debug
10563/10570 Test  #7830: mpi/mg_ghost_dofs_periodic_05.mpirun=6.release ..................................   Passed    7.93 sec
            Start  8538: multigrid/distribute_bug_01.mpirun=6.debug
10564/10570 Test  #8538: multigrid/distribute_bug_01.mpirun=6.debug ......................................   Passed   14.14 sec
            Start  8539: multigrid/distribute_bug_01.mpirun=6.release
10565/10570 Test  #8539: multigrid/distribute_bug_01.mpirun=6.release ....................................   Passed    5.51 sec
10566/10570 Test  #8213: mpi/periodicity_07.mpirun=13.debug ..............................................   Passed   54.40 sec
            Start  8214: mpi/periodicity_07.mpirun=13.release
10567/10570 Test  #7829: mpi/mg_ghost_dofs_periodic_05.mpirun=6.debug ....................................   Passed   69.98 sec
10568/10570 Test  #8214: mpi/periodicity_07.mpirun=13.release ............................................   Passed   34.92 sec
            Start  7835: mpi/mg_ghost_dofs_periodic_07.mpirun=43.debug
10569/10570 Test  #7835: mpi/mg_ghost_dofs_periodic_07.mpirun=43.debug ...................................   Passed   30.40 sec
            Start  7836: mpi/mg_ghost_dofs_periodic_07.mpirun=43.release
10570/10570 Test  #7836: mpi/mg_ghost_dofs_periodic_07.mpirun=43.release .................................   Passed   16.75 sec

99% tests passed, 29 tests failed out of 10570

Total Test time (real) = 45438.99 sec

The following tests FAILED:
	2634 - boost/point_adaptor_01.debug (Failed)
	2635 - boost/point_adaptor_01.release (Failed)
	2638 - boost/rtree_02.debug (Failed)
	2639 - boost/rtree_02.release (Failed)
	2860 - cuda/parallel_vector_11.mpirun=2.debug (Failed)
	2861 - cuda/parallel_vector_11.mpirun=2.release (Failed)
	2890 - cuda/solver_02.debug (Failed)
	2891 - cuda/solver_02.release (Failed)
	2903 - cuda/solver_08.release (Failed)
	2915 - cuda/vector_memory_02.release (Failed)
	3129 - distributed_grids/3d_coarse_grid_02.debug (Failed)
	3141 - distributed_grids/3d_coarsening_04.debug (Timeout)
	3156 - distributed_grids/3d_refinement_08.debug (Timeout)
	4714 - fullydistributed_grids/copy_distributed_tria_02.mpirun=1.debug (Timeout)
	4726 - fullydistributed_grids/copy_serial_tria_02.mpirun=1.debug (Timeout)
	4744 - fullydistributed_grids/copy_serial_tria_07.mpirun=1.debug (Timeout)
	5096 - grid/grid_tools_cache_04.mpirun=4.debug (Failed)
	5097 - grid/grid_tools_cache_04.mpirun=4.release (Failed)
	5471 - hp/distribute_dofs_linear_time.debug (Timeout)
	7209 - matrix_free/parallel_multigrid_adaptive_01.mpirun=7.debug (Timeout)
	7210 - matrix_free/parallel_multigrid_adaptive_01.mpirun=7.release (Timeout)
	7213 - matrix_free/parallel_multigrid_adaptive_02.mpirun=7.debug (Timeout)
	8341 - mpi/step-37.mpirun=7.debug (Failed)
	8342 - mpi/step-37.mpirun=7.release (Failed)
	8503 - mpi/trilinos_step-27.mpirun=2.debug (Failed)
	8504 - mpi/trilinos_step-27.mpirun=2.release (Failed)
	8682 - multigrid/transfer_matrix_free_02_block_02.mpirun=5.debug (Timeout)
	8684 - multigrid/transfer_matrix_free_03.mpirun=5.debug (Timeout)
	8696 - multigrid/transfer_matrix_free_06.mpirun=15.debug (Timeout)
-- Running CTEST_SUBMIT()
	Add file: /home/build/revision.log
	Add file: /home/build/summary.log
	Add file: /home/build/detailed.log
	Add file: /home/build/include/deal.II/base/config.h
Submit files
   Send to track: Continuous
   SubmitURL: https://cdash.43-1.org/submit.php?project=deal.II
   Uploaded: /home/build/Testing/20200505-0406/Update.xml
   Uploaded: /home/build/Testing/20200505-0406/Configure.xml
   Uploaded: /home/build/Testing/20200505-0406/Build.xml
   Uploaded: /home/build/Testing/20200505-0406/Test.xml
   Uploaded: /home/build/Testing/20200505-0406/Notes.xml
   Uploaded: /home/build/Testing/20200505-0406/Done.xml
   Submission successful
-- Submission successful. Goodbye!
rm: cannot remove '/var/jenkins/workspace/deal.II-CUDA10.1/build': No such file or directory
+ docker stop cuda10_deal_ci
cuda10_deal_ci
+ docker rm -f cuda10_deal_ci
cuda10_deal_ci
[WARNINGS] Parsing warnings in console log with parser GNU Make + GNU C Compiler (gcc)
No credentials specified
<Git Blamer> Using GitBlamer to create author and commit information for all warnings.
<Git Blamer> GIT_COMMIT=1218f423d4e37e159d18204eebf0a6f7b1658c7e, workspace=/var/jenkins/workspace/deal.II-CUDA10.1
INFO: Starting to record.
INFO: Processing CTest-Version 3.x (default)
INFO: [CTest-Version 3.x (default)] - 1 test report file(s) were found with the pattern 'build/Testing/**/Test.xml' relative to '/var/jenkins/workspace/deal.II-CUDA10.1' for the testing framework 'CTest-Version 3.x (default)'.
INFO: Check 'Failed Tests' threshold.
INFO: The total number of tests for the threshold 'Failed Tests' exceeds the specified "failure threshold" value.
INFO: Setting the build status to FAILURE
INFO: Stopping recording.
Build step 'Publish xUnit test result report' changed build result to FAILURE
Finished: FAILURE