Console Output

Skipping 5,659 KB.. Full Log
60: [ RUN      ] std_algorithms_numerics_test.transform_reduce_default_functors_using_custom_value_type
60: [       OK ] std_algorithms_numerics_test.transform_reduce_default_functors_using_custom_value_type (1 ms)
60: [ RUN      ] std_algorithms_numerics_test.transform_reduce_custom_functors_overloadA_using_pod_value_type
60: [       OK ] std_algorithms_numerics_test.transform_reduce_custom_functors_overloadA_using_pod_value_type (1 ms)
60: [ RUN      ] std_algorithms_numerics_test.transform_reduce_custom_functors_overloadA_using_custom_value_type
60: [       OK ] std_algorithms_numerics_test.transform_reduce_custom_functors_overloadA_using_custom_value_type (1 ms)
60: [ RUN      ] std_algorithms_numerics_test.transform_reduce_custom_functors_overloadB_using_pod_value_type
60: [       OK ] std_algorithms_numerics_test.transform_reduce_custom_functors_overloadB_using_pod_value_type (1 ms)
60: [ RUN      ] std_algorithms_numerics_test.transform_reduce_custom_functors_overloadB_using_custom_value_type
60: [       OK ] std_algorithms_numerics_test.transform_reduce_custom_functors_overloadB_using_custom_value_type (1 ms)
60: [ RUN      ] std_algorithms_numerics_test.reduce_default_functors_overloadA_using_pod_value_type
60: [       OK ] std_algorithms_numerics_test.reduce_default_functors_overloadA_using_pod_value_type (0 ms)
60: [ RUN      ] std_algorithms_numerics_test.reduce_default_functors_overloadA_using_custom_value_type
60: [       OK ] std_algorithms_numerics_test.reduce_default_functors_overloadA_using_custom_value_type (0 ms)
60: [ RUN      ] std_algorithms_numerics_test.reduce_default_functors_overloadB_using_pod_value_type
60: [       OK ] std_algorithms_numerics_test.reduce_default_functors_overloadB_using_pod_value_type (0 ms)
60: [ RUN      ] std_algorithms_numerics_test.reduce_default_functors_overloadB_using_custom_value_type
60: [       OK ] std_algorithms_numerics_test.reduce_default_functors_overloadB_using_custom_value_type (0 ms)
60: [ RUN      ] std_algorithms_numerics_test.reduce_custom_functors_using_pod_value_type
60: [       OK ] std_algorithms_numerics_test.reduce_custom_functors_using_pod_value_type (1 ms)
60: [ RUN      ] std_algorithms_numerics_test.reduce_custom_functors_using_custom_value_type
60: [       OK ] std_algorithms_numerics_test.reduce_custom_functors_using_custom_value_type (1 ms)
60: [----------] 12 tests from std_algorithms_numerics_test (14 ms total)
60: 
60: [----------] 1 test from std_algorithms_numerics_ops_test
60: [ RUN      ] std_algorithms_numerics_ops_test.adjecent_difference
60: [       OK ] std_algorithms_numerics_ops_test.adjecent_difference (185 ms)
60: [----------] 1 test from std_algorithms_numerics_ops_test (185 ms total)
60: 
60: [----------] 4 tests from std_algorithms_numeric_ops_test
60: [ RUN      ] std_algorithms_numeric_ops_test.exclusive_scan
60: [       OK ] std_algorithms_numeric_ops_test.exclusive_scan (828 ms)
60: [ RUN      ] std_algorithms_numeric_ops_test.inclusive_scan
60: [       OK ] std_algorithms_numeric_ops_test.inclusive_scan (572 ms)
60: [ RUN      ] std_algorithms_numeric_ops_test.transform_exclusive_scan
60: [       OK ] std_algorithms_numeric_ops_test.transform_exclusive_scan (232 ms)
60: [ RUN      ] std_algorithms_numeric_ops_test.transform_inclusive_scan
60: [       OK ] std_algorithms_numeric_ops_test.transform_inclusive_scan (75 ms)
60: [----------] 4 tests from std_algorithms_numeric_ops_test (1709 ms total)
60: 
60: [----------] 1 test from std_algorithms_transform_ops_test
60: [ RUN      ] std_algorithms_transform_ops_test.transform_unary_op
60: [       OK ] std_algorithms_transform_ops_test.transform_unary_op (61 ms)
60: [----------] 1 test from std_algorithms_transform_ops_test (61 ms total)
60: 
60: [----------] Global test environment tear-down
60: [==========] 25 tests from 7 test suites ran. (2087 ms total)
60: [  PASSED  ] 25 tests.
60/60 Test #60: KokkosAlgorithms_UnitTest_StdSet_E ...........   Passed    2.45 sec

98% tests passed, 1 tests failed out of 60

Total Test time (real) = 321.82 sec

The following tests FAILED:
	  4 - KokkosCore_UnitTest_Cuda1 (Failed)
Errors while running CTest
Post stage
[Pipeline] sh
+ ccache --show-stats
cache directory                     /tmp/ccache
primary config                      /tmp/ccache/ccache.conf
secondary config      (readonly)    /etc/ccache.conf
stats zero time                     Sun Jun 26 14:48:49 2022
cache hit (direct)                   101
cache hit (preprocessed)               4
cache miss                           481
cache hit rate                     17.92 %
cleanups performed                     3
files in cache                     12177
cache size                           8.7 GB
max cache size                      10.0 GB
[Pipeline] }
$ docker stop --time=1 eb798eed4ae0df5760ff2f9355e74bed23fc38e6817bf9e86a0d09d4abcb03d5
$ docker rm -f eb798eed4ae0df5760ff2f9355e74bed23fc38e6817bf9e86a0d09d4abcb03d5
[Pipeline] // withDockerContainer
[Pipeline] }
[Pipeline] // withEnv
[Pipeline] }
[Pipeline] // node
[Pipeline] }
[Pipeline] // stage
[Pipeline] }
Failed in branch CUDA-10.1-Clang-Tidy
[ 40%] Building CXX object core/unit_test/CMakeFiles/KokkosCore_UnitTest_SYCL1B.dir/sycl/TestSYCL_Reducers_d.cpp.o
[ 40%] Linking CXX executable KokkosCore_UnitTest_Default
[ 40%] Building CXX object core/unit_test/CMakeFiles/KokkosCore_UnitTest_Serial1.dir/serial/TestSerial_Reducers_e.cpp.o
[ 40%] Building CXX object core/unit_test/CMakeFiles/KokkosCore_UnitTest_SYCL2A.dir/sycl/TestSYCL_ViewAPI_c.cpp.o
Scanning dependencies of target KokkosCore_UnitTest_Serial2
[ 40%] Building CXX object core/unit_test/CMakeFiles/KokkosCore_UnitTest_Serial2.dir/UnitTestMainInit.cpp.o
[ 40%] Building CXX object core/unit_test/CMakeFiles/KokkosCore_UnitTest_SYCL1A.dir/sycl/TestSYCL_HostSharedPtr.cpp.o
[ 40%] Building CXX object core/unit_test/CMakeFiles/KokkosCore_UnitTest_Serial2.dir/serial/TestSerial_Abort.cpp.o
[ 40%] Building CXX object core/unit_test/CMakeFiles/KokkosCore_UnitTest_SYCL2A.dir/sycl/TestSYCL_ViewAPI_d.cpp.o
[ 40%] Building CXX object core/unit_test/CMakeFiles/KokkosCore_UnitTest_Serial1.dir/serial/TestSerial_Reductions_DeviceView.cpp.o
[ 41%] Building CXX object core/unit_test/CMakeFiles/KokkosCore_UnitTest_Serial2.dir/serial/TestSerial_TeamBasic.cpp.o
[ 42%] Building CXX object core/unit_test/CMakeFiles/KokkosCore_UnitTest_SYCL2A.dir/sycl/TestSYCL_ViewAPI_e.cpp.o
[ 43%] Building CXX object core/unit_test/CMakeFiles/KokkosCore_UnitTest_SYCL1A.dir/sycl/TestSYCL_HostSharedPtrAccessOnDevice.cpp.o
[ 43%] Building CXX object core/unit_test/CMakeFiles/KokkosCore_UnitTest_SYCL1B.dir/sycl/TestSYCL_Reducers_e.cpp.o
[ 44%] Building CXX object core/unit_test/CMakeFiles/KokkosCore_UnitTest_Serial1.dir/serial/TestSerial_Scan.cpp.o
[ 44%] Building CXX object core/unit_test/CMakeFiles/KokkosCore_UnitTest_SYCL2A.dir/sycl/TestSYCL_ViewCopy_a.cpp.o
[ 44%] Building CXX object core/unit_test/CMakeFiles/KokkosCore_UnitTest_SYCL1A.dir/sycl/TestSYCL_QuadPrecisionMath.cpp.o
[ 44%] Building CXX object core/unit_test/CMakeFiles/KokkosCore_UnitTest_Serial1.dir/serial/TestSerial_SharedAlloc.cpp.o
[ 44%] Building CXX object core/unit_test/CMakeFiles/KokkosCore_UnitTest_SYCL2A.dir/sycl/TestSYCL_ViewCopy_b.cpp.o
[ 44%] Building CXX object core/unit_test/CMakeFiles/KokkosCore_UnitTest_Serial2.dir/serial/TestSerial_TeamReductionScan.cpp.o
[ 44%] Building CXX object core/unit_test/CMakeFiles/KokkosCore_UnitTest_SYCL1A.dir/sycl/TestSYCL_ExecSpacePartitioning.cpp.o
[ 44%] Building CXX object core/unit_test/CMakeFiles/KokkosCore_UnitTest_SYCL1A.dir/sycl/TestSYCL_MathematicalSpecialFunctions.cpp.o
[ 44%] Building CXX object core/unit_test/CMakeFiles/KokkosCore_UnitTest_Serial1.dir/serial/TestSerial_ViewMapping_a.cpp.o
[ 44%] Building CXX object core/unit_test/CMakeFiles/KokkosCore_UnitTest_Serial2.dir/serial/TestSerial_TeamScan.cpp.o
[ 44%] Building CXX object core/unit_test/CMakeFiles/KokkosCore_UnitTest_Serial2.dir/serial/TestSerial_TeamScratch.cpp.o
[ 44%] Building CXX object core/unit_test/CMakeFiles/KokkosCore_UnitTest_SYCL1B.dir/sycl/TestSYCL_Reductions_DeviceView.cpp.o
[ 44%] Building CXX object core/unit_test/CMakeFiles/KokkosCore_UnitTest_SYCL2A.dir/sycl/TestSYCL_ViewHooks.cpp.o
[ 44%] Building CXX object core/unit_test/CMakeFiles/KokkosCore_UnitTest_Serial2.dir/serial/TestSerial_TeamTeamSize.cpp.o
[ 44%] Building CXX object core/unit_test/CMakeFiles/KokkosCore_UnitTest_SYCL2A.dir/sycl/TestSYCL_ViewLayoutStrideAssignment.cpp.o
[ 44%] Linking CXX executable KokkosCore_UnitTest_SYCL1A
[ 44%] Building CXX object core/unit_test/CMakeFiles/KokkosCore_UnitTest_Serial1.dir/serial/TestSerial_Task.cpp.o
[ 44%] Building CXX object core/unit_test/CMakeFiles/KokkosCore_UnitTest_SYCL1B.dir/sycl/TestSYCL_Scan.cpp.o
[ 44%] Building CXX object core/unit_test/CMakeFiles/KokkosCore_UnitTest_Serial2.dir/serial/TestSerial_TeamVectorRange.cpp.o
[ 44%] Building CXX object core/unit_test/CMakeFiles/KokkosCore_UnitTest_SYCL2A.dir/sycl/TestSYCL_ViewMapping_b.cpp.o
[ 44%] Building CXX object core/unit_test/CMakeFiles/KokkosCore_UnitTest_SYCL1B.dir/sycl/TestSYCL_SharedAlloc.cpp.o
[ 44%] Linking CXX executable KokkosCore_UnitTest_Serial1
[ 44%] Built target KokkosCore_UnitTest_Serial1
[ 45%] Building CXX object core/unit_test/CMakeFiles/KokkosCore_UnitTest_SYCL1B.dir/sycl/TestSYCL_ViewMapping_a.cpp.o
[ 45%] Building CXX object core/unit_test/CMakeFiles/KokkosCore_UnitTest_Serial2.dir/serial/TestSerial_UniqueToken.cpp.o
Scanning dependencies of target KokkosCore_UnitTest_DefaultInit_1
[ 45%] Building CXX object core/unit_test/CMakeFiles/KokkosCore_UnitTest_DefaultInit_1.dir/UnitTestMain.cpp.o
[ 45%] Building CXX object core/unit_test/CMakeFiles/KokkosCore_UnitTest_Serial2.dir/serial/TestSerial_ViewAPI_a.cpp.o
[ 45%] Building CXX object core/unit_test/CMakeFiles/KokkosCore_UnitTest_DefaultInit_1.dir/default/TestDefaultDeviceTypeInit_1.cpp.o
Scanning dependencies of target KokkosCore_UnitTest_DefaultInit_4
[ 46%] Building CXX object core/unit_test/CMakeFiles/KokkosCore_UnitTest_DefaultInit_4.dir/UnitTestMain.cpp.o
[ 46%] Building CXX object core/unit_test/CMakeFiles/KokkosCore_UnitTest_DefaultInit_4.dir/default/TestDefaultDeviceTypeInit_4.cpp.o
Scanning dependencies of target KokkosCore_UnitTest_DefaultInit_6
[ 46%] Building CXX object core/unit_test/CMakeFiles/KokkosCore_UnitTest_DefaultInit_6.dir/UnitTestMain.cpp.o
[ 46%] Linking CXX executable KokkosCore_UnitTest_DefaultInit_1
[ 47%] Building CXX object core/unit_test/CMakeFiles/KokkosCore_UnitTest_DefaultInit_6.dir/default/TestDefaultDeviceTypeInit_6.cpp.o
[ 47%] Built target KokkosCore_UnitTest_DefaultInit_1
Scanning dependencies of target KokkosCore_UnitTest_DefaultInit_9
[ 48%] Building CXX object core/unit_test/CMakeFiles/KokkosCore_UnitTest_DefaultInit_9.dir/UnitTestMain.cpp.o
[ 48%] Building CXX object core/unit_test/CMakeFiles/KokkosCore_UnitTest_DefaultInit_9.dir/default/TestDefaultDeviceTypeInit_9.cpp.o
[ 49%] Building CXX object core/unit_test/CMakeFiles/KokkosCore_UnitTest_Serial2.dir/serial/TestSerial_ViewAPI_b.cpp.o
[ 49%] Linking CXX executable KokkosCore_UnitTest_DefaultInit_4
[ 49%] Built target KokkosCore_UnitTest_DefaultInit_4
Scanning dependencies of target KokkosCore_UnitTest_SYCLInterOpInit_Context
[ 49%] Building CXX object core/unit_test/CMakeFiles/KokkosCore_UnitTest_SYCLInterOpInit_Context.dir/UnitTestMainInit.cpp.o
[ 49%] Building CXX object core/unit_test/CMakeFiles/KokkosCore_UnitTest_SYCL2A.dir/sycl/TestSYCL_ViewMapping_subview.cpp.o
[ 49%] Linking CXX executable KokkosCore_UnitTest_DefaultInit_6
[ 49%] Built target KokkosCore_UnitTest_DefaultInit_6
Scanning dependencies of target KokkosCore_UnitTest_DefaultInit_10
[ 49%] Building CXX object core/unit_test/CMakeFiles/KokkosCore_UnitTest_DefaultInit_10.dir/UnitTestMain.cpp.o
[ 49%] Linking CXX executable KokkosCore_UnitTest_DefaultInit_9
[ 49%] Building CXX object core/unit_test/CMakeFiles/KokkosCore_UnitTest_DefaultInit_10.dir/default/TestDefaultDeviceTypeInit_10.cpp.o
[ 49%] Built target KokkosCore_UnitTest_DefaultInit_9
Scanning dependencies of target KokkosCore_UnitTest_DefaultInit_11
[ 49%] Building CXX object core/unit_test/CMakeFiles/KokkosCore_UnitTest_DefaultInit_11.dir/UnitTestMain.cpp.o
[ 49%] Building CXX object core/unit_test/CMakeFiles/KokkosCore_UnitTest_SYCLInterOpInit_Context.dir/sycl/TestSYCL_InterOp_Init_Context.cpp.o
[ 49%] Linking CXX executable KokkosCore_UnitTest_SYCL1B
[ 49%] Building CXX object core/unit_test/CMakeFiles/KokkosCore_UnitTest_DefaultInit_11.dir/default/TestDefaultDeviceTypeInit_11.cpp.o
[ 49%] Building CXX object core/unit_test/CMakeFiles/KokkosCore_UnitTest_Serial2.dir/serial/TestSerial_ViewAPI_c.cpp.o
[ 50%] Building CXX object core/unit_test/CMakeFiles/KokkosCore_UnitTest_SYCL2A.dir/sycl/TestSYCL_ViewMemoryAccessViolation.cpp.o
[ 51%] Linking CXX executable KokkosCore_UnitTest_DefaultInit_10
[ 51%] Built target KokkosCore_UnitTest_DefaultInit_10
[ 51%] Building CXX object core/unit_test/CMakeFiles/KokkosCore_UnitTest_SYCL2A.dir/sycl/TestSYCL_ViewOfClass.cpp.o
[ 51%] Linking CXX executable KokkosCore_UnitTest_DefaultInit_11
[ 51%] Built target KokkosCore_UnitTest_DefaultInit_11
Scanning dependencies of target KokkosCore_UnitTest_DefaultInit_12
[ 51%] Building CXX object core/unit_test/CMakeFiles/KokkosCore_UnitTest_DefaultInit_12.dir/UnitTestMain.cpp.o
[ 51%] Linking CXX executable KokkosCore_UnitTest_SYCLInterOpInit_Context
[ 51%] Built target KokkosCore_UnitTest_SYCLInterOpInit_Context
Scanning dependencies of target KokkosCore_UnitTest_DefaultInit_13
[ 51%] Building CXX object core/unit_test/CMakeFiles/KokkosCore_UnitTest_DefaultInit_13.dir/UnitTestMain.cpp.o
[ 51%] Building CXX object core/unit_test/CMakeFiles/KokkosCore_UnitTest_DefaultInit_12.dir/default/TestDefaultDeviceTypeInit_12.cpp.o
[ 52%] Building CXX object core/unit_test/CMakeFiles/KokkosCore_UnitTest_DefaultInit_13.dir/default/TestDefaultDeviceTypeInit_13.cpp.o
[ 52%] Building CXX object core/unit_test/CMakeFiles/KokkosCore_UnitTest_Serial2.dir/serial/TestSerial_ViewAPI_d.cpp.o
Scanning dependencies of target KokkosCore_UnitTest_CTestDevice
[ 52%] Building CXX object core/unit_test/CMakeFiles/KokkosCore_UnitTest_CTestDevice.dir/UnitTestMain.cpp.o
[ 52%] Building CXX object core/unit_test/CMakeFiles/KokkosCore_UnitTest_SYCL2A.dir/sycl/TestSYCL_ViewResize.cpp.o
[ 52%] Building CXX object core/unit_test/CMakeFiles/KokkosCore_UnitTest_CTestDevice.dir/TestCTestDevice.cpp.o
[ 52%] Linking CXX executable KokkosCore_UnitTest_DefaultInit_12
[ 52%] Built target KokkosCore_UnitTest_DefaultInit_12
Scanning dependencies of target KokkosCore_UnitTest_Develop
[ 52%] Building CXX object core/unit_test/CMakeFiles/KokkosCore_UnitTest_Develop.dir/UnitTestMainInit.cpp.o
[ 53%] Linking CXX executable KokkosCore_UnitTest_CTestDevice
[ 53%] Linking CXX executable KokkosCore_UnitTest_DefaultInit_13
[ 53%] Built target KokkosCore_UnitTest_CTestDevice
Scanning dependencies of target KokkosCore_UnitTest_DefaultInit_16
[ 53%] Building CXX object core/unit_test/CMakeFiles/KokkosCore_UnitTest_DefaultInit_16.dir/UnitTestMain.cpp.o
[ 53%] Built target KokkosCore_UnitTest_DefaultInit_13
[ 53%] Building CXX object core/unit_test/CMakeFiles/KokkosCore_UnitTest_Develop.dir/default/TestDefaultDeviceDevelop.cpp.o
[ 53%] Building CXX object core/unit_test/CMakeFiles/KokkosCore_UnitTest_DefaultInit_16.dir/default/TestDefaultDeviceTypeInit_16.cpp.o
[ 53%] Building CXX object core/unit_test/CMakeFiles/KokkosCore_UnitTest_Serial2.dir/serial/TestSerial_ViewAPI_e.cpp.o
Scanning dependencies of target Kokkos_HeaderSelfContained_Kokkos_Random_hpp
[ 53%] Building CXX object core/unit_test/headers_self_contained/CMakeFiles/Kokkos_HeaderSelfContained_Kokkos_Random_hpp.dir/tstHeader.cpp.o
[ 53%] Linking CXX executable KokkosCore_UnitTest_Develop
[ 53%] Built target KokkosCore_UnitTest_Develop
Scanning dependencies of target Kokkos_HeaderSelfContained_Kokkos_ScatterView_hpp
[ 54%] Building CXX object core/unit_test/headers_self_contained/CMakeFiles/Kokkos_HeaderSelfContained_Kokkos_ScatterView_hpp.dir/tstHeader.cpp.o
[ 54%] Linking CXX executable KokkosCore_UnitTest_DefaultInit_16
[ 54%] Built target KokkosCore_UnitTest_DefaultInit_16
Scanning dependencies of target Kokkos_HeaderSelfContained_Kokkos_DynamicView_hpp
[ 54%] Building CXX object core/unit_test/headers_self_contained/CMakeFiles/Kokkos_HeaderSelfContained_Kokkos_DynamicView_hpp.dir/tstHeader.cpp.o
[ 55%] Linking CXX executable Kokkos_HeaderSelfContained_Kokkos_Random_hpp
[ 55%] Built target Kokkos_HeaderSelfContained_Kokkos_Random_hpp
[ 55%] Building CXX object core/unit_test/CMakeFiles/KokkosCore_UnitTest_SYCL2A.dir/sycl/TestSYCL_View_64bit.cpp.o
[ 55%] Built target KokkosCore_UnitTest_SYCL1B
Scanning dependencies of target Kokkos_HeaderSelfContained_Kokkos_DynRankView_hpp
[ 55%] Building CXX object core/unit_test/headers_self_contained/CMakeFiles/Kokkos_HeaderSelfContained_Kokkos_DynRankView_hpp.dir/tstHeader.cpp.o
[ 55%] Linking CXX executable Kokkos_HeaderSelfContained_Kokkos_ScatterView_hpp
[ 55%] Built target Kokkos_HeaderSelfContained_Kokkos_ScatterView_hpp
Scanning dependencies of target Kokkos_HeaderSelfContained_Kokkos_Bitset_hpp
[ 55%] Building CXX object core/unit_test/headers_self_contained/CMakeFiles/Kokkos_HeaderSelfContained_Kokkos_Bitset_hpp.dir/tstHeader.cpp.o
[ 55%] Built target KokkosCore_UnitTest_SYCL1A
Scanning dependencies of target Kokkos_HeaderSelfContained_Kokkos_ErrorReporter_hpp
[ 55%] Building CXX object core/unit_test/headers_self_contained/CMakeFiles/Kokkos_HeaderSelfContained_Kokkos_ErrorReporter_hpp.dir/tstHeader.cpp.o
[ 55%] Linking CXX executable Kokkos_HeaderSelfContained_Kokkos_DynamicView_hpp
[ 55%] Building CXX object core/unit_test/CMakeFiles/KokkosCore_UnitTest_Serial2.dir/serial/TestSerial_ViewCopy_a.cpp.o
[ 55%] Built target Kokkos_HeaderSelfContained_Kokkos_DynamicView_hpp
[ 55%] Building CXX object core/unit_test/CMakeFiles/KokkosCore_UnitTest_Serial2.dir/serial/TestSerial_ViewCopy_b.cpp.o
[ 55%] Linking CXX executable Kokkos_HeaderSelfContained_Kokkos_DynRankView_hpp
[ 55%] Built target Kokkos_HeaderSelfContained_Kokkos_DynRankView_hpp
[ 55%] Building CXX object core/unit_test/CMakeFiles/KokkosCore_UnitTest_Serial2.dir/serial/TestSerial_ViewHooks.cpp.o
[ 55%] Building CXX object core/unit_test/CMakeFiles/KokkosCore_UnitTest_SYCL2A.dir/sycl/TestSYCL_WithoutInitializing.cpp.o
[ 55%] Linking CXX executable Kokkos_HeaderSelfContained_Kokkos_Bitset_hpp
[ 55%] Built target Kokkos_HeaderSelfContained_Kokkos_Bitset_hpp
Scanning dependencies of target Kokkos_HeaderSelfContained_Kokkos_WorkGraphPolicy_hpp
[ 55%] Building CXX object core/unit_test/headers_self_contained/CMakeFiles/Kokkos_HeaderSelfContained_Kokkos_WorkGraphPolicy_hpp.dir/tstHeader.cpp.o
[ 56%] Linking CXX executable Kokkos_HeaderSelfContained_Kokkos_ErrorReporter_hpp
[ 56%] Built target Kokkos_HeaderSelfContained_Kokkos_ErrorReporter_hpp
[ 57%] Building CXX object core/unit_test/CMakeFiles/KokkosCore_UnitTest_Serial2.dir/serial/TestSerial_ViewLayoutStrideAssignment.cpp.o
Scanning dependencies of target Kokkos_HeaderSelfContained_Kokkos_UniqueToken_hpp
[ 57%] Building CXX object core/unit_test/headers_self_contained/CMakeFiles/Kokkos_HeaderSelfContained_Kokkos_UniqueToken_hpp.dir/tstHeader.cpp.o
Scanning dependencies of target Kokkos_HeaderSelfContained_Kokkos_Timer_hpp
[ 57%] Building CXX object core/unit_test/headers_self_contained/CMakeFiles/Kokkos_HeaderSelfContained_Kokkos_Timer_hpp.dir/tstHeader.cpp.o
[ 57%] Linking CXX executable Kokkos_HeaderSelfContained_Kokkos_WorkGraphPolicy_hpp
[ 57%] Built target Kokkos_HeaderSelfContained_Kokkos_WorkGraphPolicy_hpp
[ 57%] Building CXX object core/unit_test/CMakeFiles/KokkosCore_UnitTest_Serial2.dir/serial/TestSerial_ViewMapping_b.cpp.o
[ 57%] Building CXX object core/unit_test/CMakeFiles/KokkosCore_UnitTest_Serial2.dir/serial/TestSerial_ViewMapping_subview.cpp.o
[ 57%] Building CXX object core/unit_test/CMakeFiles/KokkosCore_UnitTest_Serial2.dir/serial/TestSerial_ViewMemoryAccessViolation.cpp.o
[ 57%] Built target KokkosCore_UnitTest_Default
Scanning dependencies of target Kokkos_HeaderSelfContained_Kokkos_TaskScheduler_hpp
[ 58%] Building CXX object core/unit_test/headers_self_contained/CMakeFiles/Kokkos_HeaderSelfContained_Kokkos_TaskScheduler_hpp.dir/tstHeader.cpp.o
[ 58%] Linking CXX executable Kokkos_HeaderSelfContained_Kokkos_UniqueToken_hpp
[ 58%] Built target Kokkos_HeaderSelfContained_Kokkos_UniqueToken_hpp
Scanning dependencies of target Kokkos_HeaderSelfContained_Kokkos_Serial_hpp
[ 58%] Building CXX object core/unit_test/headers_self_contained/CMakeFiles/Kokkos_HeaderSelfContained_Kokkos_Serial_hpp.dir/tstHeader.cpp.o
[ 58%] Linking CXX executable Kokkos_HeaderSelfContained_Kokkos_Timer_hpp
[ 58%] Built target Kokkos_HeaderSelfContained_Kokkos_Timer_hpp
Scanning dependencies of target Kokkos_HeaderSelfContained_Kokkos_ScratchSpace_hpp
[ 58%] Building CXX object core/unit_test/headers_self_contained/CMakeFiles/Kokkos_HeaderSelfContained_Kokkos_ScratchSpace_hpp.dir/tstHeader.cpp.o
[ 58%] Linking CXX executable Kokkos_HeaderSelfContained_Kokkos_TaskScheduler_hpp
[ 58%] Built target Kokkos_HeaderSelfContained_Kokkos_TaskScheduler_hpp
[ 58%] Building CXX object core/unit_test/CMakeFiles/KokkosCore_UnitTest_Serial2.dir/serial/TestSerial_ViewOfClass.cpp.o
[ 58%] Linking CXX executable KokkosCore_UnitTest_SYCL2A
Scanning dependencies of target Kokkos_HeaderSelfContained_Kokkos_SYCL_Space_hpp
[ 58%] Building CXX object core/unit_test/headers_self_contained/CMakeFiles/Kokkos_HeaderSelfContained_Kokkos_SYCL_Space_hpp.dir/tstHeader.cpp.o
[ 58%] Building CXX object core/unit_test/CMakeFiles/KokkosCore_UnitTest_Serial2.dir/serial/TestSerial_ViewResize.cpp.o
[ 58%] Building CXX object core/unit_test/CMakeFiles/KokkosCore_UnitTest_Serial2.dir/serial/TestSerial_View_64bit.cpp.o
[ 58%] Linking CXX executable Kokkos_HeaderSelfContained_Kokkos_Serial_hpp
[ 58%] Built target Kokkos_HeaderSelfContained_Kokkos_Serial_hpp
Scanning dependencies of target Kokkos_HeaderSelfContained_Kokkos_Rank_hpp
[ 58%] Building CXX object core/unit_test/headers_self_contained/CMakeFiles/Kokkos_HeaderSelfContained_Kokkos_Rank_hpp.dir/tstHeader.cpp.o
[ 58%] Linking CXX executable Kokkos_HeaderSelfContained_Kokkos_ScratchSpace_hpp
[ 58%] Built target Kokkos_HeaderSelfContained_Kokkos_ScratchSpace_hpp
Scanning dependencies of target Kokkos_HeaderSelfContained_Kokkos_PointerOwnership_hpp
[ 58%] Building CXX object core/unit_test/headers_self_contained/CMakeFiles/Kokkos_HeaderSelfContained_Kokkos_PointerOwnership_hpp.dir/tstHeader.cpp.o
[ 58%] Linking CXX executable Kokkos_HeaderSelfContained_Kokkos_SYCL_Space_hpp
[ 58%] Built target Kokkos_HeaderSelfContained_Kokkos_SYCL_Space_hpp
Scanning dependencies of target Kokkos_HeaderSelfContained_Kokkos_UnorderedMap_hpp
[ 58%] Building CXX object core/unit_test/headers_self_contained/CMakeFiles/Kokkos_HeaderSelfContained_Kokkos_UnorderedMap_hpp.dir/tstHeader.cpp.o
[ 58%] Linking CXX executable Kokkos_HeaderSelfContained_Kokkos_Rank_hpp
[ 58%] Built target Kokkos_HeaderSelfContained_Kokkos_Rank_hpp
[ 58%] Building CXX object core/unit_test/CMakeFiles/KokkosCore_UnitTest_Serial2.dir/serial/TestSerial_WorkGraph.cpp.o
[ 58%] Linking CXX executable Kokkos_HeaderSelfContained_Kokkos_PointerOwnership_hpp
[ 58%] Built target Kokkos_HeaderSelfContained_Kokkos_PointerOwnership_hpp
Scanning dependencies of target Kokkos_HeaderSelfContained_Kokkos_DetectionIdiom_hpp
[ 58%] Building CXX object core/unit_test/headers_self_contained/CMakeFiles/Kokkos_HeaderSelfContained_Kokkos_DetectionIdiom_hpp.dir/tstHeader.cpp.o
Scanning dependencies of target Kokkos_HeaderSelfContained_Kokkos_Vectorization_hpp
[ 58%] Building CXX object core/unit_test/headers_self_contained/CMakeFiles/Kokkos_HeaderSelfContained_Kokkos_Vectorization_hpp.dir/tstHeader.cpp.o
[ 59%] Building CXX object core/unit_test/CMakeFiles/KokkosCore_UnitTest_Serial2.dir/serial/TestSerial_WithoutInitializing.cpp.o
[ 59%] Building CXX object core/unit_test/CMakeFiles/KokkosCore_UnitTest_Serial2.dir/serial/TestSerial_SubView_a.cpp.o
[ 60%] Linking CXX executable Kokkos_HeaderSelfContained_Kokkos_DetectionIdiom_hpp
[ 60%] Built target Kokkos_HeaderSelfContained_Kokkos_DetectionIdiom_hpp
Scanning dependencies of target Kokkos_HeaderSelfContained_Kokkos_Future_hpp
[ 61%] Building CXX object core/unit_test/headers_self_contained/CMakeFiles/Kokkos_HeaderSelfContained_Kokkos_Future_hpp.dir/tstHeader.cpp.o
[ 62%] Linking CXX executable Kokkos_HeaderSelfContained_Kokkos_Vectorization_hpp
[ 62%] Built target Kokkos_HeaderSelfContained_Kokkos_Vectorization_hpp
Scanning dependencies of target Kokkos_HeaderSelfContained_Kokkos_Crs_hpp
[ 63%] Building CXX object core/unit_test/headers_self_contained/CMakeFiles/Kokkos_HeaderSelfContained_Kokkos_Crs_hpp.dir/tstHeader.cpp.o
[ 63%] Linking CXX executable Kokkos_HeaderSelfContained_Kokkos_UnorderedMap_hpp
[ 63%] Built target Kokkos_HeaderSelfContained_Kokkos_UnorderedMap_hpp
[ 63%] Building CXX object core/unit_test/CMakeFiles/KokkosCore_UnitTest_Serial2.dir/serial/TestSerial_SubView_b.cpp.o
[ 63%] Building CXX object core/unit_test/CMakeFiles/KokkosCore_UnitTest_Serial2.dir/serial/TestSerial_SubView_c01.cpp.o
[ 63%] Linking CXX executable Kokkos_HeaderSelfContained_Kokkos_Future_hpp
[ 63%] Built target Kokkos_HeaderSelfContained_Kokkos_Future_hpp
Scanning dependencies of target Kokkos_HeaderSelfContained_Kokkos_MathematicalSpecialFunctions_hpp
[ 63%] Building CXX object core/unit_test/headers_self_contained/CMakeFiles/Kokkos_HeaderSelfContained_Kokkos_MathematicalSpecialFunctions_hpp.dir/tstHeader.cpp.o
[ 63%] Linking CXX executable Kokkos_HeaderSelfContained_Kokkos_Crs_hpp
[ 63%] Built target Kokkos_HeaderSelfContained_Kokkos_Crs_hpp
Scanning dependencies of target Kokkos_HeaderSelfContained_Kokkos_Core_fwd_hpp
[ 63%] Building CXX object core/unit_test/headers_self_contained/CMakeFiles/Kokkos_HeaderSelfContained_Kokkos_Core_fwd_hpp.dir/tstHeader.cpp.o
[ 63%] Building CXX object core/unit_test/CMakeFiles/KokkosCore_UnitTest_Serial2.dir/serial/TestSerial_SubView_c02.cpp.o
Scanning dependencies of target Kokkos_HeaderSelfContained_Kokkos_TaskPolicy_hpp
[ 63%] Building CXX object core/unit_test/headers_self_contained/CMakeFiles/Kokkos_HeaderSelfContained_Kokkos_TaskPolicy_hpp.dir/tstHeader.cpp.o
[ 63%] Linking CXX executable Kokkos_HeaderSelfContained_Kokkos_MathematicalSpecialFunctions_hpp
[ 63%] Built target Kokkos_HeaderSelfContained_Kokkos_MathematicalSpecialFunctions_hpp
Scanning dependencies of target Kokkos_HeaderSelfContained_Kokkos_Core_hpp
[ 63%] Building CXX object core/unit_test/headers_self_contained/CMakeFiles/Kokkos_HeaderSelfContained_Kokkos_Core_hpp.dir/tstHeader.cpp.o
[ 63%] Linking CXX executable Kokkos_HeaderSelfContained_Kokkos_Core_fwd_hpp
[ 63%] Built target Kokkos_HeaderSelfContained_Kokkos_Core_fwd_hpp
[ 63%] Building CXX object core/unit_test/CMakeFiles/KokkosCore_UnitTest_Serial2.dir/serial/TestSerial_SubView_c03.cpp.o
[ 63%] Building CXX object core/unit_test/CMakeFiles/KokkosCore_UnitTest_Serial2.dir/serial/TestSerial_SubView_c04.cpp.o
Scanning dependencies of target Kokkos_HeaderSelfContained_Kokkos_Concepts_hpp
[ 64%] Building CXX object core/unit_test/headers_self_contained/CMakeFiles/Kokkos_HeaderSelfContained_Kokkos_Concepts_hpp.dir/tstHeader.cpp.o
In file included from /var/jenkins/workspace/Kokkos/core/unit_test/headers_self_contained/tstHeader.cpp:8:
/var/jenkins/workspace/Kokkos/core/src/Kokkos_TaskPolicy.hpp:48:1: warning: "This file is deprecated. Use <Kokkos_TaskScheduler.hpp> instead." [-W#pragma-messages]
KOKKOS_IMPL_WARNING(
^
/var/jenkins/workspace/Kokkos/core/src/Kokkos_Macros.hpp:626:35: note: expanded from macro 'KOKKOS_IMPL_WARNING'
#define KOKKOS_IMPL_WARNING(desc) KOKKOS_IMPL_DO_PRAGMA(message(#desc))
                                  ^
/var/jenkins/workspace/Kokkos/core/src/Kokkos_Macros.hpp:625:34: note: expanded from macro 'KOKKOS_IMPL_DO_PRAGMA'
#define KOKKOS_IMPL_DO_PRAGMA(x) _Pragma(#x)
                                 ^
<scratch space>:294:2: note: expanded from here
 message("\"This file is deprecated. Use <Kokkos_TaskScheduler.hpp> instead.\"")
 ^
In file included from /var/jenkins/workspace/Kokkos/core/unit_test/headers_self_contained/tstHeader.cpp:9:
/var/jenkins/workspace/Kokkos/core/src/Kokkos_TaskPolicy.hpp:48:1: warning: "This file is deprecated. Use <Kokkos_TaskScheduler.hpp> instead." [-W#pragma-messages]
KOKKOS_IMPL_WARNING(
^
/var/jenkins/workspace/Kokkos/core/src/Kokkos_Macros.hpp:626:35: note: expanded from macro 'KOKKOS_IMPL_WARNING'
#define KOKKOS_IMPL_WARNING(desc) KOKKOS_IMPL_DO_PRAGMA(message(#desc))
                                  ^
/var/jenkins/workspace/Kokkos/core/src/Kokkos_Macros.hpp:625:34: note: expanded from macro 'KOKKOS_IMPL_DO_PRAGMA'
#define KOKKOS_IMPL_DO_PRAGMA(x) _Pragma(#x)
                                 ^
<scratch space>:299:2: note: expanded from here
 message("\"This file is deprecated. Use <Kokkos_TaskScheduler.hpp> instead.\"")
 ^
2 warnings generated.
In file included from /var/jenkins/workspace/Kokkos/core/unit_test/headers_self_contained/tstHeader.cpp:8:
/var/jenkins/workspace/Kokkos/core/src/Kokkos_TaskPolicy.hpp:48:1: warning: "This file is deprecated. Use <Kokkos_TaskScheduler.hpp> instead." [-W#pragma-messages]
KOKKOS_IMPL_WARNING(
^
/var/jenkins/workspace/Kokkos/core/src/Kokkos_Macros.hpp:626:35: note: expanded from macro 'KOKKOS_IMPL_WARNING'
#define KOKKOS_IMPL_WARNING(desc) KOKKOS_IMPL_DO_PRAGMA(message(#desc))
                                  ^
/var/jenkins/workspace/Kokkos/core/src/Kokkos_Macros.hpp:625:34: note: expanded from macro 'KOKKOS_IMPL_DO_PRAGMA'
#define KOKKOS_IMPL_DO_PRAGMA(x) _Pragma(#x)
                                 ^
<scratch space>:586:2: note: expanded from here
 message("\"This file is deprecated. Use <Kokkos_TaskScheduler.hpp> instead.\"")
 ^
In file included from /var/jenkins/workspace/Kokkos/core/unit_test/headers_self_contained/tstHeader.cpp:9:
/var/jenkins/workspace/Kokkos/core/src/Kokkos_TaskPolicy.hpp:48:1: warning: "This file is deprecated. Use <Kokkos_TaskScheduler.hpp> instead." [-W#pragma-messages]
KOKKOS_IMPL_WARNING(
^
/var/jenkins/workspace/Kokkos/core/src/Kokkos_Macros.hpp:626:35: note: expanded from macro 'KOKKOS_IMPL_WARNING'
#define KOKKOS_IMPL_WARNING(desc) KOKKOS_IMPL_DO_PRAGMA(message(#desc))
                                  ^
/var/jenkins/workspace/Kokkos/core/src/Kokkos_Macros.hpp:625:34: note: expanded from macro 'KOKKOS_IMPL_DO_PRAGMA'
#define KOKKOS_IMPL_DO_PRAGMA(x) _Pragma(#x)
                                 ^
<scratch space>:591:2: note: expanded from here
 message("\"This file is deprecated. Use <Kokkos_TaskScheduler.hpp> instead.\"")
 ^
2 warnings generated.
[ 64%] Linking CXX executable Kokkos_HeaderSelfContained_Kokkos_TaskPolicy_hpp
[ 64%] Building CXX object core/unit_test/CMakeFiles/KokkosCore_UnitTest_Serial2.dir/serial/TestSerial_SubView_c05.cpp.o
[ 64%] Built target Kokkos_HeaderSelfContained_Kokkos_TaskPolicy_hpp
Scanning dependencies of target Kokkos_HeaderSelfContained_Kokkos_ExecPolicy_hpp
[ 64%] Building CXX object core/unit_test/headers_self_contained/CMakeFiles/Kokkos_HeaderSelfContained_Kokkos_ExecPolicy_hpp.dir/tstHeader.cpp.o
[ 64%] Built target KokkosCore_UnitTest_SYCL2A
Scanning dependencies of target Kokkos_HeaderSelfContained_Kokkos_HPX_hpp
[ 64%] Building CXX object core/unit_test/headers_self_contained/CMakeFiles/Kokkos_HeaderSelfContained_Kokkos_HPX_hpp.dir/tstHeader.cpp.o
[ 64%] Linking CXX executable Kokkos_HeaderSelfContained_Kokkos_Core_hpp
[ 64%] Built target Kokkos_HeaderSelfContained_Kokkos_Core_hpp
[ 65%] Building CXX object core/unit_test/CMakeFiles/KokkosCore_UnitTest_Serial2.dir/serial/TestSerial_SubView_c06.cpp.o
[ 65%] Linking CXX executable Kokkos_HeaderSelfContained_Kokkos_Concepts_hpp
[ 65%] Built target Kokkos_HeaderSelfContained_Kokkos_Concepts_hpp
Scanning dependencies of target Kokkos_HeaderSelfContained_Kokkos_Functional_hpp
[ 65%] Building CXX object core/unit_test/headers_self_contained/CMakeFiles/Kokkos_HeaderSelfContained_Kokkos_Functional_hpp.dir/tstHeader.cpp.o
[ 65%] Linking CXX executable Kokkos_HeaderSelfContained_Kokkos_ExecPolicy_hpp
[ 65%] Built target Kokkos_HeaderSelfContained_Kokkos_ExecPolicy_hpp
Scanning dependencies of target Kokkos_HeaderSelfContained_Kokkos_NumericTraits_hpp
[ 65%] Building CXX object core/unit_test/headers_self_contained/CMakeFiles/Kokkos_HeaderSelfContained_Kokkos_NumericTraits_hpp.dir/tstHeader.cpp.o
[ 65%] Building CXX object core/unit_test/CMakeFiles/KokkosCore_UnitTest_Serial2.dir/serial/TestSerial_SubView_c07.cpp.o
[ 65%] Linking CXX executable Kokkos_HeaderSelfContained_Kokkos_HPX_hpp
[ 65%] Built target Kokkos_HeaderSelfContained_Kokkos_HPX_hpp
Scanning dependencies of target Kokkos_HeaderSelfContained_Kokkos_CudaSpace_hpp
[ 65%] Building CXX object core/unit_test/headers_self_contained/CMakeFiles/Kokkos_HeaderSelfContained_Kokkos_CudaSpace_hpp.dir/tstHeader.cpp.o
[ 65%] Building CXX object core/unit_test/CMakeFiles/KokkosCore_UnitTest_Serial2.dir/serial/TestSerial_SubView_c08.cpp.o
[ 65%] Linking CXX executable Kokkos_HeaderSelfContained_Kokkos_Functional_hpp
[ 65%] Built target Kokkos_HeaderSelfContained_Kokkos_Functional_hpp
[ 65%] Building CXX object core/unit_test/CMakeFiles/KokkosCore_UnitTest_Serial2.dir/serial/TestSerial_SubView_c09.cpp.o
[ 65%] Linking CXX executable Kokkos_HeaderSelfContained_Kokkos_NumericTraits_hpp
[ 65%] Built target Kokkos_HeaderSelfContained_Kokkos_NumericTraits_hpp
Scanning dependencies of target Kokkos_HeaderSelfContained_Kokkos_Tuners_hpp
[ 65%] Building CXX object core/unit_test/headers_self_contained/CMakeFiles/Kokkos_HeaderSelfContained_Kokkos_Tuners_hpp.dir/tstHeader.cpp.o
[ 65%] Linking CXX executable Kokkos_HeaderSelfContained_Kokkos_CudaSpace_hpp
[ 65%] Built target Kokkos_HeaderSelfContained_Kokkos_CudaSpace_hpp
Scanning dependencies of target Kokkos_HeaderSelfContained_Kokkos_HostSpace_hpp
[ 65%] Building CXX object core/unit_test/headers_self_contained/CMakeFiles/Kokkos_HeaderSelfContained_Kokkos_HostSpace_hpp.dir/tstHeader.cpp.o
[ 66%] Linking CXX executable Kokkos_HeaderSelfContained_Kokkos_Tuners_hpp
[ 66%] Built target Kokkos_HeaderSelfContained_Kokkos_Tuners_hpp
Scanning dependencies of target Kokkos_HeaderSelfContained_Kokkos_TaskScheduler_fwd_hpp
[ 66%] Building CXX object core/unit_test/headers_self_contained/CMakeFiles/Kokkos_HeaderSelfContained_Kokkos_TaskScheduler_fwd_hpp.dir/tstHeader.cpp.o
[ 66%] Linking CXX executable Kokkos_HeaderSelfContained_Kokkos_HostSpace_hpp
[ 66%] Built target Kokkos_HeaderSelfContained_Kokkos_HostSpace_hpp
[ 66%] Building CXX object core/unit_test/CMakeFiles/KokkosCore_UnitTest_Serial2.dir/serial/TestSerial_SubView_c10.cpp.o
[ 66%] Building CXX object core/unit_test/CMakeFiles/KokkosCore_UnitTest_Serial2.dir/serial/TestSerial_SubView_c11.cpp.o
[ 66%] Linking CXX executable Kokkos_HeaderSelfContained_Kokkos_TaskScheduler_fwd_hpp
[ 66%] Built target Kokkos_HeaderSelfContained_Kokkos_TaskScheduler_fwd_hpp
Scanning dependencies of target Kokkos_HeaderSelfContained_Kokkos_SYCL_hpp
[ 66%] Building CXX object core/unit_test/headers_self_contained/CMakeFiles/Kokkos_HeaderSelfContained_Kokkos_SYCL_hpp.dir/tstHeader.cpp.o
[ 66%] Building CXX object core/unit_test/CMakeFiles/KokkosCore_UnitTest_Serial2.dir/serial/TestSerial_SubView_c12.cpp.o
Scanning dependencies of target Kokkos_HeaderSelfContained_KokkosExp_MDRangePolicy_hpp
[ 66%] Building CXX object core/unit_test/headers_self_contained/CMakeFiles/Kokkos_HeaderSelfContained_KokkosExp_MDRangePolicy_hpp.dir/tstHeader.cpp.o
[ 66%] Linking CXX executable Kokkos_HeaderSelfContained_Kokkos_SYCL_hpp
[ 66%] Built target Kokkos_HeaderSelfContained_Kokkos_SYCL_hpp
Scanning dependencies of target Kokkos_HeaderSelfContained_Kokkos_View_hpp
[ 66%] Building CXX object core/unit_test/headers_self_contained/CMakeFiles/Kokkos_HeaderSelfContained_Kokkos_View_hpp.dir/tstHeader.cpp.o
[ 67%] Building CXX object core/unit_test/CMakeFiles/KokkosCore_UnitTest_Serial2.dir/serial/TestSerial_SubView_c13.cpp.o
Scanning dependencies of target Kokkos_HeaderSelfContained_Kokkos_AcquireUniqueTokenImpl_hpp
[ 67%] Building CXX object core/unit_test/headers_self_contained/CMakeFiles/Kokkos_HeaderSelfContained_Kokkos_AcquireUniqueTokenImpl_hpp.dir/tstHeader.cpp.o
[ 67%] Linking CXX executable Kokkos_HeaderSelfContained_KokkosExp_MDRangePolicy_hpp
[ 67%] Built target Kokkos_HeaderSelfContained_KokkosExp_MDRangePolicy_hpp
[ 67%] Building CXX object core/unit_test/CMakeFiles/KokkosCore_UnitTest_Serial2.dir/serial/TestSerial_SubView_c14.cpp.o
Scanning dependencies of target Kokkos_HeaderSelfContained_Kokkos_Extents_hpp
[ 67%] Building CXX object core/unit_test/headers_self_contained/CMakeFiles/Kokkos_HeaderSelfContained_Kokkos_Extents_hpp.dir/tstHeader.cpp.o
[ 67%] Linking CXX executable Kokkos_HeaderSelfContained_Kokkos_View_hpp
[ 67%] Built target Kokkos_HeaderSelfContained_Kokkos_View_hpp
Scanning dependencies of target Kokkos_HeaderSelfContained_Kokkos_CopyViews_hpp
[ 67%] Building CXX object core/unit_test/headers_self_contained/CMakeFiles/Kokkos_HeaderSelfContained_Kokkos_CopyViews_hpp.dir/tstHeader.cpp.o
[ 67%] Linking CXX executable Kokkos_HeaderSelfContained_Kokkos_Extents_hpp
[ 67%] Built target Kokkos_HeaderSelfContained_Kokkos_Extents_hpp
Scanning dependencies of target Kokkos_HeaderSelfContained_Kokkos_DualView_hpp
[ 67%] Building CXX object core/unit_test/headers_self_contained/CMakeFiles/Kokkos_HeaderSelfContained_Kokkos_DualView_hpp.dir/tstHeader.cpp.o
[ 67%] Linking CXX executable Kokkos_HeaderSelfContained_Kokkos_AcquireUniqueTokenImpl_hpp
[ 67%] Built target Kokkos_HeaderSelfContained_Kokkos_AcquireUniqueTokenImpl_hpp
Scanning dependencies of target Kokkos_HeaderSelfContained_Kokkos_Profiling_ProfileSection_hpp
[ 67%] Building CXX object core/unit_test/headers_self_contained/CMakeFiles/Kokkos_HeaderSelfContained_Kokkos_Profiling_ProfileSection_hpp.dir/tstHeader.cpp.o
Scanning dependencies of target Kokkos_HeaderSelfContained_Kokkos_Atomic_hpp
[ 67%] Building CXX object core/unit_test/headers_self_contained/CMakeFiles/Kokkos_HeaderSelfContained_Kokkos_Atomic_hpp.dir/tstHeader.cpp.o
[ 67%] Linking CXX executable Kokkos_HeaderSelfContained_Kokkos_CopyViews_hpp
[ 67%] Built target Kokkos_HeaderSelfContained_Kokkos_CopyViews_hpp
Scanning dependencies of target Kokkos_HeaderSelfContained_Kokkos_Array_hpp
[ 67%] Building CXX object core/unit_test/headers_self_contained/CMakeFiles/Kokkos_HeaderSelfContained_Kokkos_Array_hpp.dir/tstHeader.cpp.o
Scanning dependencies of target Kokkos_HeaderSelfContained_Kokkos_Complex_hpp
[ 67%] Building CXX object core/unit_test/headers_self_contained/CMakeFiles/Kokkos_HeaderSelfContained_Kokkos_Complex_hpp.dir/tstHeader.cpp.o
Scanning dependencies of target Kokkos_HeaderSelfContained_Kokkos_Threads_hpp
[ 67%] Building CXX object core/unit_test/headers_self_contained/CMakeFiles/Kokkos_HeaderSelfContained_Kokkos_Threads_hpp.dir/tstHeader.cpp.o
[ 67%] Linking CXX executable Kokkos_HeaderSelfContained_Kokkos_Profiling_ProfileSection_hpp
[ 67%] Built target Kokkos_HeaderSelfContained_Kokkos_Profiling_ProfileSection_hpp
Scanning dependencies of target Kokkos_HeaderSelfContained_KokkosExp_InterOp_hpp
[ 67%] Building CXX object core/unit_test/headers_self_contained/CMakeFiles/Kokkos_HeaderSelfContained_KokkosExp_InterOp_hpp.dir/tstHeader.cpp.o
[ 67%] Linking CXX executable Kokkos_HeaderSelfContained_Kokkos_Atomic_hpp
[ 67%] Built target Kokkos_HeaderSelfContained_Kokkos_Atomic_hpp
Scanning dependencies of target Kokkos_HeaderSelfContained_Kokkos_OpenMPTarget_hpp
[ 68%] Building CXX object core/unit_test/headers_self_contained/CMakeFiles/Kokkos_HeaderSelfContained_Kokkos_OpenMPTarget_hpp.dir/tstHeader.cpp.o
[ 68%] Linking CXX executable Kokkos_HeaderSelfContained_Kokkos_Array_hpp
[ 68%] Built target Kokkos_HeaderSelfContained_Kokkos_Array_hpp
Scanning dependencies of target Kokkos_HeaderSelfContained_Kokkos_GraphNode_hpp
[ 68%] Building CXX object core/unit_test/headers_self_contained/CMakeFiles/Kokkos_HeaderSelfContained_Kokkos_GraphNode_hpp.dir/tstHeader.cpp.o
Scanning dependencies of target Kokkos_HeaderSelfContained_Kokkos_OffsetView_hpp
[ 68%] Building CXX object core/unit_test/headers_self_contained/CMakeFiles/Kokkos_HeaderSelfContained_Kokkos_OffsetView_hpp.dir/tstHeader.cpp.o
[ 68%] Linking CXX executable Kokkos_HeaderSelfContained_Kokkos_DualView_hpp
[ 68%] Built target Kokkos_HeaderSelfContained_Kokkos_DualView_hpp
Scanning dependencies of target Kokkos_HeaderSelfContained_Kokkos_Half_hpp
[ 69%] Building CXX object core/unit_test/headers_self_contained/CMakeFiles/Kokkos_HeaderSelfContained_Kokkos_Half_hpp.dir/tstHeader.cpp.o
[ 69%] Linking CXX executable KokkosCore_UnitTest_Serial2
[ 69%] Linking CXX executable Kokkos_HeaderSelfContained_Kokkos_Complex_hpp
[ 69%] Built target Kokkos_HeaderSelfContained_Kokkos_Complex_hpp
Scanning dependencies of target Kokkos_HeaderSelfContained_Kokkos_Graph_hpp
[ 69%] Building CXX object core/unit_test/headers_self_contained/CMakeFiles/Kokkos_HeaderSelfContained_Kokkos_Graph_hpp.dir/tstHeader.cpp.o
[ 69%] Linking CXX executable Kokkos_HeaderSelfContained_Kokkos_Threads_hpp
[ 69%] Built target Kokkos_HeaderSelfContained_Kokkos_Threads_hpp
Scanning dependencies of target Kokkos_HeaderSelfContained_Kokkos_Graph_fwd_hpp
[ 69%] Building CXX object core/unit_test/headers_self_contained/CMakeFiles/Kokkos_HeaderSelfContained_Kokkos_Graph_fwd_hpp.dir/tstHeader.cpp.o
[ 69%] Built target KokkosCore_UnitTest_Serial2
Scanning dependencies of target Kokkos_HeaderSelfContained_Kokkos_Vector_hpp
[ 69%] Building CXX object core/unit_test/headers_self_contained/CMakeFiles/Kokkos_HeaderSelfContained_Kokkos_Vector_hpp.dir/tstHeader.cpp.o
[ 69%] Linking CXX executable Kokkos_HeaderSelfContained_Kokkos_OpenMPTarget_hpp
[ 69%] Linking CXX executable Kokkos_HeaderSelfContained_KokkosExp_InterOp_hpp
[ 69%] Built target Kokkos_HeaderSelfContained_Kokkos_OpenMPTarget_hpp
Scanning dependencies of target Kokkos_HeaderSelfContained_Kokkos_HIP_hpp
[ 69%] Building CXX object core/unit_test/headers_self_contained/CMakeFiles/Kokkos_HeaderSelfContained_Kokkos_HIP_hpp.dir/tstHeader.cpp.o
[ 69%] Built target Kokkos_HeaderSelfContained_KokkosExp_InterOp_hpp
Scanning dependencies of target Kokkos_HeaderSelfContained_Kokkos_MemoryTraits_hpp
[ 69%] Building CXX object core/unit_test/headers_self_contained/CMakeFiles/Kokkos_HeaderSelfContained_Kokkos_MemoryTraits_hpp.dir/tstHeader.cpp.o
[ 69%] Linking CXX executable Kokkos_HeaderSelfContained_Kokkos_Half_hpp
[ 69%] Built target Kokkos_HeaderSelfContained_Kokkos_Half_hpp
Scanning dependencies of target Kokkos_HeaderSelfContained_Kokkos_Layout_hpp
[ 69%] Building CXX object core/unit_test/headers_self_contained/CMakeFiles/Kokkos_HeaderSelfContained_Kokkos_Layout_hpp.dir/tstHeader.cpp.o
[ 69%] Linking CXX executable Kokkos_HeaderSelfContained_Kokkos_GraphNode_hpp
[ 69%] Built target Kokkos_HeaderSelfContained_Kokkos_GraphNode_hpp
Scanning dependencies of target Kokkos_HeaderSelfContained_Kokkos_LogicalSpaces_hpp
[ 69%] Building CXX object core/unit_test/headers_self_contained/CMakeFiles/Kokkos_HeaderSelfContained_Kokkos_LogicalSpaces_hpp.dir/tstHeader.cpp.o
[ 69%] Linking CXX executable Kokkos_HeaderSelfContained_Kokkos_OffsetView_hpp
[ 69%] Built target Kokkos_HeaderSelfContained_Kokkos_OffsetView_hpp
Scanning dependencies of target Kokkos_HeaderSelfContained_Kokkos_Parallel_Reduce_hpp
[ 69%] Building CXX object core/unit_test/headers_self_contained/CMakeFiles/Kokkos_HeaderSelfContained_Kokkos_Parallel_Reduce_hpp.dir/tstHeader.cpp.o
[ 69%] Linking CXX executable Kokkos_HeaderSelfContained_Kokkos_Graph_fwd_hpp
[ 69%] Built target Kokkos_HeaderSelfContained_Kokkos_Graph_fwd_hpp
Scanning dependencies of target Kokkos_HeaderSelfContained_Kokkos_Macros_hpp
[ 69%] Building CXX object core/unit_test/headers_self_contained/CMakeFiles/Kokkos_HeaderSelfContained_Kokkos_Macros_hpp.dir/tstHeader.cpp.o
[ 69%] Linking CXX executable Kokkos_HeaderSelfContained_Kokkos_Graph_hpp
[ 69%] Built target Kokkos_HeaderSelfContained_Kokkos_Graph_hpp
Scanning dependencies of target Kokkos_HeaderSelfContained_Kokkos_OpenMP_hpp
[ 69%] Building CXX object core/unit_test/headers_self_contained/CMakeFiles/Kokkos_HeaderSelfContained_Kokkos_OpenMP_hpp.dir/tstHeader.cpp.o
[ 69%] Linking CXX executable Kokkos_HeaderSelfContained_Kokkos_HIP_hpp
[ 69%] Linking CXX executable Kokkos_HeaderSelfContained_Kokkos_MemoryTraits_hpp
[ 69%] Built target Kokkos_HeaderSelfContained_Kokkos_HIP_hpp
Scanning dependencies of target Kokkos_HeaderSelfContained_Kokkos_MasterLock_hpp
[ 69%] Building CXX object core/unit_test/headers_self_contained/CMakeFiles/Kokkos_HeaderSelfContained_Kokkos_MasterLock_hpp.dir/tstHeader.cpp.o
[ 69%] Built target Kokkos_HeaderSelfContained_Kokkos_MemoryTraits_hpp
Scanning dependencies of target Kokkos_HeaderSelfContained_Kokkos_StdAlgorithms_hpp
[ 69%] Building CXX object core/unit_test/headers_self_contained/CMakeFiles/Kokkos_HeaderSelfContained_Kokkos_StdAlgorithms_hpp.dir/tstHeader.cpp.o
[ 69%] Linking CXX executable Kokkos_HeaderSelfContained_Kokkos_Vector_hpp
[ 69%] Linking CXX executable Kokkos_HeaderSelfContained_Kokkos_Layout_hpp
[ 69%] Built target Kokkos_HeaderSelfContained_Kokkos_Vector_hpp
Scanning dependencies of target Kokkos_HeaderSelfContained_Kokkos_StaticCrsGraph_hpp
[ 70%] Building CXX object core/unit_test/headers_self_contained/CMakeFiles/Kokkos_HeaderSelfContained_Kokkos_StaticCrsGraph_hpp.dir/tstHeader.cpp.o
[ 70%] Built target Kokkos_HeaderSelfContained_Kokkos_Layout_hpp
Scanning dependencies of target Kokkos_HeaderSelfContained_Kokkos_MathematicalConstants_hpp
[ 70%] Building CXX object core/unit_test/headers_self_contained/CMakeFiles/Kokkos_HeaderSelfContained_Kokkos_MathematicalConstants_hpp.dir/tstHeader.cpp.o
[ 71%] Linking CXX executable Kokkos_HeaderSelfContained_Kokkos_LogicalSpaces_hpp
[ 71%] Built target Kokkos_HeaderSelfContained_Kokkos_LogicalSpaces_hpp
Scanning dependencies of target Kokkos_HeaderSelfContained_Kokkos_Atomics_Desul_Volatile_Wrapper_hpp
[ 71%] Building CXX object core/unit_test/headers_self_contained/CMakeFiles/Kokkos_HeaderSelfContained_Kokkos_Atomics_Desul_Volatile_Wrapper_hpp.dir/tstHeader.cpp.o
[ 71%] Linking CXX executable Kokkos_HeaderSelfContained_Kokkos_Macros_hpp
[ 71%] Built target Kokkos_HeaderSelfContained_Kokkos_Macros_hpp
Scanning dependencies of target Kokkos_HeaderSelfContained_Kokkos_MathematicalFunctions_hpp
[ 71%] Building CXX object core/unit_test/headers_self_contained/CMakeFiles/Kokkos_HeaderSelfContained_Kokkos_MathematicalFunctions_hpp.dir/tstHeader.cpp.o
[ 72%] Linking CXX executable Kokkos_HeaderSelfContained_Kokkos_Parallel_Reduce_hpp
[ 72%] Linking CXX executable Kokkos_HeaderSelfContained_Kokkos_OpenMP_hpp
[ 72%] Built target Kokkos_HeaderSelfContained_Kokkos_Parallel_Reduce_hpp
Scanning dependencies of target Kokkos_HeaderSelfContained_Kokkos_MemoryPool_hpp
[ 72%] Building CXX object core/unit_test/headers_self_contained/CMakeFiles/Kokkos_HeaderSelfContained_Kokkos_MemoryPool_hpp.dir/tstHeader.cpp.o
[ 72%] Built target Kokkos_HeaderSelfContained_Kokkos_OpenMP_hpp
Scanning dependencies of target Kokkos_HeaderSelfContained_Kokkos_Sort_hpp
[ 72%] Building CXX object core/unit_test/headers_self_contained/CMakeFiles/Kokkos_HeaderSelfContained_Kokkos_Sort_hpp.dir/tstHeader.cpp.o
[ 72%] Linking CXX executable Kokkos_HeaderSelfContained_Kokkos_MasterLock_hpp
[ 72%] Built target Kokkos_HeaderSelfContained_Kokkos_MasterLock_hpp
Scanning dependencies of target Kokkos_HeaderSelfContained_Kokkos_hwloc_hpp
[ 72%] Building CXX object core/unit_test/headers_self_contained/CMakeFiles/Kokkos_HeaderSelfContained_Kokkos_hwloc_hpp.dir/tstHeader.cpp.o
[ 72%] Linking CXX executable Kokkos_HeaderSelfContained_Kokkos_MathematicalConstants_hpp
[ 72%] Built target Kokkos_HeaderSelfContained_Kokkos_MathematicalConstants_hpp
Scanning dependencies of target Kokkos_HeaderSelfContained_Kokkos_Atomics_Desul_Config_hpp
[ 72%] Building CXX object core/unit_test/headers_self_contained/CMakeFiles/Kokkos_HeaderSelfContained_Kokkos_Atomics_Desul_Config_hpp.dir/tstHeader.cpp.o
[ 73%] Linking CXX executable Kokkos_HeaderSelfContained_Kokkos_Atomics_Desul_Volatile_Wrapper_hpp
[ 73%] Built target Kokkos_HeaderSelfContained_Kokkos_Atomics_Desul_Volatile_Wrapper_hpp
Scanning dependencies of target Kokkos_HeaderSelfContained_Kokkos_AnonymousSpace_hpp
[ 73%] Building CXX object core/unit_test/headers_self_contained/CMakeFiles/Kokkos_HeaderSelfContained_Kokkos_AnonymousSpace_hpp.dir/tstHeader.cpp.o
[ 73%] Linking CXX executable Kokkos_HeaderSelfContained_Kokkos_StdAlgorithms_hpp
[ 73%] Built target Kokkos_HeaderSelfContained_Kokkos_StdAlgorithms_hpp
Scanning dependencies of target Kokkos_HeaderSelfContained_Kokkos_MinMaxClamp_hpp
[ 74%] Building CXX object core/unit_test/headers_self_contained/CMakeFiles/Kokkos_HeaderSelfContained_Kokkos_MinMaxClamp_hpp.dir/tstHeader.cpp.o
[ 74%] Linking CXX executable Kokkos_HeaderSelfContained_Kokkos_StaticCrsGraph_hpp
[ 74%] Built target Kokkos_HeaderSelfContained_Kokkos_StaticCrsGraph_hpp
Scanning dependencies of target Kokkos_HeaderSelfContained_Kokkos_OpenMPTargetSpace_hpp
[ 74%] Building CXX object core/unit_test/headers_self_contained/CMakeFiles/Kokkos_HeaderSelfContained_Kokkos_OpenMPTargetSpace_hpp.dir/tstHeader.cpp.o
[ 75%] Linking CXX executable Kokkos_HeaderSelfContained_Kokkos_MathematicalFunctions_hpp
[ 75%] Built target Kokkos_HeaderSelfContained_Kokkos_MathematicalFunctions_hpp
Scanning dependencies of target Kokkos_HeaderSelfContained_Kokkos_Cuda_hpp
[ 75%] Building CXX object core/unit_test/headers_self_contained/CMakeFiles/Kokkos_HeaderSelfContained_Kokkos_Cuda_hpp.dir/tstHeader.cpp.o
[ 75%] Linking CXX executable Kokkos_HeaderSelfContained_Kokkos_MemoryPool_hpp
[ 75%] Built target Kokkos_HeaderSelfContained_Kokkos_MemoryPool_hpp
Scanning dependencies of target Kokkos_HeaderSelfContained_Kokkos_HIP_Space_hpp
[ 75%] Building CXX object core/unit_test/headers_self_contained/CMakeFiles/Kokkos_HeaderSelfContained_Kokkos_HIP_Space_hpp.dir/tstHeader.cpp.o
[ 75%] Linking CXX executable Kokkos_HeaderSelfContained_Kokkos_hwloc_hpp
[ 75%] Built target Kokkos_HeaderSelfContained_Kokkos_hwloc_hpp
Scanning dependencies of target Kokkos_HeaderSelfContained_Kokkos_Pair_hpp
[ 75%] Building CXX object core/unit_test/headers_self_contained/CMakeFiles/Kokkos_HeaderSelfContained_Kokkos_Pair_hpp.dir/tstHeader.cpp.o
[ 75%] Linking CXX executable Kokkos_HeaderSelfContained_Kokkos_Sort_hpp
[ 75%] Built target Kokkos_HeaderSelfContained_Kokkos_Sort_hpp
Scanning dependencies of target Kokkos_HeaderSelfContained_Kokkos_HBWSpace_hpp
[ 76%] Building CXX object core/unit_test/headers_self_contained/CMakeFiles/Kokkos_HeaderSelfContained_Kokkos_HBWSpace_hpp.dir/tstHeader.cpp.o
[ 76%] Linking CXX executable Kokkos_HeaderSelfContained_Kokkos_Atomics_Desul_Config_hpp
[ 76%] Built target Kokkos_HeaderSelfContained_Kokkos_Atomics_Desul_Config_hpp
Scanning dependencies of target Kokkos_HeaderSelfContained_Kokkos_Atomics_Desul_Wrapper_hpp
[ 76%] Building CXX object core/unit_test/headers_self_contained/CMakeFiles/Kokkos_HeaderSelfContained_Kokkos_Atomics_Desul_Wrapper_hpp.dir/tstHeader.cpp.o
[ 77%] Linking CXX executable Kokkos_HeaderSelfContained_Kokkos_AnonymousSpace_hpp
[ 77%] Built target Kokkos_HeaderSelfContained_Kokkos_AnonymousSpace_hpp
Scanning dependencies of target Kokkos_HeaderSelfContained_Kokkos_Parallel_hpp
[ 77%] Building CXX object core/unit_test/headers_self_contained/CMakeFiles/Kokkos_HeaderSelfContained_Kokkos_Parallel_hpp.dir/tstHeader.cpp.o
[ 77%] Linking CXX executable Kokkos_HeaderSelfContained_Kokkos_MinMaxClamp_hpp
[ 77%] Built target Kokkos_HeaderSelfContained_Kokkos_MinMaxClamp_hpp
Scanning dependencies of target KokkosCore_PerformanceTest_Atomic_MinMax
[ 77%] Building CXX object core/perf_test/CMakeFiles/KokkosCore_PerformanceTest_Atomic_MinMax.dir/test_atomic_minmax_simple.cpp.o
[ 77%] Linking CXX executable Kokkos_HeaderSelfContained_Kokkos_OpenMPTargetSpace_hpp
[ 77%] Built target Kokkos_HeaderSelfContained_Kokkos_OpenMPTargetSpace_hpp
Scanning dependencies of target KokkosCore_PerformanceTest_Mempool
[ 78%] Building CXX object core/perf_test/CMakeFiles/KokkosCore_PerformanceTest_Mempool.dir/test_mempool.cpp.o
[ 78%] Linking CXX executable Kokkos_HeaderSelfContained_Kokkos_Cuda_hpp
[ 78%] Built target Kokkos_HeaderSelfContained_Kokkos_Cuda_hpp
Scanning dependencies of target KokkosCore_PerformanceTest_Atomic
[ 78%] Building CXX object core/perf_test/CMakeFiles/KokkosCore_PerformanceTest_Atomic.dir/test_atomic.cpp.o
[ 78%] Linking CXX executable Kokkos_HeaderSelfContained_Kokkos_HIP_Space_hpp
[ 78%] Built target Kokkos_HeaderSelfContained_Kokkos_HIP_Space_hpp
Scanning dependencies of target KokkosCore_PerfTestExec
[ 78%] Building CXX object core/perf_test/CMakeFiles/KokkosCore_PerfTestExec.dir/PerfTestMain.cpp.o
[ 78%] Linking CXX executable Kokkos_HeaderSelfContained_Kokkos_Pair_hpp
[ 78%] Built target Kokkos_HeaderSelfContained_Kokkos_Pair_hpp
Scanning dependencies of target KokkosCore_PerformanceTest_TaskDag
[ 78%] Building CXX object core/perf_test/CMakeFiles/KokkosCore_PerformanceTest_TaskDag.dir/test_taskdag.cpp.o
[ 78%] Linking CXX executable Kokkos_HeaderSelfContained_Kokkos_HBWSpace_hpp
[ 78%] Built target Kokkos_HeaderSelfContained_Kokkos_HBWSpace_hpp
Scanning dependencies of target KokkosContainers_UnitTest_Serial
[ 78%] Building CXX object containers/unit_tests/CMakeFiles/KokkosContainers_UnitTest_Serial.dir/UnitTestMain.cpp.o
[ 78%] Linking CXX executable Kokkos_HeaderSelfContained_Kokkos_Atomics_Desul_Wrapper_hpp
[ 78%] Built target Kokkos_HeaderSelfContained_Kokkos_Atomics_Desul_Wrapper_hpp
Scanning dependencies of target KokkosContainers_UnitTest_SYCL
[ 78%] Building CXX object containers/unit_tests/CMakeFiles/KokkosContainers_UnitTest_SYCL.dir/UnitTestMain.cpp.o
[ 78%] Linking CXX executable Kokkos_HeaderSelfContained_Kokkos_Parallel_hpp
[ 78%] Built target Kokkos_HeaderSelfContained_Kokkos_Parallel_hpp
Scanning dependencies of target KokkosAlgorithms_UnitTest_StdSet_C
[ 78%] Building CXX object algorithms/unit_tests/CMakeFiles/KokkosAlgorithms_UnitTest_StdSet_C.dir/UnitTestMain.cpp.o
[ 78%] Building CXX object core/perf_test/CMakeFiles/KokkosCore_PerfTestExec.dir/PerfTestGramSchmidt.cpp.o
[ 78%] Linking CXX executable KokkosCore_PerformanceTest_Mempool
[ 78%] Linking CXX executable KokkosCore_PerformanceTest_TaskDag
[ 78%] Built target KokkosCore_PerformanceTest_TaskDag
[ 78%] Building CXX object core/perf_test/CMakeFiles/KokkosCore_PerfTestExec.dir/PerfTestHexGrad.cpp.o
[ 78%] Built target KokkosCore_PerformanceTest_Mempool
[ 78%] Building CXX object containers/unit_tests/CMakeFiles/KokkosContainers_UnitTest_SYCL.dir/sycl/TestSYCL_Bitset.cpp.o
[ 78%] Building CXX object containers/unit_tests/CMakeFiles/KokkosContainers_UnitTest_Serial.dir/serial/TestSerial_Bitset.cpp.o
[ 79%] Building CXX object core/perf_test/CMakeFiles/KokkosCore_PerfTestExec.dir/PerfTest_CustomReduction.cpp.o
[ 80%] Building CXX object algorithms/unit_tests/CMakeFiles/KokkosAlgorithms_UnitTest_StdSet_C.dir/TestStdAlgorithmsCommon.cpp.o
[ 80%] Building CXX object core/perf_test/CMakeFiles/KokkosCore_PerfTestExec.dir/PerfTest_ExecSpacePartitioning.cpp.o
[ 80%] Building CXX object containers/unit_tests/CMakeFiles/KokkosContainers_UnitTest_Serial.dir/serial/TestSerial_DualView.cpp.o
[ 80%] Building CXX object algorithms/unit_tests/CMakeFiles/KokkosAlgorithms_UnitTest_StdSet_C.dir/TestStdAlgorithmsLexicographicalCompare.cpp.o
[ 80%] Building CXX object containers/unit_tests/CMakeFiles/KokkosContainers_UnitTest_SYCL.dir/sycl/TestSYCL_DualView.cpp.o
[ 80%] Linking CXX executable KokkosCore_PerformanceTest_Atomic
[ 80%] Building CXX object containers/unit_tests/CMakeFiles/KokkosContainers_UnitTest_SYCL.dir/sycl/TestSYCL_DynamicView.cpp.o
[ 80%] Building CXX object core/perf_test/CMakeFiles/KokkosCore_PerfTestExec.dir/PerfTest_ViewCopy_a123.cpp.o
[ 80%] Built target KokkosCore_PerformanceTest_Atomic
[ 81%] Building CXX object containers/unit_tests/CMakeFiles/KokkosContainers_UnitTest_Serial.dir/serial/TestSerial_DynamicView.cpp.o
[ 82%] Building CXX object containers/unit_tests/CMakeFiles/KokkosContainers_UnitTest_SYCL.dir/sycl/TestSYCL_DynViewAPI_generic.cpp.o
[ 82%] Building CXX object containers/unit_tests/CMakeFiles/KokkosContainers_UnitTest_SYCL.dir/sycl/TestSYCL_DynViewAPI_rank12345.cpp.o
[ 82%] Building CXX object containers/unit_tests/CMakeFiles/KokkosContainers_UnitTest_SYCL.dir/sycl/TestSYCL_DynViewAPI_rank67.cpp.o
[ 82%] Building CXX object core/perf_test/CMakeFiles/KokkosCore_PerfTestExec.dir/PerfTest_ViewCopy_b123.cpp.o
[ 82%] Building CXX object containers/unit_tests/CMakeFiles/KokkosContainers_UnitTest_Serial.dir/serial/TestSerial_DynViewAPI_generic.cpp.o
[ 82%] Building CXX object containers/unit_tests/CMakeFiles/KokkosContainers_UnitTest_SYCL.dir/sycl/TestSYCL_ErrorReporter.cpp.o
Scanning dependencies of target KokkosAlgorithms_UnitTest_StdSet_B
[ 82%] Building CXX object algorithms/unit_tests/CMakeFiles/KokkosAlgorithms_UnitTest_StdSet_B.dir/UnitTestMain.cpp.o
[ 82%] Building CXX object containers/unit_tests/CMakeFiles/KokkosContainers_UnitTest_SYCL.dir/sycl/TestSYCL_OffsetView.cpp.o
[ 82%] Linking CXX executable KokkosCore_PerformanceTest_Atomic_MinMax
[ 82%] Building CXX object algorithms/unit_tests/CMakeFiles/KokkosAlgorithms_UnitTest_StdSet_C.dir/TestStdAlgorithmsForEach.cpp.o
[ 82%] Building CXX object core/perf_test/CMakeFiles/KokkosCore_PerfTestExec.dir/PerfTest_ViewCopy_c123.cpp.o
[ 82%] Building CXX object algorithms/unit_tests/CMakeFiles/KokkosAlgorithms_UnitTest_StdSet_B.dir/TestStdAlgorithmsCommon.cpp.o
[ 82%] Built target KokkosCore_PerformanceTest_Atomic_MinMax
[ 82%] Building CXX object core/perf_test/CMakeFiles/KokkosCore_PerfTestExec.dir/PerfTest_ViewCopy_d123.cpp.o
[ 82%] Building CXX object containers/unit_tests/CMakeFiles/KokkosContainers_UnitTest_Serial.dir/serial/TestSerial_DynViewAPI_rank12345.cpp.o
[ 82%] Building CXX object core/perf_test/CMakeFiles/KokkosCore_PerfTestExec.dir/PerfTest_ViewCopy_a45.cpp.o
[ 82%] Building CXX object core/perf_test/CMakeFiles/KokkosCore_PerfTestExec.dir/PerfTest_ViewCopy_b45.cpp.o
[ 82%] Building CXX object algorithms/unit_tests/CMakeFiles/KokkosAlgorithms_UnitTest_StdSet_B.dir/TestStdAlgorithmsMinMaxElementOps.cpp.o
[ 82%] Building CXX object algorithms/unit_tests/CMakeFiles/KokkosAlgorithms_UnitTest_StdSet_C.dir/TestStdAlgorithmsFind.cpp.o
[ 83%] Building CXX object core/perf_test/CMakeFiles/KokkosCore_PerfTestExec.dir/PerfTest_ViewCopy_c45.cpp.o
[ 83%] Building CXX object containers/unit_tests/CMakeFiles/KokkosContainers_UnitTest_Serial.dir/serial/TestSerial_DynViewAPI_rank67.cpp.o
[ 83%] Building CXX object containers/unit_tests/CMakeFiles/KokkosContainers_UnitTest_SYCL.dir/sycl/TestSYCL_ScatterView.cpp.o
[ 83%] Building CXX object containers/unit_tests/CMakeFiles/KokkosContainers_UnitTest_SYCL.dir/sycl/TestSYCL_StaticCrsGraph.cpp.o
[ 83%] Building CXX object core/perf_test/CMakeFiles/KokkosCore_PerfTestExec.dir/PerfTest_ViewCopy_d45.cpp.o
[ 83%] Building CXX object containers/unit_tests/CMakeFiles/KokkosContainers_UnitTest_Serial.dir/serial/TestSerial_ErrorReporter.cpp.o
[ 83%] Building CXX object core/perf_test/CMakeFiles/KokkosCore_PerfTestExec.dir/PerfTest_ViewCopy_a6.cpp.o
[ 83%] Building CXX object core/perf_test/CMakeFiles/KokkosCore_PerfTestExec.dir/PerfTest_ViewCopy_b6.cpp.o
[ 83%] Linking CXX executable KokkosAlgorithms_UnitTest_StdSet_B
[ 83%] Building CXX object containers/unit_tests/CMakeFiles/KokkosContainers_UnitTest_Serial.dir/serial/TestSerial_OffsetView.cpp.o
[ 84%] Building CXX object containers/unit_tests/CMakeFiles/KokkosContainers_UnitTest_SYCL.dir/sycl/TestSYCL_WithoutInitializing.cpp.o
[ 84%] Building CXX object containers/unit_tests/CMakeFiles/KokkosContainers_UnitTest_SYCL.dir/sycl/TestSYCL_UnorderedMap.cpp.o
[ 84%] Built target KokkosAlgorithms_UnitTest_StdSet_B
Scanning dependencies of target KokkosAlgorithms_UnitTest_RandomAndSort
[ 84%] Building CXX object algorithms/unit_tests/CMakeFiles/KokkosAlgorithms_UnitTest_RandomAndSort.dir/UnitTestMain.cpp.o
Scanning dependencies of target KokkosAlgorithms_UnitTest_StdSet_A
[ 84%] Building CXX object algorithms/unit_tests/CMakeFiles/KokkosAlgorithms_UnitTest_StdSet_A.dir/UnitTestMain.cpp.o
[ 84%] Building CXX object algorithms/unit_tests/CMakeFiles/KokkosAlgorithms_UnitTest_StdSet_C.dir/TestStdAlgorithmsFindFirstOf.cpp.o
[ 84%] Building CXX object core/perf_test/CMakeFiles/KokkosCore_PerfTestExec.dir/PerfTest_ViewCopy_c6.cpp.o
[ 84%] Building CXX object algorithms/unit_tests/CMakeFiles/KokkosAlgorithms_UnitTest_RandomAndSort.dir/sycl/TestRandomAndSort.cpp.o
[ 84%] Building CXX object algorithms/unit_tests/CMakeFiles/KokkosAlgorithms_UnitTest_StdSet_A.dir/TestStdReducers.cpp.o
[ 84%] Building CXX object containers/unit_tests/CMakeFiles/KokkosContainers_UnitTest_Serial.dir/serial/TestSerial_ScatterView.cpp.o
[ 84%] Building CXX object containers/unit_tests/CMakeFiles/KokkosContainers_UnitTest_SYCL.dir/sycl/TestSYCL_Vector.cpp.o
[ 85%] Building CXX object algorithms/unit_tests/CMakeFiles/KokkosAlgorithms_UnitTest_StdSet_A.dir/TestStdAlgorithmsConstraints.cpp.o
[ 85%] Building CXX object core/perf_test/CMakeFiles/KokkosCore_PerfTestExec.dir/PerfTest_ViewCopy_d6.cpp.o
[ 85%] Building CXX object algorithms/unit_tests/CMakeFiles/KokkosAlgorithms_UnitTest_StdSet_A.dir/TestRandomAccessIterator.cpp.o
[ 85%] Building CXX object algorithms/unit_tests/CMakeFiles/KokkosAlgorithms_UnitTest_StdSet_C.dir/TestStdAlgorithmsFindEnd.cpp.o
[ 86%] Building CXX object containers/unit_tests/CMakeFiles/KokkosContainers_UnitTest_Serial.dir/serial/TestSerial_StaticCrsGraph.cpp.o
[ 86%] Building CXX object containers/unit_tests/CMakeFiles/KokkosContainers_UnitTest_Serial.dir/serial/TestSerial_WithoutInitializing.cpp.o
[ 86%] Building CXX object containers/unit_tests/CMakeFiles/KokkosContainers_UnitTest_SYCL.dir/sycl/TestSYCL_ViewCtorPropEmbeddedDim.cpp.o
[ 86%] Building CXX object core/perf_test/CMakeFiles/KokkosCore_PerfTestExec.dir/PerfTest_ViewCopy_a7.cpp.o
[ 86%] Linking CXX executable KokkosAlgorithms_UnitTest_StdSet_A
[ 86%] Built target KokkosAlgorithms_UnitTest_StdSet_A
Scanning dependencies of target KokkosAlgorithms_UnitTest_StdSet_D
[ 86%] Building CXX object algorithms/unit_tests/CMakeFiles/KokkosAlgorithms_UnitTest_StdSet_D.dir/UnitTestMain.cpp.o
[ 86%] Building CXX object containers/unit_tests/CMakeFiles/KokkosContainers_UnitTest_Serial.dir/serial/TestSerial_UnorderedMap.cpp.o
[ 86%] Linking CXX executable KokkosContainers_UnitTest_SYCL
[ 87%] Building CXX object algorithms/unit_tests/CMakeFiles/KokkosAlgorithms_UnitTest_StdSet_D.dir/TestStdAlgorithmsCommon.cpp.o
[ 88%] Building CXX object core/perf_test/CMakeFiles/KokkosCore_PerfTestExec.dir/PerfTest_ViewCopy_b7.cpp.o
[ 88%] Building CXX object algorithms/unit_tests/CMakeFiles/KokkosAlgorithms_UnitTest_StdSet_C.dir/TestStdAlgorithmsCount.cpp.o
[ 88%] Building CXX object algorithms/unit_tests/CMakeFiles/KokkosAlgorithms_UnitTest_StdSet_D.dir/TestStdAlgorithmsModOps.cpp.o
[ 88%] Building CXX object containers/unit_tests/CMakeFiles/KokkosContainers_UnitTest_Serial.dir/serial/TestSerial_Vector.cpp.o
[ 88%] Building CXX object containers/unit_tests/CMakeFiles/KokkosContainers_UnitTest_Serial.dir/serial/TestSerial_ViewCtorPropEmbeddedDim.cpp.o
[ 88%] Building CXX object algorithms/unit_tests/CMakeFiles/KokkosAlgorithms_UnitTest_StdSet_D.dir/TestStdAlgorithmsModSeqOps.cpp.o
[ 88%] Building CXX object core/perf_test/CMakeFiles/KokkosCore_PerfTestExec.dir/PerfTest_ViewCopy_c7.cpp.o
[ 88%] Building CXX object algorithms/unit_tests/CMakeFiles/KokkosAlgorithms_UnitTest_StdSet_D.dir/TestStdAlgorithmsReplace.cpp.o
[ 88%] Building CXX object algorithms/unit_tests/CMakeFiles/KokkosAlgorithms_UnitTest_StdSet_D.dir/TestStdAlgorithmsReplaceIf.cpp.o
[ 88%] Linking CXX executable KokkosContainers_UnitTest_Serial
[ 88%] Built target KokkosContainers_UnitTest_Serial
[ 89%] Building CXX object algorithms/unit_tests/CMakeFiles/KokkosAlgorithms_UnitTest_StdSet_C.dir/TestStdAlgorithmsEqual.cpp.o
[ 89%] Built target KokkosContainers_UnitTest_SYCL
[ 89%] Building CXX object algorithms/unit_tests/CMakeFiles/KokkosAlgorithms_UnitTest_StdSet_C.dir/TestStdAlgorithmsAllAnyNoneOf.cpp.o
Scanning dependencies of target KokkosAlgorithms_UnitTest_StdSet_E
[ 89%] Building CXX object algorithms/unit_tests/CMakeFiles/KokkosAlgorithms_UnitTest_StdSet_E.dir/UnitTestMain.cpp.o
[ 89%] Building CXX object core/perf_test/CMakeFiles/KokkosCore_PerfTestExec.dir/PerfTest_ViewCopy_d7.cpp.o
[ 89%] Building CXX object algorithms/unit_tests/CMakeFiles/KokkosAlgorithms_UnitTest_StdSet_D.dir/TestStdAlgorithmsReplaceCopy.cpp.o
[ 89%] Building CXX object algorithms/unit_tests/CMakeFiles/KokkosAlgorithms_UnitTest_StdSet_E.dir/TestStdAlgorithmsCommon.cpp.o
[ 90%] Building CXX object algorithms/unit_tests/CMakeFiles/KokkosAlgorithms_UnitTest_StdSet_E.dir/TestStdAlgorithmsIsSorted.cpp.o
[ 90%] Building CXX object core/perf_test/CMakeFiles/KokkosCore_PerfTestExec.dir/PerfTest_ViewCopy_a8.cpp.o
[ 90%] Building CXX object algorithms/unit_tests/CMakeFiles/KokkosAlgorithms_UnitTest_StdSet_D.dir/TestStdAlgorithmsReplaceCopyIf.cpp.o
[ 90%] Building CXX object algorithms/unit_tests/CMakeFiles/KokkosAlgorithms_UnitTest_StdSet_C.dir/TestStdAlgorithmsAdjacentFind.cpp.o
[ 90%] Linking CXX executable KokkosAlgorithms_UnitTest_RandomAndSort
[ 90%] Building CXX object algorithms/unit_tests/CMakeFiles/KokkosAlgorithms_UnitTest_StdSet_C.dir/TestStdAlgorithmsSearch.cpp.o
[ 90%] Building CXX object algorithms/unit_tests/CMakeFiles/KokkosAlgorithms_UnitTest_StdSet_C.dir/TestStdAlgorithmsSearch_n.cpp.o
[ 90%] Building CXX object core/perf_test/CMakeFiles/KokkosCore_PerfTestExec.dir/PerfTest_ViewCopy_b8.cpp.o
[ 90%] Building CXX object algorithms/unit_tests/CMakeFiles/KokkosAlgorithms_UnitTest_StdSet_E.dir/TestStdAlgorithmsIsSortedUntil.cpp.o
[ 90%] Building CXX object core/perf_test/CMakeFiles/KokkosCore_PerfTestExec.dir/PerfTest_ViewCopy_c8.cpp.o
[ 91%] Building CXX object algorithms/unit_tests/CMakeFiles/KokkosAlgorithms_UnitTest_StdSet_D.dir/TestStdAlgorithmsCopyIf.cpp.o
[ 91%] Built target KokkosAlgorithms_UnitTest_RandomAndSort
Scanning dependencies of target KokkosAlgorithms_UnitTest_StdAlgoCompileOnly
[ 91%] Building CXX object algorithms/unit_tests/CMakeFiles/KokkosAlgorithms_UnitTest_StdAlgoCompileOnly.dir/TestStdAlgorithmsCompileOnly.cpp.o
[ 91%] Building CXX object algorithms/unit_tests/CMakeFiles/KokkosAlgorithms_UnitTest_StdSet_D.dir/TestStdAlgorithmsUnique.cpp.o
[ 91%] Building CXX object core/perf_test/CMakeFiles/KokkosCore_PerfTestExec.dir/PerfTest_ViewCopy_d8.cpp.o
[ 91%] Building CXX object core/perf_test/CMakeFiles/KokkosCore_PerfTestExec.dir/PerfTest_ViewAllocate.cpp.o
[ 92%] Building CXX object core/perf_test/CMakeFiles/KokkosCore_PerfTestExec.dir/PerfTest_ViewFill_123.cpp.o
[ 92%] Building CXX object algorithms/unit_tests/CMakeFiles/KokkosAlgorithms_UnitTest_StdSet_C.dir/TestStdAlgorithmsMismatch.cpp.o
[ 92%] Building CXX object algorithms/unit_tests/CMakeFiles/KokkosAlgorithms_UnitTest_StdSet_E.dir/TestStdAlgorithmsPartitioningOps.cpp.o
[ 92%] Building CXX object algorithms/unit_tests/CMakeFiles/KokkosAlgorithms_UnitTest_StdSet_D.dir/TestStdAlgorithmsUniqueCopy.cpp.o
[ 92%] Building CXX object core/perf_test/CMakeFiles/KokkosCore_PerfTestExec.dir/PerfTest_ViewFill_45.cpp.o
[ 92%] Building CXX object core/perf_test/CMakeFiles/KokkosCore_PerfTestExec.dir/PerfTest_ViewFill_6.cpp.o
[ 92%] Building CXX object algorithms/unit_tests/CMakeFiles/KokkosAlgorithms_UnitTest_StdSet_D.dir/TestStdAlgorithmsRemove.cpp.o
[ 92%] Building CXX object core/perf_test/CMakeFiles/KokkosCore_PerfTestExec.dir/PerfTest_ViewFill_7.cpp.o
[ 92%] Building CXX object algorithms/unit_tests/CMakeFiles/KokkosAlgorithms_UnitTest_StdSet_E.dir/TestStdAlgorithmsPartitionCopy.cpp.o
Scanning dependencies of target KokkosExample_query_device
[ 92%] Building CXX object example/query_device/CMakeFiles/KokkosExample_query_device.dir/query_device.cpp.o
[ 92%] Linking CXX executable KokkosAlgorithms_UnitTest_StdSet_C
[ 92%] Building CXX object core/perf_test/CMakeFiles/KokkosCore_PerfTestExec.dir/PerfTest_ViewFill_8.cpp.o
[ 92%] Building CXX object core/perf_test/CMakeFiles/KokkosCore_PerfTestExec.dir/PerfTest_ViewResize_123.cpp.o
[ 92%] Building CXX object algorithms/unit_tests/CMakeFiles/KokkosAlgorithms_UnitTest_StdSet_D.dir/TestStdAlgorithmsRemoveIf.cpp.o
[ 92%] Linking CXX executable KokkosExample_query_device
[ 92%] Built target KokkosExample_query_device
Scanning dependencies of target KokkosExample_tutorial_01_hello_world
[ 92%] Building CXX object example/tutorial/01_hello_world/CMakeFiles/KokkosExample_tutorial_01_hello_world.dir/hello_world.cpp.o
[ 92%] Building CXX object algorithms/unit_tests/CMakeFiles/KokkosAlgorithms_UnitTest_StdSet_D.dir/TestStdAlgorithmsRemoveCopy.cpp.o
[ 92%] Building CXX object algorithms/unit_tests/CMakeFiles/KokkosAlgorithms_UnitTest_StdSet_E.dir/TestStdAlgorithmsNumerics.cpp.o
[ 92%] Building CXX object core/perf_test/CMakeFiles/KokkosCore_PerfTestExec.dir/PerfTest_ViewResize_45.cpp.o
[ 92%] Built target KokkosAlgorithms_UnitTest_StdSet_C
[ 93%] Building CXX object core/perf_test/CMakeFiles/KokkosCore_PerfTestExec.dir/PerfTest_ViewResize_6.cpp.o
[ 93%] Linking CXX executable KokkosExample_tutorial_01_hello_world
[ 93%] Built target KokkosExample_tutorial_01_hello_world
Scanning dependencies of target KokkosExample_tutorial_02_simple_reduce
[ 93%] Building CXX object example/tutorial/02_simple_reduce/CMakeFiles/KokkosExample_tutorial_02_simple_reduce.dir/simple_reduce.cpp.o
[ 93%] Building CXX object core/perf_test/CMakeFiles/KokkosCore_PerfTestExec.dir/PerfTest_ViewResize_7.cpp.o
[ 93%] Building CXX object algorithms/unit_tests/CMakeFiles/KokkosAlgorithms_UnitTest_StdSet_E.dir/TestStdAlgorithmsAdjacentDifference.cpp.o
[ 93%] Linking CXX executable KokkosExample_tutorial_02_simple_reduce
[ 93%] Built target KokkosExample_tutorial_02_simple_reduce
Scanning dependencies of target KokkosExample_tutorial_03_simple_view
[ 93%] Building CXX object example/tutorial/03_simple_view/CMakeFiles/KokkosExample_tutorial_03_simple_view.dir/simple_view.cpp.o
[ 93%] Building CXX object core/perf_test/CMakeFiles/KokkosCore_PerfTestExec.dir/PerfTest_ViewResize_8.cpp.o
[ 93%] Building CXX object algorithms/unit_tests/CMakeFiles/KokkosAlgorithms_UnitTest_StdSet_D.dir/TestStdAlgorithmsRemoveCopyIf.cpp.o
[ 93%] Building CXX object algorithms/unit_tests/CMakeFiles/KokkosAlgorithms_UnitTest_StdSet_E.dir/TestStdAlgorithmsExclusiveScan.cpp.o
[ 93%] Building CXX object algorithms/unit_tests/CMakeFiles/KokkosAlgorithms_UnitTest_StdSet_E.dir/TestStdAlgorithmsInclusiveScan.cpp.o
[ 93%] Linking CXX executable KokkosExample_tutorial_03_simple_view
[ 93%] Built target KokkosExample_tutorial_03_simple_view
[ 93%] Building CXX object algorithms/unit_tests/CMakeFiles/KokkosAlgorithms_UnitTest_StdSet_D.dir/TestStdAlgorithmsRotate.cpp.o
[ 94%] Building CXX object algorithms/unit_tests/CMakeFiles/KokkosAlgorithms_UnitTest_StdSet_E.dir/TestStdAlgorithmsTransformUnaryOp.cpp.o
[ 94%] Linking CXX executable KokkosCore_PerfTestExec
[ 94%] Building CXX object algorithms/unit_tests/CMakeFiles/KokkosAlgorithms_UnitTest_StdSet_E.dir/TestStdAlgorithmsTransformExclusiveScan.cpp.o
[ 94%] Building CXX object algorithms/unit_tests/CMakeFiles/KokkosAlgorithms_UnitTest_StdSet_E.dir/TestStdAlgorithmsTransformInclusiveScan.cpp.o
[ 94%] Linking CXX executable KokkosAlgorithms_UnitTest_StdAlgoCompileOnly
[ 94%] Built target KokkosCore_PerfTestExec
Scanning dependencies of target KokkosExample_tutorial_04_simple_memoryspaces
[ 94%] Building CXX object example/tutorial/04_simple_memoryspaces/CMakeFiles/KokkosExample_tutorial_04_simple_memoryspaces.dir/simple_memoryspaces.cpp.o
[ 95%] Building CXX object algorithms/unit_tests/CMakeFiles/KokkosAlgorithms_UnitTest_StdSet_D.dir/TestStdAlgorithmsRotateCopy.cpp.o
Scanning dependencies of target KokkosExample_tutorial_05_simple_atomics
[ 95%] Building CXX object example/tutorial/05_simple_atomics/CMakeFiles/KokkosExample_tutorial_05_simple_atomics.dir/simple_atomics.cpp.o
[ 95%] Built target KokkosAlgorithms_UnitTest_StdAlgoCompileOnly
[ 95%] Building CXX object algorithms/unit_tests/CMakeFiles/KokkosAlgorithms_UnitTest_StdSet_D.dir/TestStdAlgorithmsReverse.cpp.o
Scanning dependencies of target KokkosExample_tutorial_06_simple_mdrangepolicy
[ 95%] Building CXX object example/tutorial/06_simple_mdrangepolicy/CMakeFiles/KokkosExample_tutorial_06_simple_mdrangepolicy.dir/simple_mdrangepolicy.cpp.o
Scanning dependencies of target KokkosExample_tutorial_advancedviews_01_data_layouts
[ 96%] Building CXX object example/tutorial/Advanced_Views/01_data_layouts/CMakeFiles/KokkosExample_tutorial_advancedviews_01_data_layouts.dir/data_layouts.cpp.o
[ 96%] Linking CXX executable KokkosExample_tutorial_04_simple_memoryspaces
[ 96%] Built target KokkosExample_tutorial_04_simple_memoryspaces
Scanning dependencies of target KokkosExample_tutorial_advancedviews_02_memory_traits
[ 96%] Building CXX object example/tutorial/Advanced_Views/02_memory_traits/CMakeFiles/KokkosExample_tutorial_advancedviews_02_memory_traits.dir/memory_traits.cpp.o
[ 96%] Linking CXX executable KokkosExample_tutorial_05_simple_atomics
[ 96%] Built target KokkosExample_tutorial_05_simple_atomics
Scanning dependencies of target KokkosExample_tutorial_advancedviews_03_subviews
[ 96%] Building CXX object example/tutorial/Advanced_Views/03_subviews/CMakeFiles/KokkosExample_tutorial_advancedviews_03_subviews.dir/subviews.cpp.o
[ 96%] Building CXX object algorithms/unit_tests/CMakeFiles/KokkosAlgorithms_UnitTest_StdSet_D.dir/TestStdAlgorithmsShiftLeft.cpp.o
[ 96%] Linking CXX executable KokkosExample_tutorial_06_simple_mdrangepolicy
[ 96%] Built target KokkosExample_tutorial_06_simple_mdrangepolicy
Scanning dependencies of target KokkosExample_tutorial_advancedviews_04_dualviews
[ 96%] Building CXX object example/tutorial/Advanced_Views/04_dualviews/CMakeFiles/KokkosExample_tutorial_advancedviews_04_dualviews.dir/dual_view.cpp.o
[ 96%] Building CXX object algorithms/unit_tests/CMakeFiles/KokkosAlgorithms_UnitTest_StdSet_D.dir/TestStdAlgorithmsShiftRight.cpp.o
[ 96%] Linking CXX executable KokkosExample_tutorial_advancedviews_01_data_layouts
[ 96%] Built target KokkosExample_tutorial_advancedviews_01_data_layouts
Scanning dependencies of target KokkosExample_tutorial_hierarchicalparallelism_01_thread_teams
[ 96%] Building CXX object example/tutorial/Hierarchical_Parallelism/01_thread_teams/CMakeFiles/KokkosExample_tutorial_hierarchicalparallelism_01_thread_teams.dir/thread_teams.cpp.o
[ 96%] Linking CXX executable KokkosExample_tutorial_advancedviews_02_memory_traits
Scanning dependencies of target KokkosExample_tutorial_hierarchical_01_thread_teams_lambda
[ 97%] Building CXX object example/tutorial/Hierarchical_Parallelism/01_thread_teams_lambda/CMakeFiles/KokkosExample_tutorial_hierarchical_01_thread_teams_lambda.dir/thread_teams_lambda.cpp.o
[ 97%] Built target KokkosExample_tutorial_advancedviews_02_memory_traits
Scanning dependencies of target KokkosExample_tutorial_hierarchicalparallelism_02_nested_parallel_for
[ 97%] Building CXX object example/tutorial/Hierarchical_Parallelism/02_nested_parallel_for/CMakeFiles/KokkosExample_tutorial_hierarchicalparallelism_02_nested_parallel_for.dir/nested_parallel_for.cpp.o
[ 97%] Linking CXX executable KokkosExample_tutorial_advancedviews_03_subviews
[ 97%] Built target KokkosExample_tutorial_advancedviews_03_subviews
Scanning dependencies of target KokkosExample_tutorial_hierarchicalparallelism_03_vectorization
[ 97%] Building CXX object example/tutorial/Hierarchical_Parallelism/03_vectorization/CMakeFiles/KokkosExample_tutorial_hierarchicalparallelism_03_vectorization.dir/vectorization.cpp.o
[ 97%] Linking CXX executable KokkosAlgorithms_UnitTest_StdSet_E
[ 97%] Linking CXX executable KokkosExample_tutorial_advancedviews_04_dualviews
[ 97%] Linking CXX executable KokkosExample_tutorial_hierarchicalparallelism_01_thread_teams
[ 97%] Built target KokkosExample_tutorial_advancedviews_04_dualviews
Scanning dependencies of target KokkosExample_tutorial_01_hello_world_lambda
[ 97%] Building CXX object example/tutorial/01_hello_world_lambda/CMakeFiles/KokkosExample_tutorial_01_hello_world_lambda.dir/hello_world_lambda.cpp.o
[ 97%] Built target KokkosExample_tutorial_hierarchicalparallelism_01_thread_teams
Scanning dependencies of target KokkosExample_tutorial_02_simple_reduce_lambda
[ 97%] Building CXX object example/tutorial/02_simple_reduce_lambda/CMakeFiles/KokkosExample_tutorial_02_simple_reduce_lambda.dir/simple_reduce_lambda.cpp.o
Scanning dependencies of target KokkosExample_tutorial_03_simple_view_lambda
[ 97%] Building CXX object example/tutorial/03_simple_view_lambda/CMakeFiles/KokkosExample_tutorial_03_simple_view_lambda.dir/simple_view_lambda.cpp.o
[ 97%] Linking CXX executable KokkosExample_tutorial_hierarchical_01_thread_teams_lambda
[ 97%] Linking CXX executable KokkosExample_tutorial_hierarchicalparallelism_02_nested_parallel_for
[ 97%] Built target KokkosExample_tutorial_hierarchical_01_thread_teams_lambda
[ 97%] Built target KokkosExample_tutorial_hierarchicalparallelism_02_nested_parallel_for
[ 98%] Linking CXX executable KokkosExample_tutorial_hierarchicalparallelism_03_vectorization
[ 98%] Built target KokkosExample_tutorial_hierarchicalparallelism_03_vectorization
[ 98%] Linking CXX executable KokkosAlgorithms_UnitTest_StdSet_D
[ 99%] Linking CXX executable KokkosExample_tutorial_01_hello_world_lambda
[ 99%] Built target KokkosExample_tutorial_01_hello_world_lambda
[ 99%] Linking CXX executable KokkosExample_tutorial_02_simple_reduce_lambda
[ 99%] Built target KokkosExample_tutorial_02_simple_reduce_lambda
[100%] Linking CXX executable KokkosExample_tutorial_03_simple_view_lambda
[100%] Built target KokkosExample_tutorial_03_simple_view_lambda
[100%] Built target KokkosAlgorithms_UnitTest_StdSet_E
[100%] Built target KokkosAlgorithms_UnitTest_StdSet_D
+ ctest --verbose
UpdateCTestConfiguration  from :/var/jenkins/workspace/Kokkos/build/DartConfiguration.tcl
Parse Config file:/var/jenkins/workspace/Kokkos/build/DartConfiguration.tcl
UpdateCTestConfiguration  from :/var/jenkins/workspace/Kokkos/build/DartConfiguration.tcl
Parse Config file:/var/jenkins/workspace/Kokkos/build/DartConfiguration.tcl
Test project /var/jenkins/workspace/Kokkos/build
Constructing a list of tests
Done constructing a list of tests
Updating test list for fixtures
Added 0 tests to meet fixture requirements
Checking test dependency graph...
Checking test dependency graph end
test 1
      Start  1: KokkosCore_UnitTest_Serial1

1: Test command: /var/jenkins/workspace/Kokkos/build/core/unit_test/KokkosCore_UnitTest_Serial1
1: Test timeout computed to be: 1500
1: [==========] Running 146 tests from 2 test suites.
1: [----------] Global test environment set-up.
1: [----------] 1 test from serial_DeathTest
1: [ RUN      ] serial_DeathTest.policy_bounds_unsafe_narrowing_conversions
1: [       OK ] serial_DeathTest.policy_bounds_unsafe_narrowing_conversions (333 ms)
1: [----------] 1 test from serial_DeathTest (333 ms total)
1: 
1: [----------] 145 tests from serial
1: [ RUN      ] serial.atomic_operations_int
1: [       OK ] serial.atomic_operations_int (1 ms)
1: [ RUN      ] serial.atomic_operations_unsigned
1: [       OK ] serial.atomic_operations_unsigned (1 ms)
1: [ RUN      ] serial.atomic_operations_long
1: [       OK ] serial.atomic_operations_long (1 ms)
1: [ RUN      ] serial.atomic_operations_unsignedlong
1: [       OK ] serial.atomic_operations_unsignedlong (1 ms)
1: [ RUN      ] serial.atomic_operations_longlong
1: [       OK ] serial.atomic_operations_longlong (1 ms)
1: [ RUN      ] serial.atomic_operations_double
1: [       OK ] serial.atomic_operations_double (0 ms)
1: [ RUN      ] serial.atomic_operations_float
1: [       OK ] serial.atomic_operations_float (0 ms)
1: [ RUN      ] serial.atomic_operations_complexdouble
1: [       OK ] serial.atomic_operations_complexdouble (0 ms)
1: [ RUN      ] serial.atomic_operations_complexfloat
1: [       OK ] serial.atomic_operations_complexfloat (0 ms)
1: [ RUN      ] serial.atomic_views_integral
1: [       OK ] serial.atomic_views_integral (106 ms)
1: [ RUN      ] serial.atomic_views_nonintegral
1: [       OK ] serial.atomic_views_nonintegral (62 ms)
1: [ RUN      ] serial.atomic_view_api
1: [       OK ] serial.atomic_view_api (0 ms)
1: [ RUN      ] serial.atomics
1: [       OK ] serial.atomics (5 ms)
1: [ RUN      ] serial.test_block_deduction_bug_pr_3103
1: [       OK ] serial.test_block_deduction_bug_pr_3103 (0 ms)
1: [ RUN      ] serial.complex_construction
1: [       OK ] serial.complex_construction (0 ms)
1: [ RUN      ] serial.complex_basic_math
1: [       OK ] serial.complex_basic_math (0 ms)
1: [ RUN      ] serial.complex_special_funtions
1: [       OK ] serial.complex_special_funtions (0 ms)
1: [ RUN      ] serial.complex_io
1: [       OK ] serial.complex_io (0 ms)
1: [ RUN      ] serial.complex_trivially_copyable
1: [       OK ] serial.complex_trivially_copyable (0 ms)
1: [ RUN      ] serial.complex_issue_3865
1: [       OK ] serial.complex_issue_3865 (0 ms)
1: [ RUN      ] serial.complex_operations_arithmetic_types_overloads
1: [       OK ] serial.complex_operations_arithmetic_types_overloads (0 ms)
1: [ RUN      ] serial.crs_count_fill
1: [       OK ] serial.crs_count_fill (0 ms)
1: [ RUN      ] serial.crs_copy_constructor
1: [       OK ] serial.crs_copy_constructor (2 ms)
1: [ RUN      ] serial.deep_copy_alignment
1: [       OK ] serial.deep_copy_alignment (4 ms)
1: [ RUN      ] serial.deep_copy_conversion
1: [       OK ] serial.deep_copy_conversion (43 ms)
1: [ RUN      ] serial.execution_space_as_class_data_member
1: [       OK ] serial.execution_space_as_class_data_member (0 ms)
1: [ RUN      ] serial.functor_analysis
1: [       OK ] serial.functor_analysis (0 ms)
1: [ RUN      ] serial.init
1: [       OK ] serial.init (0 ms)
1: [ RUN      ] serial.dispatch
1: [       OK ] serial.dispatch (1 ms)
1: [ RUN      ] serial.compiler_macros
1: [       OK ] serial.compiler_macros (0 ms)
1: [ RUN      ] serial.policy_construction
1: [       OK ] serial.policy_construction (0 ms)
1: [ RUN      ] serial.policy_converting_constructor_from_other_policy
1: [       OK ] serial.policy_converting_constructor_from_other_policy (0 ms)
1: [ RUN      ] serial.desired_occupancy_prefer
1: [       OK ] serial.desired_occupancy_prefer (0 ms)
1: [ RUN      ] serial.desired_occupancy_empty_base_optimization
1: [       OK ] serial.desired_occupancy_empty_base_optimization (0 ms)
1: [ RUN      ] serial.desired_occupancy_converting_constructors
1: [       OK ] serial.desired_occupancy_converting_constructors (0 ms)
1: [ RUN      ] serial.md_range_policy_construction_from_arrays
1: [       OK ] serial.md_range_policy_construction_from_arrays (0 ms)
1: [ RUN      ] serial.policy_set_worktag
1: [       OK ] serial.policy_set_worktag (0 ms)
1: [ RUN      ] serial.join_backward_compatibility
1: [       OK ] serial.join_backward_compatibility (3 ms)
1: [ RUN      ] serial.local_deepcopy_teampolicy_layoutleft
1: [       OK ] serial.local_deepcopy_teampolicy_layoutleft (5539 ms)
1: [ RUN      ] serial.local_deepcopy_rangepolicy_layoutleft
1: [       OK ] serial.local_deepcopy_rangepolicy_layoutleft (7083 ms)
1: [ RUN      ] serial.local_deepcopy_teampolicy_layoutright
1: [       OK ] serial.local_deepcopy_teampolicy_layoutright (3179 ms)
1: [ RUN      ] serial.local_deepcopy_rangepolicy_layoutright
1: [       OK ] serial.local_deepcopy_rangepolicy_layoutright (3179 ms)
1: [ RUN      ] serial.deep_copy_scratch
1: [       OK ] serial.deep_copy_scratch (0 ms)
1: [ RUN      ] serial.max
1: [       OK ] serial.max (0 ms)
1: [ RUN      ] serial.max_within_parfor
1: [       OK ] serial.max_within_parfor (3 ms)
1: [ RUN      ] serial.min
1: [       OK ] serial.min (0 ms)
1: [ RUN      ] serial.min_within_parfor
1: [       OK ] serial.min_within_parfor (0 ms)
1: [ RUN      ] serial.minmax
1: [       OK ] serial.minmax (0 ms)
1: [ RUN      ] serial.minmax_within_parfor
1: [       OK ] serial.minmax_within_parfor (0 ms)
1: [ RUN      ] serial.clamp
1: [       OK ] serial.clamp (0 ms)
1: [ RUN      ] serial.clamp_within_parfor
1: [       OK ] serial.clamp_within_parfor (0 ms)
1: [ RUN      ] serial.mathematical_constants_e
1: [       OK ] serial.mathematical_constants_e (0 ms)
1: [ RUN      ] serial.mathematical_constants_log2e
1: [       OK ] serial.mathematical_constants_log2e (0 ms)
1: [ RUN      ] serial.mathematical_constants_log10e
1: [       OK ] serial.mathematical_constants_log10e (0 ms)
1: [ RUN      ] serial.mathematical_constants_pi
1: [       OK ] serial.mathematical_constants_pi (0 ms)
1: [ RUN      ] serial.mathematical_constants_inv_pi
1: [       OK ] serial.mathematical_constants_inv_pi (0 ms)
1: [ RUN      ] serial.mathematical_constants_inv_sqrtpi
1: [       OK ] serial.mathematical_constants_inv_sqrtpi (0 ms)
1: [ RUN      ] serial.mathematical_constants_ln2
1: [       OK ] serial.mathematical_constants_ln2 (0 ms)
1: [ RUN      ] serial.mathematical_constants_ln10
1: [       OK ] serial.mathematical_constants_ln10 (0 ms)
1: [ RUN      ] serial.mathematical_constants_sqrt2
1: [       OK ] serial.mathematical_constants_sqrt2 (0 ms)
1: [ RUN      ] serial.mathematical_constants_sqrt3
1: [       OK ] serial.mathematical_constants_sqrt3 (0 ms)
1: [ RUN      ] serial.mathematical_constants_inv_sqrt3
1: [       OK ] serial.mathematical_constants_inv_sqrt3 (0 ms)
1: [ RUN      ] serial.mathematical_constants_egamma
1: [       OK ] serial.mathematical_constants_egamma (0 ms)
1: [ RUN      ] serial.mathematical_constants_phi
1: [       OK ] serial.mathematical_constants_phi (0 ms)
1: [ RUN      ] serial.mathematical_functions_trigonometric_functions
1: [       OK ] serial.mathematical_functions_trigonometric_functions (0 ms)
1: [ RUN      ] serial.mathematical_functions_power_functions
1: [       OK ] serial.mathematical_functions_power_functions (0 ms)
1: [ RUN      ] serial.mathematical_functions_exponential_functions
1: [       OK ] serial.mathematical_functions_exponential_functions (0 ms)
1: [ RUN      ] serial.mathematical_functions_hyperbolic_functions
1: [       OK ] serial.mathematical_functions_hyperbolic_functions (0 ms)
1: [ RUN      ] serial.mathematical_functions_error_and_gamma_functions
1: [       OK ] serial.mathematical_functions_error_and_gamma_functions (0 ms)
1: [ RUN      ] serial.mathematical_functions_nearest_interger_floating_point_operations
1: [       OK ] serial.mathematical_functions_nearest_interger_floating_point_operations (0 ms)
1: [ RUN      ] serial.mathematical_functions_floating_point_manipulation_functions
1: [       OK ] serial.mathematical_functions_floating_point_manipulation_functions (0 ms)
1: [ RUN      ] serial.mathematical_functions_absolute_value
1: [       OK ] serial.mathematical_functions_absolute_value (0 ms)
1: [ RUN      ] serial.mathematical_functions_isnan
1: [       OK ] serial.mathematical_functions_isnan (0 ms)
1: [ RUN      ] serial.mdrange_5d
1: [       OK ] serial.mdrange_5d (64 ms)
1: [ RUN      ] serial.mdrange_6d
1: [       OK ] serial.mdrange_6d (254 ms)
1: [ RUN      ] serial.mdrange_2d
1: [       OK ] serial.mdrange_2d (1 ms)
1: [ RUN      ] serial.mdrange_array_reduce
1: [       OK ] serial.mdrange_array_reduce (0 ms)
1: [ RUN      ] serial.host_shared_ptr_use_count
1: [       OK ] serial.host_shared_ptr_use_count (0 ms)
1: [ RUN      ] serial.host_shared_ptr_get
1: [       OK ] serial.host_shared_ptr_get (0 ms)
1: [ RUN      ] serial.host_shared_ptr_dereference_on_device
1: [       OK ] serial.host_shared_ptr_dereference_on_device (0 ms)
1: [ RUN      ] serial.host_shared_ptr_special_members_on_device
1: [       OK ] serial.host_shared_ptr_special_members_on_device (0 ms)
1: [ RUN      ] serial.host_shared_ptr_tracking
1: [       OK ] serial.host_shared_ptr_tracking (0 ms)
1: [ RUN      ] serial.partitioning_by_args
1: [       OK ] serial.partitioning_by_args (0 ms)
1: [ RUN      ] serial.partitioning_by_vector
1: [       OK ] serial.partitioning_by_vector (0 ms)
1: [ RUN      ] serial.mathspecialfunc_expint1
1: [       OK ] serial.mathspecialfunc_expint1 (0 ms)
1: [ RUN      ] serial.mathspecialfunc_errorfunc
1: [       OK ] serial.mathspecialfunc_errorfunc (0 ms)
1: [ RUN      ] serial.mathspecialfunc_cbesselj0y0
1: [       OK ] serial.mathspecialfunc_cbesselj0y0 (4 ms)
1: [ RUN      ] serial.mathspecialfunc_cbesselj1y1
1: [       OK ] serial.mathspecialfunc_cbesselj1y1 (4 ms)
1: [ RUN      ] serial.mathspecialfunc_cbesseli0k0
1: [       OK ] serial.mathspecialfunc_cbesseli0k0 (0 ms)
1: [ RUN      ] serial.mathspecialfunc_cbesseli1k1
1: [       OK ] serial.mathspecialfunc_cbesseli1k1 (0 ms)
1: [ RUN      ] serial.mathspecialfunc_cbesselh1stkind
1: [       OK ] serial.mathspecialfunc_cbesselh1stkind (0 ms)
1: [ RUN      ] serial.mathspecialfunc_cbesselh2ndkind
1: [       OK ] serial.mathspecialfunc_cbesselh2ndkind (0 ms)
1: [ RUN      ] serial.mdrange_3d
1: [       OK ] serial.mdrange_3d (9 ms)
1: [ RUN      ] serial.mdrange_neg_idx
1: [       OK ] serial.mdrange_neg_idx (113 ms)
1: [ RUN      ] serial.mdrange_4d
1: [       OK ] serial.mdrange_4d (16 ms)
1: [ RUN      ] serial.mdrange_scalar
1: [       OK ] serial.mdrange_scalar (0 ms)
1: [ RUN      ] serial.mdrange_large_deep_copy
1: [       OK ] serial.mdrange_large_deep_copy (28 ms)
1: [ RUN      ] serial.numeric_traits_infinity
1: [       OK ] serial.numeric_traits_infinity (0 ms)
1: [ RUN      ] serial.numeric_traits_epsilon
1: [       OK ] serial.numeric_traits_epsilon (0 ms)
1: [ RUN      ] serial.numeric_traits_round_error
1: [       OK ] serial.numeric_traits_round_error (0 ms)
1: [ RUN      ] serial.numeric_traits_norm_min
1: [       OK ] serial.numeric_traits_norm_min (0 ms)
1: [ RUN      ] serial.numeric_traits_denorm_min
1: [       OK ] serial.numeric_traits_denorm_min (0 ms)
1: [ RUN      ] serial.numeric_traits_reciprocal_overflow_threshold
1: [       OK ] serial.numeric_traits_reciprocal_overflow_threshold (0 ms)
1: [ RUN      ] serial.numeric_traits_finite_min_max
1: [       OK ] serial.numeric_traits_finite_min_max (0 ms)
1: [ RUN      ] serial.numeric_traits_digits
1: [       OK ] serial.numeric_traits_digits (0 ms)
1: [ RUN      ] serial.numeric_traits_digits10
1: [       OK ] serial.numeric_traits_digits10 (0 ms)
1: [ RUN      ] serial.numeric_traits_max_digits10
1: [       OK ] serial.numeric_traits_max_digits10 (0 ms)
1: [ RUN      ] serial.numeric_traits_radix
1: [       OK ] serial.numeric_traits_radix (0 ms)
1: [ RUN      ] serial.numeric_traits_min_max_exponent
1: [       OK ] serial.numeric_traits_min_max_exponent (0 ms)
1: [ RUN      ] serial.numeric_traits_min_max_exponent10
1: [       OK ] serial.numeric_traits_min_max_exponent10 (0 ms)
1: [ RUN      ] serial.numeric_traits_quiet_and_signaling_nan
1: [       OK ] serial.numeric_traits_quiet_and_signaling_nan (0 ms)
1: [ RUN      ] serial.numeric_traits_sfinae_friendly
1: [       OK ] serial.numeric_traits_sfinae_friendly (0 ms)
1: [ RUN      ] serial.view_aggregate
1: [       OK ] serial.view_aggregate (0 ms)
1: [ RUN      ] serial.memory_pool
1: [       OK ] serial.memory_pool (235 ms)
1: [ RUN      ] serial.cxx11
1: [       OK ] serial.cxx11 (0 ms)
1: [ RUN      ] serial.view_layouttiled
1: [       OK ] serial.view_layouttiled (1 ms)
1: [ RUN      ] serial.view_layouttiled_subtile
1: [       OK ] serial.view_layouttiled_subtile (0 ms)
1: [ RUN      ] serial.range_for
1: [       OK ] serial.range_for (0 ms)
1: [ RUN      ] serial.range_reduce
1: [       OK ] serial.range_reduce (0 ms)
1: [ RUN      ] serial.range_scan
1: [       OK ] serial.range_scan (0 ms)
1: [ RUN      ] serial.range_for_require
1: [       OK ] serial.range_for_require (0 ms)
1: [ RUN      ] serial.range_reduce_require
1: [       OK ] serial.range_reduce_require (0 ms)
1: [ RUN      ] serial.range_scan_require
1: [       OK ] serial.range_scan_require (0 ms)
1: [ RUN      ] serial.int_combined_reduce
1: [       OK ] serial.int_combined_reduce (0 ms)
1: [ RUN      ] serial.mdrange_combined_reduce
1: [       OK ] serial.mdrange_combined_reduce (0 ms)
1: [ RUN      ] serial.int_combined_reduce_mixed
1: [       OK ] serial.int_combined_reduce_mixed (0 ms)
1: [ RUN      ] serial.reduction_deduction
1: [       OK ] serial.reduction_deduction (0 ms)
1: [ RUN      ] serial.reducers_int
1: [       OK ] serial.reducers_int (2 ms)
1: [ RUN      ] serial.reducers_size_t
1: [       OK ] serial.reducers_size_t (2 ms)
1: [ RUN      ] serial.reducers_double
1: [       OK ] serial.reducers_double (2 ms)
1: [ RUN      ] serial.reducers_complex_double
1: [       OK ] serial.reducers_complex_double (0 ms)
1: [ RUN      ] serial.reducers_struct
1: [       OK ] serial.reducers_struct (0 ms)
1: [ RUN      ] serial.reducers_half_t
1: [       OK ] serial.reducers_half_t (0 ms)
1: [ RUN      ] serial.reducers_bhalf_t
1: [       OK ] serial.reducers_bhalf_t (0 ms)
1: [ RUN      ] serial.reducers_int8_t
1: [       OK ] serial.reducers_int8_t (0 ms)
1: [ RUN      ] serial.reducers_point_t
1: [       OK ] serial.reducers_point_t (0 ms)
1: [ RUN      ] serial.reducers_bool
1: [       OK ] serial.reducers_bool (0 ms)
1: [ RUN      ] serial.reduce_device_view_range_policy
1: [       OK ] serial.reduce_device_view_range_policy (14 ms)
1: [ RUN      ] serial.reduce_device_view_mdrange_policy
1: [       OK ] serial.reduce_device_view_mdrange_policy (3722 ms)
1: [ RUN      ] serial.reduce_device_view_team_policy
1: [       OK ] serial.reduce_device_view_team_policy (155 ms)
1: [ RUN      ] serial.scan
1: [       OK ] serial.scan (215 ms)
1: [ RUN      ] serial.impl_shared_alloc
1: [       OK ] serial.impl_shared_alloc (8 ms)
1: [ RUN      ] serial.view_mapping
1: [       OK ] serial.view_mapping (45 ms)
1: [ RUN      ] serial.view_mapping_operator
1: [       OK ] serial.view_mapping_operator (5 ms)
1: [ RUN      ] serial.static_extent
1: [       OK ] serial.static_extent (0 ms)
1: [----------] 145 tests from serial (24156 ms total)
1: 
1: [----------] Global test environment tear-down
1: [==========] 146 tests from 2 test suites ran. (24490 ms total)
1: [  PASSED  ] 146 tests.
 1/59 Test  #1: KokkosCore_UnitTest_Serial1 ...................   Passed   25.55 sec
test 2
      Start  2: KokkosCore_UnitTest_Serial2

2: Test command: /var/jenkins/workspace/Kokkos/build/core/unit_test/KokkosCore_UnitTest_Serial2
2: Test timeout computed to be: 1500
2: [==========] Running 97 tests from 2 test suites.
2: [----------] Global test environment set-up.
2: [----------] 6 tests from serial_DeathTest
2: [ RUN      ] serial_DeathTest.abort_from_host
2: [       OK ] serial_DeathTest.abort_from_host (335 ms)
2: [ RUN      ] serial_DeathTest.abort_from_device
2: [       OK ] serial_DeathTest.abort_from_device (340 ms)
2: [ RUN      ] serial_DeathTest.view_layoutstride_right_to_layoutleft_assignment
2: [       OK ] serial_DeathTest.view_layoutstride_right_to_layoutleft_assignment (2402 ms)
2: [ RUN      ] serial_DeathTest.view_layoutstride_left_to_layoutright_assignment
2: [       OK ] serial_DeathTest.view_layoutstride_left_to_layoutright_assignment (2409 ms)
2: [ RUN      ] serial_DeathTest.view_memory_access_violations_from_host
2: /var/jenkins/workspace/Kokkos/core/unit_test/TestViewMemoryAccessViolation.hpp:181: Skipped
2: skipping since no memory access violation would occur
2: [  SKIPPED ] serial_DeathTest.view_memory_access_violations_from_host (0 ms)
2: [ RUN      ] serial_DeathTest.view_memory_access_violations_from_device
2: /var/jenkins/workspace/Kokkos/core/unit_test/TestViewMemoryAccessViolation.hpp:195: Skipped
2: skipping since no memory access violation would occur
2: [  SKIPPED ] serial_DeathTest.view_memory_access_violations_from_device (0 ms)
2: [----------] 6 tests from serial_DeathTest (5488 ms total)
2: 
2: [----------] 91 tests from serial
2: [ RUN      ] serial.team_for
2: [       OK ] serial.team_for (0 ms)
2: [ RUN      ] serial.team_reduce
2: [       OK ] serial.team_reduce (0 ms)
2: [ RUN      ] serial.team_reduce_large
2: [       OK ] serial.team_reduce_large (467 ms)
2: [ RUN      ] serial.large_team_scratch_size
2: [       OK ] serial.large_team_scratch_size (0 ms)
2: [ RUN      ] serial.team_broadcast_long
2: [       OK ] serial.team_broadcast_long (0 ms)
2: [ RUN      ] serial.team_broadcast_long_wrapper
2: [       OK ] serial.team_broadcast_long_wrapper (0 ms)
2: [ RUN      ] serial.team_broadcast_char
2: [       OK ] serial.team_broadcast_char (0 ms)
2: [ RUN      ] serial.team_broadcast_float
2: [       OK ] serial.team_broadcast_float (0 ms)
2: [ RUN      ] serial.team_broadcast_double
2: [       OK ] serial.team_broadcast_double (0 ms)
2: [ RUN      ] serial.team_handle_by_value
2: [       OK ] serial.team_handle_by_value (0 ms)
2: [ RUN      ] serial.team_vector
2: [       OK ] serial.team_vector (7 ms)
2: [ RUN      ] serial.triple_nested_parallelism
2: [       OK ] serial.triple_nested_parallelism (1363 ms)
2: [ RUN      ] serial.parallel_scan_with_reducers
2: [       OK ] serial.parallel_scan_with_reducers (126 ms)
2: [ RUN      ] serial.team_reduction_scan
2: [       OK ] serial.team_reduction_scan (381 ms)
2: [ RUN      ] serial.team_long_reduce
2: [       OK ] serial.team_long_reduce (154 ms)
2: [ RUN      ] serial.team_double_reduce
2: [       OK ] serial.team_double_reduce (90 ms)
2: [ RUN      ] serial.team_parallel_dummy_with_reducer_and_scratch_space
2: [       OK ] serial.team_parallel_dummy_with_reducer_and_scratch_space (0 ms)
2: [ RUN      ] serial.team_scan
2: [       OK ] serial.team_scan (188 ms)
2: [ RUN      ] serial.team_shared_request
2: [       OK ] serial.team_shared_request (69 ms)
2: [ RUN      ] serial.team_scratch_request
2: [       OK ] serial.team_scratch_request (5 ms)
2: [ RUN      ] serial.team_lambda_shared_request
2: [       OK ] serial.team_lambda_shared_request (69 ms)
2: [ RUN      ] serial.scratch_align
2: [       OK ] serial.scratch_align (0 ms)
2: [ RUN      ] serial.shmem_size
2: [       OK ] serial.shmem_size (0 ms)
2: [ RUN      ] serial.multi_level_scratch
2: [       OK ] serial.multi_level_scratch (4 ms)
2: [ RUN      ] serial.team_policy_max_recommended
2: [       OK ] serial.team_policy_max_recommended (2 ms)
2: [ RUN      ] serial.team_policy_minmax_scalar_without_plus_equal_k
2: [       OK ] serial.team_policy_minmax_scalar_without_plus_equal_k (0 ms)
2: [ RUN      ] serial.team_teamvector_range
2: [       OK ] serial.team_teamvector_range (2 ms)
2: [ RUN      ] serial.unique_token_global
2: [       OK ] serial.unique_token_global (0 ms)
2: [ RUN      ] serial.unique_token_instance
2: [       OK ] serial.unique_token_instance (0 ms)
2: [ RUN      ] serial.unique_token_team_acquire
2: [       OK ] serial.unique_token_team_acquire (0 ms)
2: [ RUN      ] serial.view_api_a
2: [       OK ] serial.view_api_a (10 ms)
2: [ RUN      ] serial.view_api_b
2: [       OK ] serial.view_api_b (0 ms)
2: [ RUN      ] serial.view_api_c
2: [       OK ] serial.view_api_c (0 ms)
2: [ RUN      ] serial.view_api_d
2: [       OK ] serial.view_api_d (0 ms)
2: [ RUN      ] serial.view_allocation_error
2: [       OK ] serial.view_allocation_error (0 ms)
2: [ RUN      ] serial.view_remap
2: [       OK ] serial.view_remap (0 ms)
2: [ RUN      ] serial.view_mirror_nonconst
2: [       OK ] serial.view_mirror_nonconst (0 ms)
2: [ RUN      ] serial.view_stride_method
2: [       OK ] serial.view_stride_method (0 ms)
2: [ RUN      ] serial.anonymous_space
2: [       OK ] serial.anonymous_space (0 ms)
2: [ RUN      ] serial.view_overload_resolution
2: [       OK ] serial.view_overload_resolution (0 ms)
2: [ RUN      ] serial.view_allocation_large_rank
2: [       OK ] serial.view_allocation_large_rank (6925 ms)
2: [ RUN      ] serial.view_shmem_size_on_device
2: [       OK ] serial.view_shmem_size_on_device (0 ms)
2: [ RUN      ] serial.view_is_assignable
2: [       OK ] serial.view_is_assignable (0 ms)
2: [ RUN      ] serial.view_copy_tests
2: [       OK ] serial.view_copy_tests (10 ms)
2: [ RUN      ] serial.view_copy_tests_rank_0
2: [       OK ] serial.view_copy_tests_rank_0 (0 ms)
2: [ RUN      ] serial.view_copy_degenerated
2: [       OK ] serial.view_copy_degenerated (0 ms)
2: [ RUN      ] serial.view_hooks
2: [       OK ] serial.view_hooks (0 ms)
2: [ RUN      ] serial.view_layoutstride_left_to_layoutleft_assignment
2: [       OK ] serial.view_layoutstride_left_to_layoutleft_assignment (88 ms)
2: [ RUN      ] serial.view_layoutstride_right_to_layoutright_assignment
2: [       OK ] serial.view_layoutstride_right_to_layoutright_assignment (73 ms)
2: [ RUN      ] serial.view_irregular_layout
2: [       OK ] serial.view_irregular_layout (0 ms)
2: [ RUN      ] serial.view_mapping_atomic
2: [       OK ] serial.view_mapping_atomic (1 ms)
2: [ RUN      ] serial.view_mapping_class_value
2: [       OK ] serial.view_mapping_class_value (0 ms)
2: [ RUN      ] serial.view_mapping_assignable
2: [       OK ] serial.view_mapping_assignable (0 ms)
2: [ RUN      ] serial.view_mapping_trivially_copyable
2: [       OK ] serial.view_mapping_trivially_copyable (0 ms)
2: [ RUN      ] serial.view_mapping_subview
2: [       OK ] serial.view_mapping_subview (0 ms)
2: [ RUN      ] serial.view_nested_view
2: [       OK ] serial.view_nested_view (0 ms)
2: [ RUN      ] serial.view_resize
2: [       OK ] serial.view_resize (7 ms)
2: [ RUN      ] serial.view_realloc
2: [       OK ] serial.view_realloc (0 ms)
2: [ RUN      ] serial.workgraph_fib
2: [       OK ] serial.workgraph_fib (154 ms)
2: [ RUN      ] serial.resize_realloc_no_init
2: [       OK ] serial.resize_realloc_no_init (0 ms)
2: [ RUN      ] serial.resize_realloc_no_alloc
2: [       OK ] serial.resize_realloc_no_alloc (0 ms)
2: [ RUN      ] serial.view_alloc
2: [       OK ] serial.view_alloc (0 ms)
2: [ RUN      ] serial.view_alloc_exec_space
2: [       OK ] serial.view_alloc_exec_space (0 ms)
2: [ RUN      ] serial.view_alloc_int
2: [       OK ] serial.view_alloc_int (0 ms)
2: [ RUN      ] serial.view_alloc_exec_space_int
2: [       OK ] serial.view_alloc_exec_space_int (0 ms)
2: [ RUN      ] serial.deep_copy_zero_memset
2: [       OK ] serial.deep_copy_zero_memset (0 ms)
2: [ RUN      ] serial.view_subview_assign_strided
2: [       OK ] serial.view_subview_assign_strided (0 ms)
2: [ RUN      ] serial.view_subview_left_0
2: [       OK ] serial.view_subview_left_0 (0 ms)
2: [ RUN      ] serial.view_subview_left_1
2: [       OK ] serial.view_subview_left_1 (0 ms)
2: [ RUN      ] serial.view_subview_left_2
2: [       OK ] serial.view_subview_left_2 (0 ms)
2: [ RUN      ] serial.view_subview_left_3
2: [       OK ] serial.view_subview_left_3 (0 ms)
2: [ RUN      ] serial.view_subview_right_0
2: [       OK ] serial.view_subview_right_0 (0 ms)
2: [ RUN      ] serial.view_subview_right_1
2: [       OK ] serial.view_subview_right_1 (0 ms)
2: [ RUN      ] serial.view_subview_right_3
2: [       OK ] serial.view_subview_right_3 (0 ms)
2: [ RUN      ] serial.view_static_tests
2: [       OK ] serial.view_static_tests (0 ms)
2: [ RUN      ] serial.view_subview_layoutleft_to_layoutleft
2: [       OK ] serial.view_subview_layoutleft_to_layoutleft (0 ms)
2: [ RUN      ] serial.view_subview_layoutright_to_layoutright
2: [       OK ] serial.view_subview_layoutright_to_layoutright (0 ms)
2: [ RUN      ] serial.view_subview_1d_assign
2: [       OK ] serial.view_subview_1d_assign (0 ms)
2: [ RUN      ] serial.view_subview_1d_assign_atomic
2: [       OK ] serial.view_subview_1d_assign_atomic (0 ms)
2: [ RUN      ] serial.view_subview_1d_assign_randomaccess
2: [       OK ] serial.view_subview_1d_assign_randomaccess (0 ms)
2: [ RUN      ] serial.view_subview_2d_from_3d
2: [       OK ] serial.view_subview_2d_from_3d (16 ms)
2: [ RUN      ] serial.view_subview_2d_from_3d_atomic
2: [       OK ] serial.view_subview_2d_from_3d_atomic (17 ms)
2: [ RUN      ] serial.view_subview_2d_from_3d_randomaccess
2: [       OK ] serial.view_subview_2d_from_3d_randomaccess (17 ms)
2: [ RUN      ] serial.view_subview_3d_from_5d_left
2: [       OK ] serial.view_subview_3d_from_5d_left (600 ms)
2: [ RUN      ] serial.view_subview_3d_from_5d_left_atomic
2: [       OK ] serial.view_subview_3d_from_5d_left_atomic (602 ms)
2: [ RUN      ] serial.view_subview_3d_from_5d_left_randomaccess
2: [       OK ] serial.view_subview_3d_from_5d_left_randomaccess (606 ms)
2: [ RUN      ] serial.view_subview_3d_from_5d_right
2: [       OK ] serial.view_subview_3d_from_5d_right (593 ms)
2: [ RUN      ] serial.view_subview_3d_from_5d_right_atomic
2: [       OK ] serial.view_subview_3d_from_5d_right_atomic (587 ms)
2: [ RUN      ] serial.view_subview_3d_from_5d_right_randomaccess
2: [       OK ] serial.view_subview_3d_from_5d_right_randomaccess (583 ms)
2: [ RUN      ] serial.view_test_unmanaged_subview_reset
2: [       OK ] serial.view_test_unmanaged_subview_reset (0 ms)
2: [ RUN      ] serial.view_subview_memory_traits_construction
2: [       OK ] serial.view_subview_memory_traits_construction (0 ms)
2: [----------] 91 tests from serial (13844 ms total)
2: 
2: [----------] Global test environment tear-down
2: [==========] 97 tests from 2 test suites ran. (19333 ms total)
2: [  PASSED  ] 95 tests.
2: [  SKIPPED ] 2 tests, listed below:
2: [  SKIPPED ] serial_DeathTest.view_memory_access_violations_from_host
2: [  SKIPPED ] serial_DeathTest.view_memory_access_violations_from_device
 2/59 Test  #2: KokkosCore_UnitTest_Serial2 ...................   Passed   20.38 sec
test 3
      Start  3: KokkosCore_UnitTest_SerialGraph

3: Test command: /var/jenkins/workspace/Kokkos/build/core/unit_test/KokkosCore_UnitTest_SerialGraph
3: Test timeout computed to be: 1500
3: [==========] Running 5 tests from 1 test suite.
3: [----------] Global test environment set-up.
3: [----------] 5 tests from serial_count_bugs
3: [ RUN      ] serial_count_bugs.launch_one
3: [       OK ] serial_count_bugs.launch_one (0 ms)
3: [ RUN      ] serial_count_bugs.launch_one_rvalue
3: [       OK ] serial_count_bugs.launch_one_rvalue (0 ms)
3: [ RUN      ] serial_count_bugs.launch_six
3: [       OK ] serial_count_bugs.launch_six (0 ms)
3: [ RUN      ] serial_count_bugs.when_all_cycle
3: [       OK ] serial_count_bugs.when_all_cycle (0 ms)
3: [ RUN      ] serial_count_bugs.zero_work_reduce
3: [       OK ] serial_count_bugs.zero_work_reduce (0 ms)
3: [----------] 5 tests from serial_count_bugs (0 ms total)
3: 
3: [----------] Global test environment tear-down
3: [==========] 5 tests from 1 test suite ran. (0 ms total)
3: [  PASSED  ] 5 tests.
3: 
3:   YOU HAVE 1 DISABLED TEST
3: 
 3/59 Test  #3: KokkosCore_UnitTest_SerialGraph ...............   Passed    0.01 sec
test 4
      Start  4: KokkosCore_UnitTest_SYCL1A

4: Test command: /var/jenkins/workspace/Kokkos/build/core/unit_test/KokkosCore_UnitTest_SYCL1A
4: Test timeout computed to be: 1500
4: [==========] Running 92 tests from 2 test suites.
4: [----------] Global test environment set-up.
4: [----------] 1 test from sycl_DeathTest
4: [ RUN      ] sycl_DeathTest.policy_bounds_unsafe_narrowing_conversions
4: [       OK ] sycl_DeathTest.policy_bounds_unsafe_narrowing_conversions (345 ms)
4: [----------] 1 test from sycl_DeathTest (345 ms total)
4: 
4: [----------] 91 tests from sycl
4: [ RUN      ] sycl.atomic_operations_int
4: [       OK ] sycl.atomic_operations_int (33 ms)
4: [ RUN      ] sycl.atomic_operations_unsigned
4: [       OK ] sycl.atomic_operations_unsigned (35 ms)
4: [ RUN      ] sycl.atomic_operations_long
4: [       OK ] sycl.atomic_operations_long (30 ms)
4: [ RUN      ] sycl.atomic_operations_unsignedlong
4: [       OK ] sycl.atomic_operations_unsignedlong (36 ms)
4: [ RUN      ] sycl.atomic_operations_longlong
4: [       OK ] sycl.atomic_operations_longlong (31 ms)
4: [ RUN      ] sycl.atomic_operations_double
4: [       OK ] sycl.atomic_operations_double (12 ms)
4: [ RUN      ] sycl.atomic_operations_float
4: [       OK ] sycl.atomic_operations_float (12 ms)
4: [ RUN      ] sycl.atomic_operations_complexfloat
4: [       OK ] sycl.atomic_operations_complexfloat (8 ms)
4: [ RUN      ] sycl.atomic_views_integral
4: [       OK ] sycl.atomic_views_integral (13460 ms)
4: [ RUN      ] sycl.atomic_views_nonintegral
4: [       OK ] sycl.atomic_views_nonintegral (31067 ms)
4: [ RUN      ] sycl.atomic_view_api
4: [       OK ] sycl.atomic_view_api (1 ms)
4: [ RUN      ] sycl.atomics
4: [       OK ] sycl.atomics (261 ms)
4: [ RUN      ] sycl.test_block_deduction_bug_pr_3103
4: [       OK ] sycl.test_block_deduction_bug_pr_3103 (7 ms)
4: [ RUN      ] sycl.complex_construction
4: [       OK ] sycl.complex_construction (1 ms)
4: [ RUN      ] sycl.complex_basic_math
4: [       OK ] sycl.complex_basic_math (0 ms)
4: [ RUN      ] sycl.complex_special_funtions
4: [       OK ] sycl.complex_special_funtions (2 ms)
4: [ RUN      ] sycl.complex_io
4: [       OK ] sycl.complex_io (0 ms)
4: [ RUN      ] sycl.complex_trivially_copyable
4: [       OK ] sycl.complex_trivially_copyable (0 ms)
4: [ RUN      ] sycl.complex_issue_3865
4: [       OK ] sycl.complex_issue_3865 (1 ms)
4: [ RUN      ] sycl.complex_operations_arithmetic_types_overloads
4: [       OK ] sycl.complex_operations_arithmetic_types_overloads (0 ms)
4: [ RUN      ] sycl.crs_count_fill
4: [       OK ] sycl.crs_count_fill (9 ms)
4: [ RUN      ] sycl.crs_copy_constructor
4: [       OK ] sycl.crs_copy_constructor (22 ms)
4: [ RUN      ] sycl.deep_copy_alignment
4: [       OK ] sycl.deep_copy_alignment (13 ms)
4: [ RUN      ] sycl.deep_copy_conversion
4: [       OK ] sycl.deep_copy_conversion (46 ms)
4: [ RUN      ] sycl.execution_space_as_class_data_member
4: [       OK ] sycl.execution_space_as_class_data_member (0 ms)
4: [ RUN      ] sycl.functor_analysis
4: [       OK ] sycl.functor_analysis (0 ms)
4: [ RUN      ] sycl.init
4: [       OK ] sycl.init (0 ms)
4: [ RUN      ] sycl.dispatch
4: [       OK ] sycl.dispatch (246 ms)
4: [ RUN      ] sycl.compiler_macros
4: [       OK ] sycl.compiler_macros (0 ms)
4: [ RUN      ] sycl.policy_construction
4: [       OK ] sycl.policy_construction (0 ms)
4: [ RUN      ] sycl.policy_converting_constructor_from_other_policy
4: [       OK ] sycl.policy_converting_constructor_from_other_policy (0 ms)
4: [ RUN      ] sycl.desired_occupancy_prefer
4: [       OK ] sycl.desired_occupancy_prefer (0 ms)
4: [ RUN      ] sycl.desired_occupancy_empty_base_optimization
4: [       OK ] sycl.desired_occupancy_empty_base_optimization (0 ms)
4: [ RUN      ] sycl.desired_occupancy_converting_constructors
4: [       OK ] sycl.desired_occupancy_converting_constructors (0 ms)
4: [ RUN      ] sycl.md_range_policy_construction_from_arrays
4: [       OK ] sycl.md_range_policy_construction_from_arrays (0 ms)
4: [ RUN      ] sycl.policy_set_worktag
4: [       OK ] sycl.policy_set_worktag (0 ms)
4: [ RUN      ] sycl.join_backward_compatibility
4: [       OK ] sycl.join_backward_compatibility (2 ms)
4: [ RUN      ] sycl.local_deepcopy_teampolicy_layoutleft
4: [       OK ] sycl.local_deepcopy_teampolicy_layoutleft (5104 ms)
4: [ RUN      ] sycl.local_deepcopy_rangepolicy_layoutleft
4: [       OK ] sycl.local_deepcopy_rangepolicy_layoutleft (5566 ms)
4: [ RUN      ] sycl.local_deepcopy_teampolicy_layoutright
4: [       OK ] sycl.local_deepcopy_teampolicy_layoutright (4461 ms)
4: [ RUN      ] sycl.local_deepcopy_rangepolicy_layoutright
4: [       OK ] sycl.local_deepcopy_rangepolicy_layoutright (4769 ms)
4: [ RUN      ] sycl.deep_copy_scratch
4: [       OK ] sycl.deep_copy_scratch (15 ms)
4: [ RUN      ] sycl.max
4: [       OK ] sycl.max (0 ms)
4: [ RUN      ] sycl.max_within_parfor
4: [       OK ] sycl.max_within_parfor (0 ms)
4: [ RUN      ] sycl.min
4: [       OK ] sycl.min (0 ms)
4: [ RUN      ] sycl.min_within_parfor
4: [       OK ] sycl.min_within_parfor (0 ms)
4: [ RUN      ] sycl.minmax
4: [       OK ] sycl.minmax (0 ms)
4: [ RUN      ] sycl.minmax_within_parfor
4: [       OK ] sycl.minmax_within_parfor (0 ms)
4: [ RUN      ] sycl.clamp
4: [       OK ] sycl.clamp (0 ms)
4: [ RUN      ] sycl.clamp_within_parfor
4: [       OK ] sycl.clamp_within_parfor (0 ms)
4: [ RUN      ] sycl.mathematical_constants_e
4: [       OK ] sycl.mathematical_constants_e (1 ms)
4: [ RUN      ] sycl.mathematical_constants_log2e
4: [       OK ] sycl.mathematical_constants_log2e (1 ms)
4: [ RUN      ] sycl.mathematical_constants_log10e
4: [       OK ] sycl.mathematical_constants_log10e (1 ms)
4: [ RUN      ] sycl.mathematical_constants_pi
4: [       OK ] sycl.mathematical_constants_pi (1 ms)
4: [ RUN      ] sycl.mathematical_constants_inv_pi
4: [       OK ] sycl.mathematical_constants_inv_pi (1 ms)
4: [ RUN      ] sycl.mathematical_constants_inv_sqrtpi
4: [       OK ] sycl.mathematical_constants_inv_sqrtpi (1 ms)
4: [ RUN      ] sycl.mathematical_constants_ln2
4: [       OK ] sycl.mathematical_constants_ln2 (1 ms)
4: [ RUN      ] sycl.mathematical_constants_ln10
4: [       OK ] sycl.mathematical_constants_ln10 (1 ms)
4: [ RUN      ] sycl.mathematical_constants_sqrt2
4: [       OK ] sycl.mathematical_constants_sqrt2 (1 ms)
4: [ RUN      ] sycl.mathematical_constants_sqrt3
4: [       OK ] sycl.mathematical_constants_sqrt3 (1 ms)
4: [ RUN      ] sycl.mathematical_constants_inv_sqrt3
4: [       OK ] sycl.mathematical_constants_inv_sqrt3 (1 ms)
4: [ RUN      ] sycl.mathematical_constants_egamma
4: [       OK ] sycl.mathematical_constants_egamma (1 ms)
4: [ RUN      ] sycl.mathematical_constants_phi
4: [       OK ] sycl.mathematical_constants_phi (1 ms)
4: [ RUN      ] sycl.mathematical_functions_trigonometric_functions
4: [       OK ] sycl.mathematical_functions_trigonometric_functions (60 ms)
4: [ RUN      ] sycl.mathematical_functions_power_functions
4: [       OK ] sycl.mathematical_functions_power_functions (18 ms)
4: [ RUN      ] sycl.mathematical_functions_exponential_functions
4: [       OK ] sycl.mathematical_functions_exponential_functions (62 ms)
4: [ RUN      ] sycl.mathematical_functions_hyperbolic_functions
4: [       OK ] sycl.mathematical_functions_hyperbolic_functions (50 ms)
4: [ RUN      ] sycl.mathematical_functions_error_and_gamma_functions
4: [       OK ] sycl.mathematical_functions_error_and_gamma_functions (32 ms)
4: [ RUN      ] sycl.mathematical_functions_nearest_interger_floating_point_operations
4: [       OK ] sycl.mathematical_functions_nearest_interger_floating_point_operations (29 ms)
4: [ RUN      ] sycl.mathematical_functions_floating_point_manipulation_functions
4: [       OK ] sycl.mathematical_functions_floating_point_manipulation_functions (12 ms)
4: [ RUN      ] sycl.mathematical_functions_absolute_value
4: [       OK ] sycl.mathematical_functions_absolute_value (0 ms)
4: [ RUN      ] sycl.mathematical_functions_isnan
4: [       OK ] sycl.mathematical_functions_isnan (0 ms)
4: [ RUN      ] sycl.mdrange_5d
4: [       OK ] sycl.mdrange_5d (48 ms)
4: [ RUN      ] sycl.mdrange_6d
4: [       OK ] sycl.mdrange_6d (117 ms)
4: [ RUN      ] sycl.mdrange_2d
4: [       OK ] sycl.mdrange_2d (17 ms)
4: [ RUN      ] sycl.mdrange_array_reduce
4: [       OK ] sycl.mdrange_array_reduce (3 ms)
4: [ RUN      ] sycl.host_shared_ptr_use_count
4: [       OK ] sycl.host_shared_ptr_use_count (0 ms)
4: [ RUN      ] sycl.host_shared_ptr_get
4: [       OK ] sycl.host_shared_ptr_get (0 ms)
4: [ RUN      ] sycl.host_shared_ptr_dereference_on_device
4: [       OK ] sycl.host_shared_ptr_dereference_on_device (0 ms)
4: [ RUN      ] sycl.host_shared_ptr_special_members_on_device
4: [       OK ] sycl.host_shared_ptr_special_members_on_device (0 ms)
4: [ RUN      ] sycl.host_shared_ptr_tracking
4: [       OK ] sycl.host_shared_ptr_tracking (3 ms)
4: [ RUN      ] sycl.partitioning_by_args
4: [       OK ] sycl.partitioning_by_args (1 ms)
4: [ RUN      ] sycl.partitioning_by_vector
4: [       OK ] sycl.partitioning_by_vector (0 ms)
4: [ RUN      ] sycl.mathspecialfunc_expint1
4: [       OK ] sycl.mathspecialfunc_expint1 (1 ms)
4: [ RUN      ] sycl.mathspecialfunc_errorfunc
4: [       OK ] sycl.mathspecialfunc_errorfunc (3 ms)
4: [ RUN      ] sycl.mathspecialfunc_cbesselj0y0
4: [       OK ] sycl.mathspecialfunc_cbesselj0y0 (27 ms)
4: [ RUN      ] sycl.mathspecialfunc_cbesselj1y1
4: [       OK ] sycl.mathspecialfunc_cbesselj1y1 (27 ms)
4: [ RUN      ] sycl.mathspecialfunc_cbesseli0k0
4: [       OK ] sycl.mathspecialfunc_cbesseli0k0 (3 ms)
4: [ RUN      ] sycl.mathspecialfunc_cbesseli1k1
4: [       OK ] sycl.mathspecialfunc_cbesseli1k1 (3 ms)
4: [ RUN      ] sycl.mathspecialfunc_cbesselh1stkind
4: [       OK ] sycl.mathspecialfunc_cbesselh1stkind (3 ms)
4: [ RUN      ] sycl.mathspecialfunc_cbesselh2ndkind
4: [       OK ] sycl.mathspecialfunc_cbesselh2ndkind (3 ms)
4: [----------] 91 tests from sycl (65829 ms total)
4: 
4: [----------] Global test environment tear-down
4: [==========] 92 tests from 2 test suites ran. (66175 ms total)
4: [  PASSED  ] 92 tests.
 4/59 Test  #4: KokkosCore_UnitTest_SYCL1A ....................   Passed   67.33 sec
test 5
      Start  5: KokkosCore_UnitTest_SYCL1B

5: Test command: /var/jenkins/workspace/Kokkos/build/core/unit_test/KokkosCore_UnitTest_SYCL1B
5: Test timeout computed to be: 1500
5: [==========] Running 53 tests from 1 test suite.
5: [----------] Global test environment set-up.
5: [----------] 53 tests from sycl
5: [ RUN      ] sycl.mdrange_3d
5: [       OK ] sycl.mdrange_3d (27 ms)
5: [ RUN      ] sycl.mdrange_neg_idx
5: [       OK ] sycl.mdrange_neg_idx (8 ms)
5: [ RUN      ] sycl.mdrange_4d
5: [       OK ] sycl.mdrange_4d (19 ms)
5: [ RUN      ] sycl.mdrange_scalar
5: [       OK ] sycl.mdrange_scalar (0 ms)
5: [ RUN      ] sycl.mdrange_large_deep_copy
5: [       OK ] sycl.mdrange_large_deep_copy (19 ms)
5: [ RUN      ] sycl.numeric_traits_infinity
5: [       OK ] sycl.numeric_traits_infinity (1 ms)
5: [ RUN      ] sycl.numeric_traits_epsilon
5: [       OK ] sycl.numeric_traits_epsilon (1 ms)
5: [ RUN      ] sycl.numeric_traits_round_error
5: [       OK ] sycl.numeric_traits_round_error (1 ms)
5: [ RUN      ] sycl.numeric_traits_norm_min
5: [       OK ] sycl.numeric_traits_norm_min (1 ms)
5: [ RUN      ] sycl.numeric_traits_denorm_min
5: [       OK ] sycl.numeric_traits_denorm_min (1 ms)
5: [ RUN      ] sycl.numeric_traits_reciprocal_overflow_threshold
5: [       OK ] sycl.numeric_traits_reciprocal_overflow_threshold (1 ms)
5: [ RUN      ] sycl.numeric_traits_finite_min_max
5: [       OK ] sycl.numeric_traits_finite_min_max (13 ms)
5: [ RUN      ] sycl.numeric_traits_digits
5: [       OK ] sycl.numeric_traits_digits (6 ms)
5: [ RUN      ] sycl.numeric_traits_digits10
5: [       OK ] sycl.numeric_traits_digits10 (6 ms)
5: [ RUN      ] sycl.numeric_traits_max_digits10
5: [       OK ] sycl.numeric_traits_max_digits10 (1 ms)
5: [ RUN      ] sycl.numeric_traits_radix
5: [       OK ] sycl.numeric_traits_radix (7 ms)
5: [ RUN      ] sycl.numeric_traits_min_max_exponent
5: [       OK ] sycl.numeric_traits_min_max_exponent (2 ms)
5: [ RUN      ] sycl.numeric_traits_min_max_exponent10
5: [       OK ] sycl.numeric_traits_min_max_exponent10 (2 ms)
5: [ RUN      ] sycl.numeric_traits_quiet_and_signaling_nan
5: [       OK ] sycl.numeric_traits_quiet_and_signaling_nan (2 ms)
5: [ RUN      ] sycl.numeric_traits_sfinae_friendly
5: [       OK ] sycl.numeric_traits_sfinae_friendly (0 ms)
5: [ RUN      ] sycl.view_aggregate
5: [       OK ] sycl.view_aggregate (0 ms)
5: [ RUN      ] sycl.memory_pool
5: [       OK ] sycl.memory_pool (70 ms)
5: [ RUN      ] sycl.cxx11
5: [       OK ] sycl.cxx11 (15 ms)
5: [ RUN      ] sycl.view_layouttiled
5: [       OK ] sycl.view_layouttiled (8 ms)
5: [ RUN      ] sycl.view_layouttiled_subtile
5: [       OK ] sycl.view_layouttiled_subtile (0 ms)
5: [ RUN      ] sycl.range_for
5: [       OK ] sycl.range_for (6 ms)
5: [ RUN      ] sycl.range_reduce
5: [       OK ] sycl.range_reduce (6 ms)
5: [ RUN      ] sycl.range_scan
5: [       OK ] sycl.range_scan (5 ms)
5: [ RUN      ] sycl.range_for_require
5: [       OK ] sycl.range_for_require (6 ms)
5: [ RUN      ] sycl.range_reduce_require
5: [       OK ] sycl.range_reduce_require (4 ms)
5: [ RUN      ] sycl.range_scan_require
5: [       OK ] sycl.range_scan_require (5 ms)
5: [ RUN      ] sycl.int_combined_reduce
5: [       OK ] sycl.int_combined_reduce (0 ms)
5: [ RUN      ] sycl.mdrange_combined_reduce
5: [       OK ] sycl.mdrange_combined_reduce (1 ms)
5: [ RUN      ] sycl.int_combined_reduce_mixed
5: [       OK ] sycl.int_combined_reduce_mixed (1 ms)
5: [ RUN      ] sycl.reduction_deduction
5: [       OK ] sycl.reduction_deduction (8 ms)
5: [ RUN      ] sycl.reducers_int
5: [       OK ] sycl.reducers_int (20 ms)
5: [ RUN      ] sycl.reducers_size_t
5: [       OK ] sycl.reducers_size_t (22 ms)
5: [ RUN      ] sycl.reducers_double
5: [       OK ] sycl.reducers_double (15 ms)
5: [ RUN      ] sycl.reducers_complex_double
5: [       OK ] sycl.reducers_complex_double (7 ms)
5: [ RUN      ] sycl.reducers_struct
5: [       OK ] sycl.reducers_struct (22 ms)
5: [ RUN      ] sycl.reducers_half_t
5: [       OK ] sycl.reducers_half_t (14 ms)
5: [ RUN      ] sycl.reducers_bhalf_t
5: [       OK ] sycl.reducers_bhalf_t (16 ms)
5: [ RUN      ] sycl.reducers_int8_t
5: [       OK ] sycl.reducers_int8_t (12 ms)
5: [ RUN      ] sycl.reducers_point_t
5: [       OK ] sycl.reducers_point_t (7 ms)
5: [ RUN      ] sycl.reducers_bool
5: [       OK ] sycl.reducers_bool (2 ms)
5: [ RUN      ] sycl.reduce_device_view_range_policy
5: [       OK ] sycl.reduce_device_view_range_policy (13453 ms)
5: [ RUN      ] sycl.reduce_device_view_mdrange_policy
5: [       OK ] sycl.reduce_device_view_mdrange_policy (14135 ms)
5: [ RUN      ] sycl.reduce_device_view_team_policy
5: [       OK ] sycl.reduce_device_view_team_policy (13467 ms)
5: [ RUN      ] sycl.scan
5: [       OK ] sycl.scan (1021 ms)
5: [ RUN      ] sycl.impl_shared_alloc
5: [       OK ] sycl.impl_shared_alloc (179 ms)
5: [ RUN      ] sycl.view_mapping
5: [       OK ] sycl.view_mapping (43 ms)
5: [ RUN      ] sycl.view_mapping_operator
5: [       OK ] sycl.view_mapping_operator (16 ms)
5: [ RUN      ] sycl.static_extent
5: [       OK ] sycl.static_extent (0 ms)
5: [----------] 53 tests from sycl (42725 ms total)
5: 
5: [----------] Global test environment tear-down
5: [==========] 53 tests from 1 test suite ran. (42725 ms total)
5: [  PASSED  ] 53 tests.
 5/59 Test  #5: KokkosCore_UnitTest_SYCL1B ....................   Passed   43.83 sec
test 6
      Start  6: KokkosCore_UnitTest_SYCL2A

6: Test command: /var/jenkins/workspace/Kokkos/build/core/unit_test/KokkosCore_UnitTest_SYCL2A
6: Test timeout computed to be: 1500
6: [==========] Running 71 tests from 2 test suites.
6: [----------] Global test environment set-up.
6: [----------] 6 tests from sycl_DeathTest
6: [ RUN      ] sycl_DeathTest.abort_from_host
6: [       OK ] sycl_DeathTest.abort_from_host (326 ms)
6: [ RUN      ] sycl_DeathTest.abort_from_device
6: [       OK ] sycl_DeathTest.abort_from_device (10 ms)
6: [ RUN      ] sycl_DeathTest.view_layoutstride_right_to_layoutleft_assignment
6: [       OK ] sycl_DeathTest.view_layoutstride_right_to_layoutleft_assignment (2267 ms)
6: [ RUN      ] sycl_DeathTest.view_layoutstride_left_to_layoutright_assignment
6: [       OK ] sycl_DeathTest.view_layoutstride_left_to_layoutright_assignment (2316 ms)
6: [ RUN      ] sycl_DeathTest.view_memory_access_violations_from_host
6: [       OK ] sycl_DeathTest.view_memory_access_violations_from_host (5843 ms)
6: [ RUN      ] sycl_DeathTest.view_memory_access_violations_from_device
6: /var/jenkins/workspace/Kokkos/core/unit_test/TestViewMemoryAccessViolation.hpp:205: Skipped
6: skipping SYCL device-side abort does not work when NDEBUG is defined
6: [  SKIPPED ] sycl_DeathTest.view_memory_access_violations_from_device (0 ms)
6: [----------] 6 tests from sycl_DeathTest (10764 ms total)
6: 
6: [----------] 65 tests from sycl
6: [ RUN      ] sycl.team_for
6: [       OK ] sycl.team_for (17 ms)
6: [ RUN      ] sycl.team_reduce
6: [       OK ] sycl.team_reduce (11 ms)
6: [ RUN      ] sycl.team_reduce_large
6: [       OK ] sycl.team_reduce_large (3151 ms)
6: [ RUN      ] sycl.large_team_scratch_size
6: Aborting with message Couldn't allocate required size!
6: .
6: [       OK ] sycl.large_team_scratch_size (8 ms)
6: [ RUN      ] sycl.team_broadcast_long
6: [       OK ] sycl.team_broadcast_long (11 ms)
6: [ RUN      ] sycl.team_broadcast_long_wrapper
6: [       OK ] sycl.team_broadcast_long_wrapper (12 ms)
6: [ RUN      ] sycl.team_broadcast_char
6: [       OK ] sycl.team_broadcast_char (11 ms)
6: [ RUN      ] sycl.team_broadcast_float
6: [       OK ] sycl.team_broadcast_float (11 ms)
6: [ RUN      ] sycl.team_broadcast_double
6: [       OK ] sycl.team_broadcast_double (12 ms)
6: [ RUN      ] sycl.team_handle_by_value
6: [       OK ] sycl.team_handle_by_value (2 ms)
6: [ RUN      ] sycl.team_vector
6: [       OK ] sycl.team_vector (213 ms)
6: [ RUN      ] sycl.triple_nested_parallelism
6: [       OK ] sycl.triple_nested_parallelism (10 ms)
6: [ RUN      ] sycl.parallel_scan_with_reducers
6: [       OK ] sycl.parallel_scan_with_reducers (174 ms)
6: [ RUN      ] sycl.team_reduction_scan
6: [       OK ] sycl.team_reduction_scan (3815 ms)
6: [ RUN      ] sycl.team_long_reduce
6: [       OK ] sycl.team_long_reduce (86 ms)
6: [ RUN      ] sycl.team_double_reduce
6: [       OK ] sycl.team_double_reduce (86 ms)
6: [ RUN      ] sycl.team_parallel_dummy_with_reducer_and_scratch_space
6: [       OK ] sycl.team_parallel_dummy_with_reducer_and_scratch_space (2 ms)
6: [ RUN      ] sycl.team_scan
6: [       OK ] sycl.team_scan (886 ms)
6: [ RUN      ] sycl.team_shared_request
6: [       OK ] sycl.team_shared_request (5 ms)
6: [ RUN      ] sycl.team_scratch_request
6: [       OK ] sycl.team_scratch_request (10 ms)
6: [ RUN      ] sycl.team_lambda_shared_request
6: [       OK ] sycl.team_lambda_shared_request (5 ms)
6: [ RUN      ] sycl.scratch_align
6: [       OK ] sycl.scratch_align (1 ms)
6: [ RUN      ] sycl.shmem_size
6: [       OK ] sycl.shmem_size (0 ms)
6: [ RUN      ] sycl.multi_level_scratch
6: [       OK ] sycl.multi_level_scratch (37 ms)
6: [ RUN      ] sycl.team_policy_max_recommended
6: [       OK ] sycl.team_policy_max_recommended (94 ms)
6: [ RUN      ] sycl.team_policy_minmax_scalar_without_plus_equal_k
6: [       OK ] sycl.team_policy_minmax_scalar_without_plus_equal_k (1 ms)
6: [ RUN      ] sycl.team_teamvector_range
6: [       OK ] sycl.team_teamvector_range (34 ms)
6: [ RUN      ] sycl.unique_token_global
6: [       OK ] sycl.unique_token_global (3 ms)
6: [ RUN      ] sycl.unique_token_instance
6: [       OK ] sycl.unique_token_instance (3 ms)
6: [ RUN      ] sycl.unique_token_team_acquire
6: [       OK ] sycl.unique_token_team_acquire (3 ms)
6: [ RUN      ] sycl.view_api_a
6: [       OK ] sycl.view_api_a (12 ms)
6: [ RUN      ] sycl.view_api_b
6: [       OK ] sycl.view_api_b (9 ms)
6: [ RUN      ] sycl.view_api_c
6: [       OK ] sycl.view_api_c (0 ms)
6: [ RUN      ] sycl.view_api_d
6: [       OK ] sycl.view_api_d (2 ms)
6: [ RUN      ] sycl.view_allocation_error
6: 
6: PI CUDA ERROR:
6: 	Value:           2
6: 	Name:            CUDA_ERROR_OUT_OF_MEMORY
6: 	Description:     out of memory
6: 	Function:        cuda_piextUSMDeviceAlloc
6: 	Source Location: /scratch/llvm/sycl/plugins/cuda/pi_cuda.cpp:4521
6: 
6: [       OK ] sycl.view_allocation_error (0 ms)
6: [ RUN      ] sycl.view_remap
6: [       OK ] sycl.view_remap (0 ms)
6: [ RUN      ] sycl.view_mirror_nonconst
6: [       OK ] sycl.view_mirror_nonconst (0 ms)
6: [ RUN      ] sycl.view_stride_method
6: [       OK ] sycl.view_stride_method (0 ms)
6: [ RUN      ] sycl.anonymous_space
6: [       OK ] sycl.anonymous_space (0 ms)
6: [ RUN      ] sycl.view_overload_resolution
6: [       OK ] sycl.view_overload_resolution (0 ms)
6: [ RUN      ] sycl.view_allocation_large_rank
6: [       OK ] sycl.view_allocation_large_rank (15 ms)
6: [ RUN      ] sycl.view_shmem_size_on_device
6: [       OK ] sycl.view_shmem_size_on_device (0 ms)
6: [ RUN      ] sycl.view_is_assignable
6: [       OK ] sycl.view_is_assignable (1 ms)
6: [ RUN      ] sycl.view_copy_tests
6: [       OK ] sycl.view_copy_tests (18 ms)
6: [ RUN      ] sycl.view_copy_tests_rank_0
6: [       OK ] sycl.view_copy_tests_rank_0 (3 ms)
6: [ RUN      ] sycl.view_copy_degenerated
6: [       OK ] sycl.view_copy_degenerated (0 ms)
6: [ RUN      ] sycl.view_hooks
6: [       OK ] sycl.view_hooks (0 ms)
6: [ RUN      ] sycl.view_layoutstride_left_to_layoutleft_assignment
6: [       OK ] sycl.view_layoutstride_left_to_layoutleft_assignment (119 ms)
6: [ RUN      ] sycl.view_layoutstride_right_to_layoutright_assignment
6: [       OK ] sycl.view_layoutstride_right_to_layoutright_assignment (113 ms)
6: [ RUN      ] sycl.view_irregular_layout
6: [       OK ] sycl.view_irregular_layout (1 ms)
6: [ RUN      ] sycl.view_mapping_atomic
6: [       OK ] sycl.view_mapping_atomic (2 ms)
6: [ RUN      ] sycl.view_mapping_class_value
6: [       OK ] sycl.view_mapping_class_value (0 ms)
6: [ RUN      ] sycl.view_mapping_assignable
6: [       OK ] sycl.view_mapping_assignable (0 ms)
6: [ RUN      ] sycl.view_mapping_trivially_copyable
6: [       OK ] sycl.view_mapping_trivially_copyable (0 ms)
6: [ RUN      ] sycl.view_mapping_subview
6: [       OK ] sycl.view_mapping_subview (2 ms)
6: [ RUN      ] sycl.view_nested_view
6: [       OK ] sycl.view_nested_view (1 ms)
6: [ RUN      ] sycl.view_resize
6: [       OK ] sycl.view_resize (50 ms)
6: [ RUN      ] sycl.view_realloc
6: [       OK ] sycl.view_realloc (2 ms)
6: [ RUN      ] sycl.resize_realloc_no_init
6: [       OK ] sycl.resize_realloc_no_init (0 ms)
6: [ RUN      ] sycl.resize_realloc_no_alloc
6: [       OK ] sycl.resize_realloc_no_alloc (0 ms)
6: [ RUN      ] sycl.view_alloc
6: [       OK ] sycl.view_alloc (0 ms)
6: [ RUN      ] sycl.view_alloc_exec_space
6: [       OK ] sycl.view_alloc_exec_space (0 ms)
6: [ RUN      ] sycl.view_alloc_int
6: [       OK ] sycl.view_alloc_int (0 ms)
6: [ RUN      ] sycl.view_alloc_exec_space_int
6: [       OK ] sycl.view_alloc_exec_space_int (0 ms)
6: [ RUN      ] sycl.deep_copy_zero_memset
6: [       OK ] sycl.deep_copy_zero_memset (0 ms)
6: [----------] 65 tests from sycl (9095 ms total)
6: 
6: [----------] Global test environment tear-down
6: [==========] 71 tests from 2 test suites ran. (19860 ms total)
6: [  PASSED  ] 70 tests.
6: [  SKIPPED ] 1 test, listed below:
6: [  SKIPPED ] sycl_DeathTest.view_memory_access_violations_from_device
 6/59 Test  #6: KokkosCore_UnitTest_SYCL2A ....................   Passed   21.06 sec
test 7
      Start  7: KokkosCore_UnitTest_SYCL2B

7: Test command: /var/jenkins/workspace/Kokkos/build/core/unit_test/KokkosCore_UnitTest_SYCL2B
7: Test timeout computed to be: 1500
7: [==========] Running 16 tests from 1 test suite.
7: [----------] Global test environment set-up.
7: [----------] 16 tests from sycl_shared_usm
7: [ RUN      ] sycl_shared_usm.view_subview_assign_strided
7: [       OK ] sycl_shared_usm.view_subview_assign_strided (6 ms)
7: [ RUN      ] sycl_shared_usm.view_subview_left_0
7: [       OK ] sycl_shared_usm.view_subview_left_0 (1 ms)
7: [ RUN      ] sycl_shared_usm.view_subview_left_1
7: [       OK ] sycl_shared_usm.view_subview_left_1 (1 ms)
7: [ RUN      ] sycl_shared_usm.view_subview_left_2
7: [       OK ] sycl_shared_usm.view_subview_left_2 (0 ms)
7: [ RUN      ] sycl_shared_usm.view_subview_left_3
7: [       OK ] sycl_shared_usm.view_subview_left_3 (0 ms)
7: [ RUN      ] sycl_shared_usm.view_subview_right_0
7: [       OK ] sycl_shared_usm.view_subview_right_0 (0 ms)
7: [ RUN      ] sycl_shared_usm.view_subview_right_1
7: [       OK ] sycl_shared_usm.view_subview_right_1 (0 ms)
7: [ RUN      ] sycl_shared_usm.view_subview_right_3
7: [       OK ] sycl_shared_usm.view_subview_right_3 (0 ms)
7: [ RUN      ] sycl_shared_usm.view_static_tests
7: [       OK ] sycl_shared_usm.view_static_tests (1 ms)
7: [ RUN      ] sycl_shared_usm.view_subview_layoutleft_to_layoutleft
7: [       OK ] sycl_shared_usm.view_subview_layoutleft_to_layoutleft (9 ms)
7: [ RUN      ] sycl_shared_usm.view_subview_layoutright_to_layoutright
7: [       OK ] sycl_shared_usm.view_subview_layoutright_to_layoutright (6 ms)
7: [ RUN      ] sycl_shared_usm.view_subview_1d_assign
7: [       OK ] sycl_shared_usm.view_subview_1d_assign (11 ms)
7: [ RUN      ] sycl_shared_usm.view_subview_1d_assign_atomic
7: [       OK ] sycl_shared_usm.view_subview_1d_assign_atomic (11 ms)
7: [ RUN      ] sycl_shared_usm.view_subview_1d_assign_randomaccess
7: [       OK ] sycl_shared_usm.view_subview_1d_assign_randomaccess (11 ms)
7: [ RUN      ] sycl_shared_usm.view_subview_2d_from_3d
7: [       OK ] sycl_shared_usm.view_subview_2d_from_3d (159 ms)
7: [ RUN      ] sycl_shared_usm.view_subview_2d_from_3d_atomic
7: [       OK ] sycl_shared_usm.view_subview_2d_from_3d_atomic (167 ms)
7: [----------] 16 tests from sycl_shared_usm (392 ms total)
7: 
7: [----------] Global test environment tear-down
7: [==========] 16 tests from 1 test suite ran. (392 ms total)
7: [  PASSED  ] 16 tests.
 7/59 Test  #7: KokkosCore_UnitTest_SYCL2B ....................   Passed    1.46 sec
test 8
      Start  8: KokkosCore_UnitTest_SYCL2C

8: Test command: /var/jenkins/workspace/Kokkos/build/core/unit_test/KokkosCore_UnitTest_SYCL2C
8: Test timeout computed to be: 1500
8: [==========] Running 4 tests from 1 test suite.
8: [----------] Global test environment set-up.
8: [----------] 4 tests from sycl_shared_usm
8: [ RUN      ] sycl_shared_usm.view_subview_2d_from_3d_randomaccess
8: [       OK ] sycl_shared_usm.view_subview_2d_from_3d_randomaccess (161 ms)
8: [ RUN      ] sycl_shared_usm.view_subview_3d_from_5d_left
8: [       OK ] sycl_shared_usm.view_subview_3d_from_5d_left (201 ms)
8: [ RUN      ] sycl_shared_usm.view_subview_3d_from_5d_left_atomic
8: [       OK ] sycl_shared_usm.view_subview_3d_from_5d_left_atomic (198 ms)
8: [ RUN      ] sycl_shared_usm.view_subview_3d_from_5d_left_randomaccess
8: [       OK ] sycl_shared_usm.view_subview_3d_from_5d_left_randomaccess (195 ms)
8: [----------] 4 tests from sycl_shared_usm (757 ms total)
8: 
8: [----------] Global test environment tear-down
8: [==========] 4 tests from 1 test suite ran. (757 ms total)
8: [  PASSED  ] 4 tests.
 8/59 Test  #8: KokkosCore_UnitTest_SYCL2C ....................   Passed    1.79 sec
test 9
      Start  9: KokkosCore_UnitTest_SYCL2D

9: Test command: /var/jenkins/workspace/Kokkos/build/core/unit_test/KokkosCore_UnitTest_SYCL2D
9: Test timeout computed to be: 1500
9: [==========] Running 5 tests from 1 test suite.
9: [----------] Global test environment set-up.
9: [----------] 5 tests from sycl_shared_usm
9: [ RUN      ] sycl_shared_usm.view_subview_3d_from_5d_right
9: [       OK ] sycl_shared_usm.view_subview_3d_from_5d_right (202 ms)
9: [ RUN      ] sycl_shared_usm.view_subview_3d_from_5d_right_atomic
9: [       OK ] sycl_shared_usm.view_subview_3d_from_5d_right_atomic (204 ms)
9: [ RUN      ] sycl_shared_usm.view_subview_3d_from_5d_right_randomaccess
9: [       OK ] sycl_shared_usm.view_subview_3d_from_5d_right_randomaccess (196 ms)
9: [ RUN      ] sycl_shared_usm.view_test_unmanaged_subview_reset
9: [       OK ] sycl_shared_usm.view_test_unmanaged_subview_reset (11 ms)
9: [ RUN      ] sycl_shared_usm.view_subview_memory_traits_construction
9: [       OK ] sycl_shared_usm.view_subview_memory_traits_construction (0 ms)
9: [----------] 5 tests from sycl_shared_usm (615 ms total)
9: 
9: [----------] Global test environment tear-down
9: [==========] 5 tests from 1 test suite ran. (615 ms total)
9: [  PASSED  ] 5 tests.
 9/59 Test  #9: KokkosCore_UnitTest_SYCL2D ....................   Passed    1.67 sec
test 10
      Start 10: KokkosCore_UnitTest_SYCL3

10: Test command: /var/jenkins/workspace/Kokkos/build/core/unit_test/KokkosCore_UnitTest_SYCL3
10: Test timeout computed to be: 1500
10: [==========] Running 54 tests from 3 test suites.
10: [----------] Global test environment set-up.
10: [----------] 4 tests from sycl
10: [ RUN      ] sycl.team_scratch_1_queues
10: [       OK ] sycl.team_scratch_1_queues (38412 ms)
10: [ RUN      ] sycl.space_access
10: [       OK ] sycl.space_access (0 ms)
10: [ RUN      ] sycl.uvm
10: [       OK ] sycl.uvm (1 ms)
10: [ RUN      ] sycl.impl_view_accessible
10: [       OK ] sycl.impl_view_accessible (6 ms)
10: [----------] 4 tests from sycl (38421 ms total)
10: 
10: [----------] 25 tests from sycl_host_usm
10: [ RUN      ] sycl_host_usm.impl_shared_alloc
10: [       OK ] sycl_host_usm.impl_shared_alloc (44 ms)
10: [ RUN      ] sycl_host_usm.view_api_a
10: [       OK ] sycl_host_usm.view_api_a (10 ms)
10: [ RUN      ] sycl_host_usm.view_api_b
10: [       OK ] sycl_host_usm.view_api_b (1 ms)
10: [ RUN      ] sycl_host_usm.view_api_c
10: [       OK ] sycl_host_usm.view_api_c (0 ms)
10: [ RUN      ] sycl_host_usm.view_api_d
10: [       OK ] sycl_host_usm.view_api_d (0 ms)
10: [ RUN      ] sycl_host_usm.view_allocation_error
10: 
10: PI CUDA ERROR:
10: 	Value:           2
10: 	Name:            CUDA_ERROR_OUT_OF_MEMORY
10: 	Description:     out of memory
10: 	Function:        cuda_piextUSMHostAlloc
10: 	Source Location: /scratch/llvm/sycl/plugins/cuda/pi_cuda.cpp:4497
10: 
10: [       OK ] sycl_host_usm.view_allocation_error (0 ms)
10: [ RUN      ] sycl_host_usm.view_remap
10: [       OK ] sycl_host_usm.view_remap (0 ms)
10: [ RUN      ] sycl_host_usm.view_mirror_nonconst
10: [       OK ] sycl_host_usm.view_mirror_nonconst (0 ms)
10: [ RUN      ] sycl_host_usm.view_stride_method
10: [       OK ] sycl_host_usm.view_stride_method (0 ms)
10: [ RUN      ] sycl_host_usm.anonymous_space
10: [       OK ] sycl_host_usm.anonymous_space (0 ms)
10: [ RUN      ] sycl_host_usm.view_overload_resolution
10: [       OK ] sycl_host_usm.view_overload_resolution (0 ms)
10: [ RUN      ] sycl_host_usm.view_allocation_large_rank
10: [       OK ] sycl_host_usm.view_allocation_large_rank (8339 ms)
10: [ RUN      ] sycl_host_usm.view_shmem_size_on_device
10: [       OK ] sycl_host_usm.view_shmem_size_on_device (0 ms)
10: [ RUN      ] sycl_host_usm.view_is_assignable
10: [       OK ] sycl_host_usm.view_is_assignable (0 ms)
10: [ RUN      ] sycl_host_usm.view_copy_tests
10: [       OK ] sycl_host_usm.view_copy_tests (13 ms)
10: [ RUN      ] sycl_host_usm.view_copy_tests_rank_0
10: [       OK ] sycl_host_usm.view_copy_tests_rank_0 (0 ms)
10: [ RUN      ] sycl_host_usm.view_copy_degenerated
10: [       OK ] sycl_host_usm.view_copy_degenerated (0 ms)
10: [ RUN      ] sycl_host_usm.view_mapping
10: [       OK ] sycl_host_usm.view_mapping (42 ms)
10: [ RUN      ] sycl_host_usm.view_mapping_operator
10: [       OK ] sycl_host_usm.view_mapping_operator (6 ms)
10: [ RUN      ] sycl_host_usm.static_extent
10: [       OK ] sycl_host_usm.static_extent (0 ms)
10: [ RUN      ] sycl_host_usm.view_mapping_atomic
10: [       OK ] sycl_host_usm.view_mapping_atomic (1 ms)
10: [ RUN      ] sycl_host_usm.view_mapping_class_value
10: [       OK ] sycl_host_usm.view_mapping_class_value (0 ms)
10: [ RUN      ] sycl_host_usm.view_mapping_assignable
10: [       OK ] sycl_host_usm.view_mapping_assignable (0 ms)
10: [ RUN      ] sycl_host_usm.view_mapping_trivially_copyable
10: [       OK ] sycl_host_usm.view_mapping_trivially_copyable (0 ms)
10: [ RUN      ] sycl_host_usm.view_mapping_subview
10: [       OK ] sycl_host_usm.view_mapping_subview (1 ms)
10: [----------] 25 tests from sycl_host_usm (8467 ms total)
10: 
10: [----------] 25 tests from sycl_shared_usm
10: [ RUN      ] sycl_shared_usm.impl_shared_alloc
10: [       OK ] sycl_shared_usm.impl_shared_alloc (84 ms)
10: [ RUN      ] sycl_shared_usm.view_api_a
10: [       OK ] sycl_shared_usm.view_api_a (21 ms)
10: [ RUN      ] sycl_shared_usm.view_api_b
10: [       OK ] sycl_shared_usm.view_api_b (15 ms)
10: [ RUN      ] sycl_shared_usm.view_api_c
10: [       OK ] sycl_shared_usm.view_api_c (0 ms)
10: [ RUN      ] sycl_shared_usm.view_api_d
10: [       OK ] sycl_shared_usm.view_api_d (6 ms)
10: [ RUN      ] sycl_shared_usm.view_allocation_error
10: 
10: PI CUDA ERROR:
10: 	Value:           2
10: 	Name:            CUDA_ERROR_OUT_OF_MEMORY
10: 	Description:     out of memory
10: 	Function:        cuda_piextUSMSharedAlloc
10: 	Source Location: /scratch/llvm/sycl/plugins/cuda/pi_cuda.cpp:4546
10: 
10: [       OK ] sycl_shared_usm.view_allocation_error (0 ms)
10: [ RUN      ] sycl_shared_usm.view_remap
10: [       OK ] sycl_shared_usm.view_remap (1 ms)
10: [ RUN      ] sycl_shared_usm.view_mirror_nonconst
10: [       OK ] sycl_shared_usm.view_mirror_nonconst (0 ms)
10: [ RUN      ] sycl_shared_usm.view_stride_method
10: [       OK ] sycl_shared_usm.view_stride_method (0 ms)
10: [ RUN      ] sycl_shared_usm.anonymous_space
10: [       OK ] sycl_shared_usm.anonymous_space (0 ms)
10: [ RUN      ] sycl_shared_usm.view_overload_resolution
10: [       OK ] sycl_shared_usm.view_overload_resolution (0 ms)
10: [ RUN      ] sycl_shared_usm.view_allocation_large_rank
10: [       OK ] sycl_shared_usm.view_allocation_large_rank (468 ms)
10: [ RUN      ] sycl_shared_usm.view_shmem_size_on_device
10: [       OK ] sycl_shared_usm.view_shmem_size_on_device (0 ms)
10: [ RUN      ] sycl_shared_usm.view_is_assignable
10: [       OK ] sycl_shared_usm.view_is_assignable (19 ms)
10: [ RUN      ] sycl_shared_usm.view_copy_tests
10: [       OK ] sycl_shared_usm.view_copy_tests (50 ms)
10: [ RUN      ] sycl_shared_usm.view_copy_tests_rank_0
10: [       OK ] sycl_shared_usm.view_copy_tests_rank_0 (13 ms)
10: [ RUN      ] sycl_shared_usm.view_copy_degenerated
10: [       OK ] sycl_shared_usm.view_copy_degenerated (0 ms)
10: [ RUN      ] sycl_shared_usm.view_mapping
10: [       OK ] sycl_shared_usm.view_mapping (46 ms)
10: [ RUN      ] sycl_shared_usm.view_mapping_operator
10: [       OK ] sycl_shared_usm.view_mapping_operator (16 ms)
10: [ RUN      ] sycl_shared_usm.static_extent
10: [       OK ] sycl_shared_usm.static_extent (0 ms)
10: [ RUN      ] sycl_shared_usm.view_mapping_atomic
10: [       OK ] sycl_shared_usm.view_mapping_atomic (2 ms)
10: [ RUN      ] sycl_shared_usm.view_mapping_class_value
10: [       OK ] sycl_shared_usm.view_mapping_class_value (0 ms)
10: [ RUN      ] sycl_shared_usm.view_mapping_assignable
10: [       OK ] sycl_shared_usm.view_mapping_assignable (0 ms)
10: [ RUN      ] sycl_shared_usm.view_mapping_trivially_copyable
10: [       OK ] sycl_shared_usm.view_mapping_trivially_copyable (0 ms)
10: [ RUN      ] sycl_shared_usm.view_mapping_subview
10: [       OK ] sycl_shared_usm.view_mapping_subview (1 ms)
10: [----------] 25 tests from sycl_shared_usm (753 ms total)
10: 
10: [----------] Global test environment tear-down
10: [==========] 54 tests from 3 test suites ran. (47643 ms total)
10: [  PASSED  ] 54 tests.
10/59 Test #10: KokkosCore_UnitTest_SYCL3 .....................   Passed   48.70 sec
test 11
      Start 11: KokkosCore_UnitTest_SYCLInterOpInit

11: Test command: /var/jenkins/workspace/Kokkos/build/core/unit_test/KokkosCore_UnitTest_SYCLInterOpInit
11: Test timeout computed to be: 1500
11: [==========] Running 1 test from 1 test suite.
11: [----------] Global test environment set-up.
11: [----------] 1 test from sycl
11: [ RUN      ] sycl.raw_sycl_interop
11: [       OK ] sycl.raw_sycl_interop (724 ms)
11: [----------] 1 test from sycl (724 ms total)
11: 
11: [----------] Global test environment tear-down
11: [==========] 1 test from 1 test suite ran. (724 ms total)
11: [  PASSED  ] 1 test.
11/59 Test #11: KokkosCore_UnitTest_SYCLInterOpInit ...........   Passed    1.05 sec
test 12
      Start 12: KokkosCore_UnitTest_SYCLInterOpInit_Context

12: Test command: /var/jenkins/workspace/Kokkos/build/core/unit_test/KokkosCore_UnitTest_SYCLInterOpInit_Context
12: Test timeout computed to be: 1500
Cancelling nested steps due to timeout
Sending interrupt signal to process
Sending interrupt signal to process
Terminated
script returned exit code 143
Post stage
[Pipeline] sh
+ ccache --show-stats
cache directory                     /tmp/ccache
primary config                      /tmp/ccache/ccache.conf
secondary config      (readonly)    /etc/ccache.conf
stats zero time                     Sun Jun 26 14:48:55 2022
cache hit (direct)                     2
cache hit (preprocessed)               0
cache miss                           594
cache hit rate                      0.34 %
cleanups performed                     0
files in cache                      9640
cache size                           8.7 GB
max cache size                      10.0 GB
[Pipeline] }
$ docker stop --time=1 4280a048c356b1f5b2b26c1525b6c625eb8e608e3b1415f6e7fe84244a9ed858
[Pipeline] // withDockerContainer
[Pipeline] }
[Pipeline] // withEnv
[Pipeline] }
[Pipeline] // node
[Pipeline] }
[Pipeline] // stage
[Pipeline] }
Failed in branch SYCL-OneAPI
[Pipeline] // parallel
[Pipeline] }
[Pipeline] // stage
[Pipeline] }
[Pipeline] // timeout
[Pipeline] }
[Pipeline] // withEnv
[Pipeline] End of Pipeline
ERROR: script returned exit code 8
Setting status of 253f54ddea8233dd741e7bb376fcd1c7cadfd776 to FAILURE with url https://cloud.cees.ornl.gov/jenkins-ci/job/Kokkos/9194/ and message: 'Build finished. '
Using context: continuous-integration/jenkin-ci/pr
Finished: FAILURE