Console Output

Skipping 6,616 KB.. Full Log
test 15
      Start 15: KokkosCore_UnitTest_TuningBasics

15: Test command: /var/jenkins/workspace/Kokkos/build/core/unit_test/KokkosCore_UnitTest_TuningBasics
15: Test timeout computed to be: 1500
15: Set of size 10
15: 4,4
15: Expect 1, have 1
15: Expect 2, have 2
15/61 Test #15: KokkosCore_UnitTest_TuningBasics .............   Passed    0.30 sec
test 16
      Start 16: KokkosCore_UnitTest_CategoricalTuner

16: Test command: /var/jenkins/workspace/Kokkos/build/core/unit_test/KokkosCore_UnitTest_CategoricalTuner
16: Test timeout computed to be: 1500
16/61 Test #16: KokkosCore_UnitTest_CategoricalTuner .........   Passed    0.80 sec
test 17
      Start 17: KokkosCore_UnitTest_LogicalSpaces

17: Test command: /var/jenkins/workspace/Kokkos/build/core/unit_test/KokkosCore_UnitTest_LogicalSpaces
17: Test timeout computed to be: 1500
17: [==========] Running 6 tests from 2 test suites.
17: [----------] Global test environment set-up.
17: [----------] 1 test from defaultdevicetype_DeathTest
17: [ RUN      ] defaultdevicetype_DeathTest.access_forbidden
17: [       OK ] defaultdevicetype_DeathTest.access_forbidden (293 ms)
17: [----------] 1 test from defaultdevicetype_DeathTest (293 ms total)
17: 
17: [----------] 5 tests from defaultdevicetype
17: [ RUN      ] defaultdevicetype.logical_space_views
17: [       OK ] defaultdevicetype.logical_space_views (0 ms)
17: [ RUN      ] defaultdevicetype.logical_space_malloc
17: [       OK ] defaultdevicetype.logical_space_malloc (0 ms)
17: [ RUN      ] defaultdevicetype.logical_space_alloc
17: [       OK ] defaultdevicetype.logical_space_alloc (0 ms)
17: [ RUN      ] defaultdevicetype.chained_logical_spaces
17: [       OK ] defaultdevicetype.chained_logical_spaces (0 ms)
17: [ RUN      ] defaultdevicetype.access_allowed
17: [       OK ] defaultdevicetype.access_allowed (0 ms)
17: [----------] 5 tests from defaultdevicetype (0 ms total)
17: 
17: [----------] Global test environment tear-down
17: [==========] 6 tests from 2 test suites ran. (294 ms total)
17: [  PASSED  ] 6 tests.
17/61 Test #17: KokkosCore_UnitTest_LogicalSpaces ............   Passed    0.60 sec
test 18
      Start 18: KokkosCore_UnitTest_KokkosP

18: Test command: /var/jenkins/workspace/Kokkos/build/core/unit_test/KokkosCore_UnitTest_KokkosP
18: Test timeout computed to be: 1500
18: [==========] Running 26 tests from 2 test suites.
18: [----------] Global test environment set-up.
18: [----------] 25 tests from kokkosp
18: [ RUN      ] kokkosp.test_named_instance_fence
18: Ref: 33554433
18: Ref: named_instance
18: 33554433
18: named_instance
18: [       OK ] kokkosp.test_named_instance_fence (0 ms)
18: [ RUN      ] kokkosp.test_unnamed_instance_fence
18: Ref: 33554433
18: Ref: Unnamed Instance Fence
18: 33554433
18: Kokkos::Cuda::fence(): Unnamed Instance Fence
18: [       OK ] kokkosp.test_unnamed_instance_fence (0 ms)
18: [ RUN      ] kokkosp.test_named_global_fence
18: Ref: 33554432
18: Ref: test global fence
18: 0
18: test global fence
18: Miss on id
18: 33554432
18: test global fence
18: [       OK ] kokkosp.test_named_global_fence (0 ms)
18: [ RUN      ] kokkosp.test_unnamed_global_fence
18: Ref: 33554432
18: Ref: Unnamed Global Fence
18: 0
18: Kokkos::fence: Unnamed Global Fence
18: Miss on id
18: 33554432
18: Kokkos::fence: Unnamed Global Fence
18: [       OK ] kokkosp.test_unnamed_global_fence (0 ms)
18: [ RUN      ] kokkosp.test_multiple_default_instances
18: [       OK ] kokkosp.test_multiple_default_instances (0 ms)
18: [ RUN      ] kokkosp.test_id_gen
18: [       OK ] kokkosp.test_id_gen (0 ms)
18: [ RUN      ] kokkosp.test_kernel_sequence
18: Ref: 33554433
18: Ref: named_instance
18: 33554433
18: named_instance
18: Ref: 33554433
18: Ref: test_kernel
18: 33554433
18: named_instance
18: Miss on name
18: 0
18: Kokkos::Tools::invoke_kokkosp_callback: Kokkos Profile Tool Fence
18: Miss on name
18: Miss on id
18: 33554432
18: Kokkos::Tools::invoke_kokkosp_callback: Kokkos Profile Tool Fence
18: Miss on name
18: Miss on id
18: 33554433
18: test_kernel
18: [       OK ] kokkosp.test_kernel_sequence (0 ms)
18: [ RUN      ] kokkosp.test_streams
18: [       OK ] kokkosp.test_streams (0 ms)
18: [ RUN      ] kokkosp.async_deep_copy
18: [       OK ] kokkosp.async_deep_copy (0 ms)
18: [ RUN      ] kokkosp.parallel_for
18: [       OK ] kokkosp.parallel_for (0 ms)
18: [ RUN      ] kokkosp.parallel_reduce
18: [       OK ] kokkosp.parallel_reduce (0 ms)
18: [ RUN      ] kokkosp.parallel_scan
18: [       OK ] kokkosp.parallel_scan (3 ms)
18: [ RUN      ] kokkosp.regions
18: [       OK ] kokkosp.regions (0 ms)
18: [ RUN      ] kokkosp.fences
18: [       OK ] kokkosp.fences (0 ms)
18: [ RUN      ] kokkosp.raw_allocation
18: [       OK ] kokkosp.raw_allocation (0 ms)
18: [ RUN      ] kokkosp.view
18: [       OK ] kokkosp.view (0 ms)
18: [ RUN      ] kokkosp.sections
18: [       OK ] kokkosp.sections (0 ms)
18: [ RUN      ] kokkosp.metadata
18: [       OK ] kokkosp.metadata (0 ms)
18: [ RUN      ] kokkosp.profile_events
18: [       OK ] kokkosp.profile_events (0 ms)
18: [ RUN      ] kokkosp.tuning_sequence
18: [       OK ] kokkosp.tuning_sequence (0 ms)
18: [ RUN      ] kokkosp.no_init_kernel
18: [       OK ] kokkosp.no_init_kernel (0 ms)
18: [ RUN      ] kokkosp.get_events
18: [       OK ] kokkosp.get_events (0 ms)
18: [ RUN      ] kokkosp.create_mirror_no_init
18: [       OK ] kokkosp.create_mirror_no_init (0 ms)
18: [ RUN      ] kokkosp.create_mirror_no_init_view_ctor
18: [       OK ] kokkosp.create_mirror_no_init_view_ctor (0 ms)
18: [ RUN      ] kokkosp.create_mirror_view_and_copy
18: [       OK ] kokkosp.create_mirror_view_and_copy (0 ms)
18: [----------] 25 tests from kokkosp (6 ms total)
18: 
18: [----------] 1 test from defaultdevicetype
18: [ RUN      ] defaultdevicetype.profiling_section
18: [       OK ] defaultdevicetype.profiling_section (0 ms)
18: [----------] 1 test from defaultdevicetype (0 ms total)
18: 
18: [----------] Global test environment tear-down
18: [==========] 26 tests from 2 test suites ran. (6 ms total)
18: [  PASSED  ] 26 tests.
18/61 Test #18: KokkosCore_UnitTest_KokkosP ..................   Passed    0.32 sec
test 19
      Start 19: KokkosCore_UnitTest_ToolIndependence

19: Test command: /var/jenkins/workspace/Kokkos/build/core/unit_test/KokkosCore_UnitTest_ToolIndependence
19: Test timeout computed to be: 1500
19/61 Test #19: KokkosCore_UnitTest_ToolIndependence .........   Passed    0.01 sec
test 20
      Start 20: KokkosCore_ProfilingTestLibraryLoadHelp

20: Test command: /var/jenkins/workspace/Kokkos/build/core/unit_test/KokkosCore_ProfilingAllCalls "--kokkos-tools-help"
20: Environment variables: 
20:  KOKKOS_PROFILE_LIBRARY=/var/jenkins/workspace/Kokkos/build/core/unit_test/libkokkosprinter-tool.so
20: Test timeout computed to be: 1500
20: Warning: environment variable 'KOKKOS_PROFILE_LIBRARY' is deprecated. Use 'KOKKOS_TOOLS_LIBS' instead. Raised by Kokkos::initialize().
20: kokkosp_init_library::kokkosp_print_help:KokkosCore_ProfilingAllCalls::kokkosp_finalize_library::
20/61 Test #20: KokkosCore_ProfilingTestLibraryLoadHelp ......   Passed    0.29 sec
test 21
      Start 21: KokkosCore_ProfilingTestLibraryCmdLineHelp

21: Test command: /var/jenkins/workspace/Kokkos/build/core/unit_test/KokkosCore_ProfilingAllCalls "--kokkos-tools-help" "--kokkos-tools-libs=/var/jenkins/workspace/Kokkos/build/core/unit_test/libkokkosprinter-tool.so"
21: Test timeout computed to be: 1500
21: kokkosp_init_library::kokkosp_print_help:KokkosCore_ProfilingAllCalls::kokkosp_finalize_library::
21/61 Test #21: KokkosCore_ProfilingTestLibraryCmdLineHelp ...   Passed    0.29 sec
test 22
      Start 22: KokkosCore_ProfilingTestLibraryLoad

22: Test command: /var/jenkins/workspace/Kokkos/build/core/unit_test/KokkosCore_ProfilingAllCalls "--kokkos-tools-args="-c test delimit""
22: Environment variables: 
22:  KOKKOS_PROFILE_LIBRARY=/var/jenkins/workspace/Kokkos/build/core/unit_test/libkokkosprinter-tool.so
22: Test timeout computed to be: 1500
22: Warning: environment variable 'KOKKOS_PROFILE_LIBRARY' is deprecated. Use 'KOKKOS_TOOLS_LIBS' instead. Raised by Kokkos::initialize().
22: kokkosp_init_library::kokkosp_parse_args:4:KokkosCore_ProfilingAllCalls:-c:test:delimit::kokkosp_parse_args:4:KokkosCore_ProfilingAllCalls:-c:test:delimit::kokkosp_declare_metadata:Default Device:N6Kokkos4CudaE::kokkosp_declare_metadata:KOKKOS_ENABLE_GNU_ATOMICS:no::kokkosp_declare_metadata:KOKKOS_ENABLE_INTEL_ATOMICS:no::kokkosp_declare_metadata:KOKKOS_ENABLE_WINDOWS_ATOMICS:no::kokkosp_declare_metadata:KOKKOS_COMPILER_CLANG:1100::kokkosp_declare_metadata:KOKKOS_ENABLE_HBWSPACE:no::kokkosp_declare_metadata:KOKKOS_ENABLE_INTEL_MM_ALLOC:no::kokkosp_declare_metadata:KOKKOS_ENABLE_ASM:no::kokkosp_declare_metadata:KOKKOS_ENABLE_CXX17:yes::kokkosp_declare_metadata:KOKKOS_ENABLE_CXX20:no::kokkosp_declare_metadata:KOKKOS_ENABLE_CXX23:no::kokkosp_declare_metadata:KOKKOS_ENABLE_DEBUG_BOUNDS_CHECK:no::kokkosp_declare_metadata:KOKKOS_ENABLE_HWLOC:no::kokkosp_declare_metadata:KOKKOS_ENABLE_LIBDL:yes::kokkosp_declare_metadata:KOKKOS_ENABLE_LIBRT:no::kokkosp_declare_metadata:compiler_family:clang::kokkosp_declare_metadata:KOKKOS_ENABLE_PRAGMA_IVDEP:no::kokkosp_declare_metadata:KOKKOS_ENABLE_PRAGMA_LOOPCOUNT:no::kokkosp_declare_metadata:KOKKOS_ENABLE_PRAGMA_SIMD:no::kokkosp_declare_metadata:KOKKOS_ENABLE_PRAGMA_UNROLL:no::kokkosp_declare_metadata:KOKKOS_ENABLE_PRAGMA_VECTOR:no::kokkosp_declare_metadata:Kokkos Version:3.6.99::kokkosp_allocate_data:Host:source:0x13af400:40::kokkosp_begin_parallel_for:Kokkos::View::initialization [source] via memset:1:0::kokkosp_end_parallel_for:0::kokkosp_allocate_data:Host:destination:0x138afc0:40::kokkosp_begin_parallel_for:Kokkos::View::initialization [destination] via memset:1:0::kokkosp_end_parallel_for:0::kokkosp_begin_deep_copy:Host:destination:0x138b040:Host:source:0x13af480:40::kokkosp_end_deep_copy::kokkosp_begin_parallel_for:parallel_for:1:0::kokkosp_end_parallel_for:0::kokkosp_begin_parallel_reduce:parallel_reduce:1:1::kokkosp_allocate_data:Host:Kokkos::Serial::scratch_mem:0x13e2dc0:11264::kokkosp_end_parallel_reduce:1::kokkosp_begin_parallel_scan:parallel_scan:1:2::kokkosp_end_parallel_scan:2::kokkosp_push_profile_region:push_region::kokkosp_pop_profile_region::kokkosp_create_profile_section:created_section:3::kokkosp_start_profile_section:3::kokkosp_stop_profile_section:3::kokkosp_destroy_profile_section:3::kokkosp_profile_event:profiling_event::kokkosp_declare_metadata:dogs:good::kokkosp_deallocate_data:Host:destination:0x138afc0:40::kokkosp_deallocate_data:Host:source:0x13af400:40::kokkosp_finalize_library::
22/61 Test #22: KokkosCore_ProfilingTestLibraryLoad ..........   Passed    0.30 sec
test 23
      Start 23: KokkosCore_ProfilingTestLibraryCmdLine

23: Test command: /var/jenkins/workspace/Kokkos/build/core/unit_test/KokkosCore_ProfilingAllCalls "--kokkos-tools-args=-c test delimit" "--kokkos-tools-libs=/var/jenkins/workspace/Kokkos/build/core/unit_test/libkokkosprinter-tool.so"
23: Test timeout computed to be: 1500
23: kokkosp_init_library::kokkosp_parse_args:4:KokkosCore_ProfilingAllCalls:-c:test:delimit::kokkosp_parse_args:4:KokkosCore_ProfilingAllCalls:-c:test:delimit::kokkosp_declare_metadata:Default Device:N6Kokkos4CudaE::kokkosp_declare_metadata:KOKKOS_ENABLE_GNU_ATOMICS:no::kokkosp_declare_metadata:KOKKOS_ENABLE_INTEL_ATOMICS:no::kokkosp_declare_metadata:KOKKOS_ENABLE_WINDOWS_ATOMICS:no::kokkosp_declare_metadata:KOKKOS_COMPILER_CLANG:1100::kokkosp_declare_metadata:KOKKOS_ENABLE_HBWSPACE:no::kokkosp_declare_metadata:KOKKOS_ENABLE_INTEL_MM_ALLOC:no::kokkosp_declare_metadata:KOKKOS_ENABLE_ASM:no::kokkosp_declare_metadata:KOKKOS_ENABLE_CXX17:yes::kokkosp_declare_metadata:KOKKOS_ENABLE_CXX20:no::kokkosp_declare_metadata:KOKKOS_ENABLE_CXX23:no::kokkosp_declare_metadata:KOKKOS_ENABLE_DEBUG_BOUNDS_CHECK:no::kokkosp_declare_metadata:KOKKOS_ENABLE_HWLOC:no::kokkosp_declare_metadata:KOKKOS_ENABLE_LIBDL:yes::kokkosp_declare_metadata:KOKKOS_ENABLE_LIBRT:no::kokkosp_declare_metadata:compiler_family:clang::kokkosp_declare_metadata:KOKKOS_ENABLE_PRAGMA_IVDEP:no::kokkosp_declare_metadata:KOKKOS_ENABLE_PRAGMA_LOOPCOUNT:no::kokkosp_declare_metadata:KOKKOS_ENABLE_PRAGMA_SIMD:no::kokkosp_declare_metadata:KOKKOS_ENABLE_PRAGMA_UNROLL:no::kokkosp_declare_metadata:KOKKOS_ENABLE_PRAGMA_VECTOR:no::kokkosp_declare_metadata:Kokkos Version:3.6.99::kokkosp_allocate_data:Host:source:0x26e57c0:40::kokkosp_begin_parallel_for:Kokkos::View::initialization [source] via memset:1:0::kokkosp_end_parallel_for:0::kokkosp_allocate_data:Host:destination:0x26b1140:40::kokkosp_begin_parallel_for:Kokkos::View::initialization [destination] via memset:1:0::kokkosp_end_parallel_for:0::kokkosp_begin_deep_copy:Host:destination:0x26b11c0:Host:source:0x26e5840:40::kokkosp_end_deep_copy::kokkosp_begin_parallel_for:parallel_for:1:0::kokkosp_end_parallel_for:0::kokkosp_begin_parallel_reduce:parallel_reduce:1:1::kokkosp_allocate_data:Host:Kokkos::Serial::scratch_mem:0x26fe100:11264::kokkosp_end_parallel_reduce:1::kokkosp_begin_parallel_scan:parallel_scan:1:2::kokkosp_end_parallel_scan:2::kokkosp_push_profile_region:push_region::kokkosp_pop_profile_region::kokkosp_create_profile_section:created_section:3::kokkosp_start_profile_section:3::kokkosp_stop_profile_section:3::kokkosp_destroy_profile_section:3::kokkosp_profile_event:profiling_event::kokkosp_declare_metadata:dogs:good::kokkosp_deallocate_data:Host:destination:0x26b1140:40::kokkosp_deallocate_data:Host:source:0x26e57c0:40::kokkosp_finalize_library::
23/61 Test #23: KokkosCore_ProfilingTestLibraryCmdLine .......   Passed    0.30 sec
test 24
      Start 24: KokkosCore_UnitTest_StackTraceTest

24: Test command: /var/jenkins/workspace/Kokkos/build/core/unit_test/KokkosCore_StackTraceTestExec
24: Test timeout computed to be: 1500
24: [==========] Running 3 tests from 2 test suites.
24: [----------] Global test environment set-up.
24: [----------] 2 tests from defaultdevicetype_DeathTest
24: [ RUN      ] defaultdevicetype_DeathTest.stacktrace_terminate
24: 
24: [WARNING] /var/jenkins/workspace/Kokkos/tpls/gtest/gtest/gtest-all.cc:9326:: Death tests use fork(), which is unsafe particularly in a threaded context. For this test, Google Test detected 3 threads. See https://github.com/google/googletest/blob/master/docs/advanced.md#death-tests-and-threads for more explanation and suggested solutions, especially if this is the last message you see before your test times out.
24: Top of f1
24: Top of f0
24: Top of f0
24: test_f1: /var/jenkins/workspace/Kokkos/build/core/unit_test/KokkosCore_StackTraceTestExec(_ZN6Kokkos4Impl15save_stacktraceEv+0x10) [0x4b0ca0]
24: /var/jenkins/workspace/Kokkos/build/core/unit_test/KokkosCore_StackTraceTestExec(_ZN4Test18stacktrace_test_f1ERSo+0x6b) [0x43a6cb]
24: /var/jenkins/workspace/Kokkos/build/core/unit_test/KokkosCore_StackTraceTestExec(_ZN4Test15test_stacktraceEbb+0x22) [0x437192]
24: /var/jenkins/workspace/Kokkos/build/core/unit_test/KokkosCore_StackTraceTestExec(_ZN4Test53defaultdevicetype_DeathTest_stacktrace_terminate_Test8TestBodyEv+0xbd) [0x43862d]
24: /var/jenkins/workspace/Kokkos/build/core/unit_test/KokkosCore_StackTraceTestExec(_ZN7testing8internal35HandleExceptionsInMethodIfSupportedINS_4TestEvEET0_PT_MS4_FS3_vEPKc+0x44) [0x479634]
24: /var/jenkins/workspace/Kokkos/build/core/unit_test/KokkosCore_StackTraceTestExec(_ZN7testing4Test3RunEv+0x1e8) [0x449768]
24: /var/jenkins/workspace/Kokkos/build/core/unit_test/KokkosCore_StackTraceTestExec(_ZN7testing8TestInfo3RunEv+0x210) [0x44abb0]
24: /var/jenkins/workspace/Kokkos/build/core/unit_test/KokkosCore_StackTraceTestExec(_ZN7testing9TestSuite3RunEv+0x13b) [0x44b49b]
24: /var/jenkins/workspace/Kokkos/build/core/unit_test/KokkosCore_StackTraceTestExec(_ZN7testing8internal12UnitTestImpl11RunAllTestsEv+0x5ae) [0x45da7e]
24: /var/jenkins/workspace/Kokkos/build/core/unit_test/KokkosCore_StackTraceTestExec(_ZN7testing8internal35HandleExceptionsInMethodIfSupportedINS0_12UnitTestImplEbEET0_PT_MS4_FS3_vEPKc+0x44) [0x47a3c4]
24: /var/jenkins/workspace/Kokkos/build/core/unit_test/KokkosCore_StackTraceTestExec(_ZN7testing8UnitTest3RunEv+0x4c) [0x45d49c]
24: /var/jenkins/workspace/Kokkos/build/core/unit_test/KokkosCore_StackTraceTestExec(main+0x30) [0x438b40]
24: /lib/x86_64-linux-gnu/libc.so.6(__libc_start_main+0xe7) [0x7f775989cbf7]
24: /var/jenkins/workspace/Kokkos/build/core/unit_test/KokkosCore_StackTraceTestExec(_start+0x2a) [0x43708a]
24:  
24: demangled test_f1:                                                                                                                                                                Kokkos::Impl::save_stacktrace()       [0x4b0ca0]
24:                                                                                                                                                        Test::stacktrace_test_f1(std::ostream&)       [0x43a6cb]
24:                                                                                                                                                              Test::test_stacktrace(bool, bool)       [0x437192]
24:                                                                                                                        Test::defaultdevicetype_DeathTest_stacktrace_terminate_Test::TestBody()       [0x43862d]
24:                                                       void testing::internal::HandleExceptionsInMethodIfSupported<testing::Test, void>(testing::Test*, void (testing::Test::*)(), char const*)       [0x479634]
24:                                                                                                                                                                           testing::Test::Run()       [0x449768]
24:                                                                                                                                                                       testing::TestInfo::Run()       [0x44abb0]
24:                                                                                                                                                                      testing::TestSuite::Run()       [0x44b49b]
24:                                                                                                                                                 testing::internal::UnitTestImpl::RunAllTests()       [0x45da7e]
24: bool testing::internal::HandleExceptionsInMethodIfSupported<testing::internal::UnitTestImpl, bool>(testing::internal::UnitTestImpl*, bool (testing::internal::UnitTestImpl::*)(), char const*)       [0x47a3c4]
24:                                                                                                                                                                       testing::UnitTest::Run()       [0x45d49c]
24:                                                                                                                                                                                           main       [0x438b40]
24:                                                                                                                                                                              __libc_start_main [0x7f775989cbf7]
24:                                                                                                                                                                                         _start       [0x43708a]
24:  
24: Top of f3
24: Top of f3
24: Top of f3
24: Top of f3
24: Top of f3
24: Top of f1
24: Top of f0
24: Top of f0
24: StackTrace f3(std::cout, 4) returned: 110
24: test_f3: /var/jenkins/workspace/Kokkos/build/core/unit_test/KokkosCore_StackTraceTestExec(_ZN6Kokkos4Impl15save_stacktraceEv+0x10) [0x4b0ca0]
24: /var/jenkins/workspace/Kokkos/build/core/unit_test/KokkosCore_StackTraceTestExec(_ZN4Test18stacktrace_test_f1ERSo+0x6b) [0x43a6cb]
24: /var/jenkins/workspace/Kokkos/build/core/unit_test/KokkosCore_StackTraceTestExec(_ZN4Test18stacktrace_test_f3ERSoi+0x90) [0x43aa40]
24: /var/jenkins/workspace/Kokkos/build/core/unit_test/KokkosCore_StackTraceTestExec(_ZN4Test15test_stacktraceEbb+0x6e7) [0x437857]
24: /var/jenkins/workspace/Kokkos/build/core/unit_test/KokkosCore_StackTraceTestExec(_ZN4Test53defaultdevicetype_DeathTest_stacktrace_terminate_Test8TestBodyEv+0xbd) [0x43862d]
24: /var/jenkins/workspace/Kokkos/build/core/unit_test/KokkosCore_StackTraceTestExec(_ZN7testing8internal35HandleExceptionsInMethodIfSupportedINS_4TestEvEET0_PT_MS4_FS3_vEPKc+0x44) [0x479634]
24: /var/jenkins/workspace/Kokkos/build/core/unit_test/KokkosCore_StackTraceTestExec(_ZN7testing4Test3RunEv+0x1e8) [0x449768]
24: /var/jenkins/workspace/Kokkos/build/core/unit_test/KokkosCore_StackTraceTestExec(_ZN7testing8TestInfo3RunEv+0x210) [0x44abb0]
24: /var/jenkins/workspace/Kokkos/build/core/unit_test/KokkosCore_StackTraceTestExec(_ZN7testing9TestSuite3RunEv+0x13b) [0x44b49b]
24: /var/jenkins/workspace/Kokkos/build/core/unit_test/KokkosCore_StackTraceTestExec(_ZN7testing8internal12UnitTestImpl11RunAllTestsEv+0x5ae) [0x45da7e]
24: /var/jenkins/workspace/Kokkos/build/core/unit_test/KokkosCore_StackTraceTestExec(_ZN7testing8internal35HandleExceptionsInMethodIfSupportedINS0_12UnitTestImplEbEET0_PT_MS4_FS3_vEPKc+0x44) [0x47a3c4]
24: /var/jenkins/workspace/Kokkos/build/core/unit_test/KokkosCore_StackTraceTestExec(_ZN7testing8UnitTest3RunEv+0x4c) [0x45d49c]
24: /var/jenkins/workspace/Kokkos/build/core/unit_test/KokkosCore_StackTraceTestExec(main+0x30) [0x438b40]
24: /lib/x86_64-linux-gnu/libc.so.6(__libc_start_main+0xe7) [0x7f775989cbf7]
24: /var/jenkins/workspace/Kokkos/build/core/unit_test/KokkosCore_StackTraceTestExec(_start+0x2a) [0x43708a]
24:  
24: demangled test_f3:                                                                                                                                                                Kokkos::Impl::save_stacktrace()       [0x4b0ca0]
24:                                                                                                                                                        Test::stacktrace_test_f1(std::ostream&)       [0x43a6cb]
24:                                                                                                                                                   Test::stacktrace_test_f3(std::ostream&, int)       [0x43aa40]
24:                                                                                                                                                              Test::test_stacktrace(bool, bool)       [0x437857]
24:                                                                                                                        Test::defaultdevicetype_DeathTest_stacktrace_terminate_Test::TestBody()       [0x43862d]
24:                                                       void testing::internal::HandleExceptionsInMethodIfSupported<testing::Test, void>(testing::Test*, void (testing::Test::*)(), char const*)       [0x479634]
24:                                                                                                                                                                           testing::Test::Run()       [0x449768]
24:                                                                                                                                                                       testing::TestInfo::Run()       [0x44abb0]
24:                                                                                                                                                                      testing::TestSuite::Run()       [0x44b49b]
24:                                                                                                                                                 testing::internal::UnitTestImpl::RunAllTests()       [0x45da7e]
24: bool testing::internal::HandleExceptionsInMethodIfSupported<testing::internal::UnitTestImpl, bool>(testing::internal::UnitTestImpl*, bool (testing::internal::UnitTestImpl::*)(), char const*)       [0x47a3c4]
24:                                                                                                                                                                       testing::UnitTest::Run()       [0x45d49c]
24:                                                                                                                                                                                           main       [0x438b40]
24:                                                                                                                                                                              __libc_start_main [0x7f775989cbf7]
24:                                                                                                                                                                                         _start       [0x43708a]
24:  
24: Test setting std::terminate handler that prints the last saved stack trace
24: [       OK ] defaultdevicetype_DeathTest.stacktrace_terminate (51 ms)
24: [ RUN      ] defaultdevicetype_DeathTest.stacktrace_generic_term
24: 
24: [WARNING] /var/jenkins/workspace/Kokkos/tpls/gtest/gtest/gtest-all.cc:9326:: Death tests use fork(), which is unsafe particularly in a threaded context. For this test, Google Test detected 3 threads. See https://github.com/google/googletest/blob/master/docs/advanced.md#death-tests-and-threads for more explanation and suggested solutions, especially if this is the last message you see before your test times out.
24: Top of f1
24: Top of f0
24: Top of f0
24: test_f1: /var/jenkins/workspace/Kokkos/build/core/unit_test/KokkosCore_StackTraceTestExec(_ZN6Kokkos4Impl15save_stacktraceEv+0x10) [0x4b0ca0]
24: /var/jenkins/workspace/Kokkos/build/core/unit_test/KokkosCore_StackTraceTestExec(_ZN4Test18stacktrace_test_f1ERSo+0x6b) [0x43a6cb]
24: /var/jenkins/workspace/Kokkos/build/core/unit_test/KokkosCore_StackTraceTestExec(_ZN4Test15test_stacktraceEbb+0x22) [0x437192]
24: /var/jenkins/workspace/Kokkos/build/core/unit_test/KokkosCore_StackTraceTestExec(_ZN4Test56defaultdevicetype_DeathTest_stacktrace_generic_term_Test8TestBodyEv+0xba) [0x4388fa]
24: /var/jenkins/workspace/Kokkos/build/core/unit_test/KokkosCore_StackTraceTestExec(_ZN7testing8internal35HandleExceptionsInMethodIfSupportedINS_4TestEvEET0_PT_MS4_FS3_vEPKc+0x44) [0x479634]
24: /var/jenkins/workspace/Kokkos/build/core/unit_test/KokkosCore_StackTraceTestExec(_ZN7testing4Test3RunEv+0x1e8) [0x449768]
24: /var/jenkins/workspace/Kokkos/build/core/unit_test/KokkosCore_StackTraceTestExec(_ZN7testing8TestInfo3RunEv+0x210) [0x44abb0]
24: /var/jenkins/workspace/Kokkos/build/core/unit_test/KokkosCore_StackTraceTestExec(_ZN7testing9TestSuite3RunEv+0x13b) [0x44b49b]
24: /var/jenkins/workspace/Kokkos/build/core/unit_test/KokkosCore_StackTraceTestExec(_ZN7testing8internal12UnitTestImpl11RunAllTestsEv+0x5ae) [0x45da7e]
24: /var/jenkins/workspace/Kokkos/build/core/unit_test/KokkosCore_StackTraceTestExec(_ZN7testing8internal35HandleExceptionsInMethodIfSupportedINS0_12UnitTestImplEbEET0_PT_MS4_FS3_vEPKc+0x44) [0x47a3c4]
24: /var/jenkins/workspace/Kokkos/build/core/unit_test/KokkosCore_StackTraceTestExec(_ZN7testing8UnitTest3RunEv+0x4c) [0x45d49c]
24: /var/jenkins/workspace/Kokkos/build/core/unit_test/KokkosCore_StackTraceTestExec(main+0x30) [0x438b40]
24: /lib/x86_64-linux-gnu/libc.so.6(__libc_start_main+0xe7) [0x7f775989cbf7]
24: /var/jenkins/workspace/Kokkos/build/core/unit_test/KokkosCore_StackTraceTestExec(_start+0x2a) [0x43708a]
24:  
24: demangled test_f1:                                                                                                                                                                Kokkos::Impl::save_stacktrace()       [0x4b0ca0]
24:                                                                                                                                                        Test::stacktrace_test_f1(std::ostream&)       [0x43a6cb]
24:                                                                                                                                                              Test::test_stacktrace(bool, bool)       [0x437192]
24:                                                                                                                     Test::defaultdevicetype_DeathTest_stacktrace_generic_term_Test::TestBody()       [0x4388fa]
24:                                                       void testing::internal::HandleExceptionsInMethodIfSupported<testing::Test, void>(testing::Test*, void (testing::Test::*)(), char const*)       [0x479634]
24:                                                                                                                                                                           testing::Test::Run()       [0x449768]
24:                                                                                                                                                                       testing::TestInfo::Run()       [0x44abb0]
24:                                                                                                                                                                      testing::TestSuite::Run()       [0x44b49b]
24:                                                                                                                                                 testing::internal::UnitTestImpl::RunAllTests()       [0x45da7e]
24: bool testing::internal::HandleExceptionsInMethodIfSupported<testing::internal::UnitTestImpl, bool>(testing::internal::UnitTestImpl*, bool (testing::internal::UnitTestImpl::*)(), char const*)       [0x47a3c4]
24:                                                                                                                                                                       testing::UnitTest::Run()       [0x45d49c]
24:                                                                                                                                                                                           main       [0x438b40]
24:                                                                                                                                                                              __libc_start_main [0x7f775989cbf7]
24:                                                                                                                                                                                         _start       [0x43708a]
24:  
24: Top of f3
24: Top of f3
24: Top of f3
24: Top of f3
24: Top of f3
24: Top of f1
24: Top of f0
24: Top of f0
24: StackTrace f3(std::cout, 4) returned: 110
24: test_f3: /var/jenkins/workspace/Kokkos/build/core/unit_test/KokkosCore_StackTraceTestExec(_ZN6Kokkos4Impl15save_stacktraceEv+0x10) [0x4b0ca0]
24: /var/jenkins/workspace/Kokkos/build/core/unit_test/KokkosCore_StackTraceTestExec(_ZN4Test18stacktrace_test_f1ERSo+0x6b) [0x43a6cb]
24: /var/jenkins/workspace/Kokkos/build/core/unit_test/KokkosCore_StackTraceTestExec(_ZN4Test18stacktrace_test_f3ERSoi+0x90) [0x43aa40]
24: /var/jenkins/workspace/Kokkos/build/core/unit_test/KokkosCore_StackTraceTestExec(_ZN4Test15test_stacktraceEbb+0x6e7) [0x437857]
24: /var/jenkins/workspace/Kokkos/build/core/unit_test/KokkosCore_StackTraceTestExec(_ZN4Test56defaultdevicetype_DeathTest_stacktrace_generic_term_Test8TestBodyEv+0xba) [0x4388fa]
24: /var/jenkins/workspace/Kokkos/build/core/unit_test/KokkosCore_StackTraceTestExec(_ZN7testing8internal35HandleExceptionsInMethodIfSupportedINS_4TestEvEET0_PT_MS4_FS3_vEPKc+0x44) [0x479634]
24: /var/jenkins/workspace/Kokkos/build/core/unit_test/KokkosCore_StackTraceTestExec(_ZN7testing4Test3RunEv+0x1e8) [0x449768]
24: /var/jenkins/workspace/Kokkos/build/core/unit_test/KokkosCore_StackTraceTestExec(_ZN7testing8TestInfo3RunEv+0x210) [0x44abb0]
24: /var/jenkins/workspace/Kokkos/build/core/unit_test/KokkosCore_StackTraceTestExec(_ZN7testing9TestSuite3RunEv+0x13b) [0x44b49b]
24: /var/jenkins/workspace/Kokkos/build/core/unit_test/KokkosCore_StackTraceTestExec(_ZN7testing8internal12UnitTestImpl11RunAllTestsEv+0x5ae) [0x45da7e]
24: /var/jenkins/workspace/Kokkos/build/core/unit_test/KokkosCore_StackTraceTestExec(_ZN7testing8internal35HandleExceptionsInMethodIfSupportedINS0_12UnitTestImplEbEET0_PT_MS4_FS3_vEPKc+0x44) [0x47a3c4]
24: /var/jenkins/workspace/Kokkos/build/core/unit_test/KokkosCore_StackTraceTestExec(_ZN7testing8UnitTest3RunEv+0x4c) [0x45d49c]
24: /var/jenkins/workspace/Kokkos/build/core/unit_test/KokkosCore_StackTraceTestExec(main+0x30) [0x438b40]
24: /lib/x86_64-linux-gnu/libc.so.6(__libc_start_main+0xe7) [0x7f775989cbf7]
24: /var/jenkins/workspace/Kokkos/build/core/unit_test/KokkosCore_StackTraceTestExec(_start+0x2a) [0x43708a]
24:  
24: demangled test_f3:                                                                                                                                                                Kokkos::Impl::save_stacktrace()       [0x4b0ca0]
24:                                                                                                                                                        Test::stacktrace_test_f1(std::ostream&)       [0x43a6cb]
24:                                                                                                                                                   Test::stacktrace_test_f3(std::ostream&, int)       [0x43aa40]
24:                                                                                                                                                              Test::test_stacktrace(bool, bool)       [0x437857]
24:                                                                                                                     Test::defaultdevicetype_DeathTest_stacktrace_generic_term_Test::TestBody()       [0x4388fa]
24:                                                       void testing::internal::HandleExceptionsInMethodIfSupported<testing::Test, void>(testing::Test*, void (testing::Test::*)(), char const*)       [0x479634]
24:                                                                                                                                                                           testing::Test::Run()       [0x449768]
24:                                                                                                                                                                       testing::TestInfo::Run()       [0x44abb0]
24:                                                                                                                                                                      testing::TestSuite::Run()       [0x44b49b]
24:                                                                                                                                                 testing::internal::UnitTestImpl::RunAllTests()       [0x45da7e]
24: bool testing::internal::HandleExceptionsInMethodIfSupported<testing::internal::UnitTestImpl, bool>(testing::internal::UnitTestImpl*, bool (testing::internal::UnitTestImpl::*)(), char const*)       [0x47a3c4]
24:                                                                                                                                                                       testing::UnitTest::Run()       [0x45d49c]
24:                                                                                                                                                                                           main       [0x438b40]
24:                                                                                                                                                                              __libc_start_main [0x7f775989cbf7]
24:                                                                                                                                                                                         _start       [0x43708a]
24:  
24: Test setting std::terminate handler that prints the last saved stack trace
24: [       OK ] defaultdevicetype_DeathTest.stacktrace_generic_term (51 ms)
24: [----------] 2 tests from defaultdevicetype_DeathTest (102 ms total)
24: 
24: [----------] 1 test from defaultdevicetype
24: [ RUN      ] defaultdevicetype.stacktrace_normal
24: Top of f1
24: Top of f0
24: Top of f0
24: test_f1: /var/jenkins/workspace/Kokkos/build/core/unit_test/KokkosCore_StackTraceTestExec(_ZN6Kokkos4Impl15save_stacktraceEv+0x10) [0x4b0ca0]
24: /var/jenkins/workspace/Kokkos/build/core/unit_test/KokkosCore_StackTraceTestExec(_ZN4Test18stacktrace_test_f1ERSo+0x6b) [0x43a6cb]
24: /var/jenkins/workspace/Kokkos/build/core/unit_test/KokkosCore_StackTraceTestExec(_ZN4Test15test_stacktraceEbb+0x22) [0x437192]
24: /var/jenkins/workspace/Kokkos/build/core/unit_test/KokkosCore_StackTraceTestExec(_ZN7testing8internal35HandleExceptionsInMethodIfSupportedINS_4TestEvEET0_PT_MS4_FS3_vEPKc+0x44) [0x479634]
24: /var/jenkins/workspace/Kokkos/build/core/unit_test/KokkosCore_StackTraceTestExec(_ZN7testing4Test3RunEv+0x1e8) [0x449768]
24: /var/jenkins/workspace/Kokkos/build/core/unit_test/KokkosCore_StackTraceTestExec(_ZN7testing8TestInfo3RunEv+0x210) [0x44abb0]
24: /var/jenkins/workspace/Kokkos/build/core/unit_test/KokkosCore_StackTraceTestExec(_ZN7testing9TestSuite3RunEv+0x13b) [0x44b49b]
24: /var/jenkins/workspace/Kokkos/build/core/unit_test/KokkosCore_StackTraceTestExec(_ZN7testing8internal12UnitTestImpl11RunAllTestsEv+0x5ae) [0x45da7e]
24: /var/jenkins/workspace/Kokkos/build/core/unit_test/KokkosCore_StackTraceTestExec(_ZN7testing8internal35HandleExceptionsInMethodIfSupportedINS0_12UnitTestImplEbEET0_PT_MS4_FS3_vEPKc+0x44) [0x47a3c4]
24: /var/jenkins/workspace/Kokkos/build/core/unit_test/KokkosCore_StackTraceTestExec(_ZN7testing8UnitTest3RunEv+0x4c) [0x45d49c]
24: /var/jenkins/workspace/Kokkos/build/core/unit_test/KokkosCore_StackTraceTestExec(main+0x30) [0x438b40]
24: /lib/x86_64-linux-gnu/libc.so.6(__libc_start_main+0xe7) [0x7f775989cbf7]
24: /var/jenkins/workspace/Kokkos/build/core/unit_test/KokkosCore_StackTraceTestExec(_start+0x2a) [0x43708a]
24:  
24: demangled test_f1:                                                                                                                                                                Kokkos::Impl::save_stacktrace()       [0x4b0ca0]
24:                                                                                                                                                        Test::stacktrace_test_f1(std::ostream&)       [0x43a6cb]
24:                                                                                                                                                              Test::test_stacktrace(bool, bool)       [0x437192]
24:                                                       void testing::internal::HandleExceptionsInMethodIfSupported<testing::Test, void>(testing::Test*, void (testing::Test::*)(), char const*)       [0x479634]
24:                                                                                                                                                                           testing::Test::Run()       [0x449768]
24:                                                                                                                                                                       testing::TestInfo::Run()       [0x44abb0]
24:                                                                                                                                                                      testing::TestSuite::Run()       [0x44b49b]
24:                                                                                                                                                 testing::internal::UnitTestImpl::RunAllTests()       [0x45da7e]
24: bool testing::internal::HandleExceptionsInMethodIfSupported<testing::internal::UnitTestImpl, bool>(testing::internal::UnitTestImpl*, bool (testing::internal::UnitTestImpl::*)(), char const*)       [0x47a3c4]
24:                                                                                                                                                                       testing::UnitTest::Run()       [0x45d49c]
24:                                                                                                                                                                                           main       [0x438b40]
24:                                                                                                                                                                              __libc_start_main [0x7f775989cbf7]
24:                                                                                                                                                                                         _start       [0x43708a]
24:  
24: Top of f3
24: Top of f3
24: Top of f3
24: Top of f3
24: Top of f3
24: Top of f1
24: Top of f0
24: Top of f0
24: StackTrace f3(std::cout, 4) returned: 110
24: test_f3: /var/jenkins/workspace/Kokkos/build/core/unit_test/KokkosCore_StackTraceTestExec(_ZN6Kokkos4Impl15save_stacktraceEv+0x10) [0x4b0ca0]
24: /var/jenkins/workspace/Kokkos/build/core/unit_test/KokkosCore_StackTraceTestExec(_ZN4Test18stacktrace_test_f1ERSo+0x6b) [0x43a6cb]
24: /var/jenkins/workspace/Kokkos/build/core/unit_test/KokkosCore_StackTraceTestExec(_ZN4Test18stacktrace_test_f3ERSoi+0x90) [0x43aa40]
24: /var/jenkins/workspace/Kokkos/build/core/unit_test/KokkosCore_StackTraceTestExec(_ZN4Test15test_stacktraceEbb+0x6e7) [0x437857]
24: /var/jenkins/workspace/Kokkos/build/core/unit_test/KokkosCore_StackTraceTestExec(_ZN7testing8internal35HandleExceptionsInMethodIfSupportedINS_4TestEvEET0_PT_MS4_FS3_vEPKc+0x44) [0x479634]
24: /var/jenkins/workspace/Kokkos/build/core/unit_test/KokkosCore_StackTraceTestExec(_ZN7testing4Test3RunEv+0x1e8) [0x449768]
24: /var/jenkins/workspace/Kokkos/build/core/unit_test/KokkosCore_StackTraceTestExec(_ZN7testing8TestInfo3RunEv+0x210) [0x44abb0]
24: /var/jenkins/workspace/Kokkos/build/core/unit_test/KokkosCore_StackTraceTestExec(_ZN7testing9TestSuite3RunEv+0x13b) [0x44b49b]
24: /var/jenkins/workspace/Kokkos/build/core/unit_test/KokkosCore_StackTraceTestExec(_ZN7testing8internal12UnitTestImpl11RunAllTestsEv+0x5ae) [0x45da7e]
24: /var/jenkins/workspace/Kokkos/build/core/unit_test/KokkosCore_StackTraceTestExec(_ZN7testing8internal35HandleExceptionsInMethodIfSupportedINS0_12UnitTestImplEbEET0_PT_MS4_FS3_vEPKc+0x44) [0x47a3c4]
24: /var/jenkins/workspace/Kokkos/build/core/unit_test/KokkosCore_StackTraceTestExec(_ZN7testing8UnitTest3RunEv+0x4c) [0x45d49c]
24: /var/jenkins/workspace/Kokkos/build/core/unit_test/KokkosCore_StackTraceTestExec(main+0x30) [0x438b40]
24: /lib/x86_64-linux-gnu/libc.so.6(__libc_start_main+0xe7) [0x7f775989cbf7]
24: /var/jenkins/workspace/Kokkos/build/core/unit_test/KokkosCore_StackTraceTestExec(_start+0x2a) [0x43708a]
24:  
24: demangled test_f3:                                                                                                                                                                Kokkos::Impl::save_stacktrace()       [0x4b0ca0]
24:                                                                                                                                                        Test::stacktrace_test_f1(std::ostream&)       [0x43a6cb]
24:                                                                                                                                                   Test::stacktrace_test_f3(std::ostream&, int)       [0x43aa40]
24:                                                                                                                                                              Test::test_stacktrace(bool, bool)       [0x437857]
24:                                                       void testing::internal::HandleExceptionsInMethodIfSupported<testing::Test, void>(testing::Test*, void (testing::Test::*)(), char const*)       [0x479634]
24:                                                                                                                                                                           testing::Test::Run()       [0x449768]
24:                                                                                                                                                                       testing::TestInfo::Run()       [0x44abb0]
24:                                                                                                                                                                      testing::TestSuite::Run()       [0x44b49b]
24:                                                                                                                                                 testing::internal::UnitTestImpl::RunAllTests()       [0x45da7e]
24: bool testing::internal::HandleExceptionsInMethodIfSupported<testing::internal::UnitTestImpl, bool>(testing::internal::UnitTestImpl*, bool (testing::internal::UnitTestImpl::*)(), char const*)       [0x47a3c4]
24:                                                                                                                                                                       testing::UnitTest::Run()       [0x45d49c]
24:                                                                                                                                                                                           main       [0x438b40]
24:                                                                                                                                                                              __libc_start_main [0x7f775989cbf7]
24:                                                                                                                                                                                         _start       [0x43708a]
24:  
24: Test setting std::terminate handler that prints the last saved stack trace
24: [       OK ] defaultdevicetype.stacktrace_normal (1 ms)
24: [----------] 1 test from defaultdevicetype (1 ms total)
24: 
24: [----------] Global test environment tear-down
24: [==========] 3 tests from 2 test suites ran. (104 ms total)
24: [  PASSED  ] 3 tests.
24/61 Test #24: KokkosCore_UnitTest_StackTraceTest ...........   Passed    0.40 sec
test 25
      Start 25: KokkosCore_UnitTest_DefaultInit_1

25: Test command: /var/jenkins/workspace/Kokkos/build/core/unit_test/KokkosCore_UnitTest_DefaultInit_1
25: Test timeout computed to be: 1500
25: [==========] Running 1 test from 1 test suite.
25: [----------] Global test environment set-up.
25: [----------] 1 test from defaultdevicetypeinit
25: [ RUN      ] defaultdevicetypeinit.no_args
25: [       OK ] defaultdevicetypeinit.no_args (243 ms)
25: [----------] 1 test from defaultdevicetypeinit (243 ms total)
25: 
25: [----------] Global test environment tear-down
25: [==========] 1 test from 1 test suite ran. (243 ms total)
25: [  PASSED  ] 1 test.
25/61 Test #25: KokkosCore_UnitTest_DefaultInit_1 ............   Passed    0.31 sec
test 26
      Start 26: KokkosCore_UnitTest_DefaultInit_2

26: Test command: /var/jenkins/workspace/Kokkos/build/core/unit_test/KokkosCore_UnitTest_DefaultInit_2
26: Test timeout computed to be: 1500
26: [==========] Running 1 test from 1 test suite.
26: [----------] Global test environment set-up.
26: [----------] 1 test from defaultdevicetypeinit
26: [ RUN      ] defaultdevicetypeinit.commandline_args_empty
26: [       OK ] defaultdevicetypeinit.commandline_args_empty (235 ms)
26: [----------] 1 test from defaultdevicetypeinit (235 ms total)
26: 
26: [----------] Global test environment tear-down
26: [==========] 1 test from 1 test suite ran. (235 ms total)
26: [  PASSED  ] 1 test.
26/61 Test #26: KokkosCore_UnitTest_DefaultInit_2 ............   Passed    0.30 sec
test 27
      Start 27: KokkosCore_UnitTest_DefaultInit_3

27: Test command: /var/jenkins/workspace/Kokkos/build/core/unit_test/KokkosCore_UnitTest_DefaultInit_3
27: Test timeout computed to be: 1500
27: [==========] Running 1 test from 1 test suite.
27: [----------] Global test environment set-up.
27: [----------] 1 test from defaultdevicetypeinit
27: [ RUN      ] defaultdevicetypeinit.commandline_args_other
27: [       OK ] defaultdevicetypeinit.commandline_args_other (241 ms)
27: [----------] 1 test from defaultdevicetypeinit (241 ms total)
27: 
27: [----------] Global test environment tear-down
27: [==========] 1 test from 1 test suite ran. (241 ms total)
27: [  PASSED  ] 1 test.
27/61 Test #27: KokkosCore_UnitTest_DefaultInit_3 ............   Passed    0.30 sec
test 28
      Start 28: KokkosCore_UnitTest_DefaultInit_4

28: Test command: /var/jenkins/workspace/Kokkos/build/core/unit_test/KokkosCore_UnitTest_DefaultInit_4
28: Test timeout computed to be: 1500
28: [==========] Running 1 test from 1 test suite.
28: [----------] Global test environment set-up.
28: [----------] 1 test from defaultdevicetypeinit
28: [ RUN      ] defaultdevicetypeinit.commandline_args_nthreads
28: Warning: command line argument '--threads' is deprecated. Use '--kokkos-num-threads' instead. Raised by Kokkos::initialize().
28: [       OK ] defaultdevicetypeinit.commandline_args_nthreads (241 ms)
28: [----------] 1 test from defaultdevicetypeinit (241 ms total)
28: 
28: [----------] Global test environment tear-down
28: [==========] 1 test from 1 test suite ran. (241 ms total)
28: [  PASSED  ] 1 test.
28/61 Test #28: KokkosCore_UnitTest_DefaultInit_4 ............   Passed    0.31 sec
test 29
      Start 29: KokkosCore_UnitTest_DefaultInit_5

29: Test command: /var/jenkins/workspace/Kokkos/build/core/unit_test/KokkosCore_UnitTest_DefaultInit_5
29: Test timeout computed to be: 1500
29: [==========] Running 1 test from 1 test suite.
29: [----------] Global test environment set-up.
29: [----------] 1 test from defaultdevicetypeinit
29: [ RUN      ] defaultdevicetypeinit.commandline_args_nthreads_numa
29: Warning: command line argument '--threads' is deprecated. Use '--kokkos-num-threads' instead. Raised by Kokkos::initialize().
29: Warning: command line argument '--numa' is deprecated. Raised by Kokkos::initialize().
29: [       OK ] defaultdevicetypeinit.commandline_args_nthreads_numa (236 ms)
29: [----------] 1 test from defaultdevicetypeinit (236 ms total)
29: 
29: [----------] Global test environment tear-down
29: [==========] 1 test from 1 test suite ran. (237 ms total)
29: [  PASSED  ] 1 test.
29/61 Test #29: KokkosCore_UnitTest_DefaultInit_5 ............   Passed    0.30 sec
test 30
      Start 30: KokkosCore_UnitTest_DefaultInit_6

30: Test command: /var/jenkins/workspace/Kokkos/build/core/unit_test/KokkosCore_UnitTest_DefaultInit_6
30: Test timeout computed to be: 1500
30: [==========] Running 1 test from 1 test suite.
30: [----------] Global test environment set-up.
30: [----------] 1 test from defaultdevicetypeinit
30: [ RUN      ] defaultdevicetypeinit.commandline_args_nthreads_numa_device
30: Warning: command line argument '--threads' is deprecated. Use '--kokkos-num-threads' instead. Raised by Kokkos::initialize().
30: Warning: command line argument '--numa' is deprecated. Raised by Kokkos::initialize().
30: Warning: command line argument '--device-id' is deprecated. Use '--kokkos-device-id' instead. Raised by Kokkos::initialize().
30: [       OK ] defaultdevicetypeinit.commandline_args_nthreads_numa_device (241 ms)
30: [----------] 1 test from defaultdevicetypeinit (241 ms total)
30: 
30: [----------] Global test environment tear-down
30: [==========] 1 test from 1 test suite ran. (241 ms total)
30: [  PASSED  ] 1 test.
30/61 Test #30: KokkosCore_UnitTest_DefaultInit_6 ............   Passed    0.31 sec
test 31
      Start 31: KokkosCore_UnitTest_DefaultInit_7

31: Test command: /var/jenkins/workspace/Kokkos/build/core/unit_test/KokkosCore_UnitTest_DefaultInit_7
31: Test timeout computed to be: 1500
31: [==========] Running 1 test from 1 test suite.
31: [----------] Global test environment set-up.
31: [----------] 1 test from defaultdevicetypeinit
31: [ RUN      ] defaultdevicetypeinit.commandline_args_nthreads_device
31: Warning: command line argument '--threads' is deprecated. Use '--kokkos-num-threads' instead. Raised by Kokkos::initialize().
31: Warning: command line argument '--device-id' is deprecated. Use '--kokkos-device-id' instead. Raised by Kokkos::initialize().
31: [       OK ] defaultdevicetypeinit.commandline_args_nthreads_device (249 ms)
31: [----------] 1 test from defaultdevicetypeinit (249 ms total)
31: 
31: [----------] Global test environment tear-down
31: [==========] 1 test from 1 test suite ran. (249 ms total)
31: [  PASSED  ] 1 test.
31/61 Test #31: KokkosCore_UnitTest_DefaultInit_7 ............   Passed    0.32 sec
test 32
      Start 32: KokkosCore_UnitTest_DefaultInit_8

32: Test command: /var/jenkins/workspace/Kokkos/build/core/unit_test/KokkosCore_UnitTest_DefaultInit_8
32: Test timeout computed to be: 1500
32: [==========] Running 1 test from 1 test suite.
32: [----------] Global test environment set-up.
32: [----------] 1 test from defaultdevicetypeinit
32: [ RUN      ] defaultdevicetypeinit.commandline_args_numa_device
32: Warning: command line argument '--numa' is deprecated. Raised by Kokkos::initialize().
32: Warning: command line argument '--device-id' is deprecated. Use '--kokkos-device-id' instead. Raised by Kokkos::initialize().
32: [       OK ] defaultdevicetypeinit.commandline_args_numa_device (239 ms)
32: [----------] 1 test from defaultdevicetypeinit (239 ms total)
32: 
32: [----------] Global test environment tear-down
32: [==========] 1 test from 1 test suite ran. (239 ms total)
32: [  PASSED  ] 1 test.
32/61 Test #32: KokkosCore_UnitTest_DefaultInit_8 ............   Passed    0.30 sec
test 33
      Start 33: KokkosCore_UnitTest_DefaultInit_9

33: Test command: /var/jenkins/workspace/Kokkos/build/core/unit_test/KokkosCore_UnitTest_DefaultInit_9
33: Test timeout computed to be: 1500
33: [==========] Running 1 test from 1 test suite.
33: [----------] Global test environment set-up.
33: [----------] 1 test from defaultdevicetypeinit
33: [ RUN      ] defaultdevicetypeinit.commandline_args_device
33: Warning: command line argument '--device-id' is deprecated. Use '--kokkos-device-id' instead. Raised by Kokkos::initialize().
33: [       OK ] defaultdevicetypeinit.commandline_args_device (248 ms)
33: [----------] 1 test from defaultdevicetypeinit (248 ms total)
33: 
33: [----------] Global test environment tear-down
33: [==========] 1 test from 1 test suite ran. (248 ms total)
33: [  PASSED  ] 1 test.
33/61 Test #33: KokkosCore_UnitTest_DefaultInit_9 ............   Passed    0.31 sec
test 34
      Start 34: KokkosCore_UnitTest_DefaultInit_10

34: Test command: /var/jenkins/workspace/Kokkos/build/core/unit_test/KokkosCore_UnitTest_DefaultInit_10
34: Test timeout computed to be: 1500
34: [==========] Running 1 test from 1 test suite.
34: [----------] Global test environment set-up.
34: [----------] 1 test from defaultdevicetypeinit
34: [ RUN      ] defaultdevicetypeinit.commandline_args_nthreads_numa_device_other
34: Warning: command line argument '--threads' is deprecated. Use '--kokkos-num-threads' instead. Raised by Kokkos::initialize().
34: Warning: command line argument '--numa' is deprecated. Raised by Kokkos::initialize().
34: Warning: command line argument '--device-id' is deprecated. Use '--kokkos-device-id' instead. Raised by Kokkos::initialize().
34: [       OK ] defaultdevicetypeinit.commandline_args_nthreads_numa_device_other (229 ms)
34: [----------] 1 test from defaultdevicetypeinit (229 ms total)
34: 
34: [----------] Global test environment tear-down
34: [==========] 1 test from 1 test suite ran. (229 ms total)
34: [  PASSED  ] 1 test.
34/61 Test #34: KokkosCore_UnitTest_DefaultInit_10 ...........   Passed    0.29 sec
test 35
      Start 35: KokkosCore_UnitTest_DefaultInit_11

35: Test command: /var/jenkins/workspace/Kokkos/build/core/unit_test/KokkosCore_UnitTest_DefaultInit_11
35: Test timeout computed to be: 1500
35: [==========] Running 1 test from 1 test suite.
35: [----------] Global test environment set-up.
35: [----------] 1 test from defaultdevicetypeinit
35: [ RUN      ] defaultdevicetypeinit.commandline_args_nthreads_numa_device_other_tune
35: Warning: command line argument '--threads' is deprecated. Use '--kokkos-num-threads' instead. Raised by Kokkos::initialize().
35: Warning: command line argument '--numa' is deprecated. Raised by Kokkos::initialize().
35: Warning: command line argument '--device-id' is deprecated. Use '--kokkos-device-id' instead. Raised by Kokkos::initialize().
35: [       OK ] defaultdevicetypeinit.commandline_args_nthreads_numa_device_other_tune (233 ms)
35: [----------] 1 test from defaultdevicetypeinit (234 ms total)
35: 
35: [----------] Global test environment tear-down
35: [==========] 1 test from 1 test suite ran. (234 ms total)
35: [  PASSED  ] 1 test.
35/61 Test #35: KokkosCore_UnitTest_DefaultInit_11 ...........   Passed    0.30 sec
test 36
      Start 36: KokkosCore_UnitTest_DefaultInit_12

36: Test command: /var/jenkins/workspace/Kokkos/build/core/unit_test/KokkosCore_UnitTest_DefaultInit_12
36: Test timeout computed to be: 1500
36: [==========] Running 1 test from 1 test suite.
36: [----------] Global test environment set-up.
36: [----------] 1 test from defaultdevicetypeinit
36: [ RUN      ] defaultdevicetypeinit.initstruct_default
36: [       OK ] defaultdevicetypeinit.initstruct_default (240 ms)
36: [----------] 1 test from defaultdevicetypeinit (240 ms total)
36: 
36: [----------] Global test environment tear-down
36: [==========] 1 test from 1 test suite ran. (241 ms total)
36: [  PASSED  ] 1 test.
36/61 Test #36: KokkosCore_UnitTest_DefaultInit_12 ...........   Passed    0.30 sec
test 37
      Start 37: KokkosCore_UnitTest_DefaultInit_13

37: Test command: /var/jenkins/workspace/Kokkos/build/core/unit_test/KokkosCore_UnitTest_DefaultInit_13
37: Test timeout computed to be: 1500
37: [==========] Running 1 test from 1 test suite.
37: [----------] Global test environment set-up.
37: [----------] 1 test from defaultdevicetypeinit
37: [ RUN      ] defaultdevicetypeinit.initstruct_nthreads
37: [       OK ] defaultdevicetypeinit.initstruct_nthreads (234 ms)
37: [----------] 1 test from defaultdevicetypeinit (234 ms total)
37: 
37: [----------] Global test environment tear-down
37: [==========] 1 test from 1 test suite ran. (234 ms total)
37: [  PASSED  ] 1 test.
37/61 Test #37: KokkosCore_UnitTest_DefaultInit_13 ...........   Passed    0.30 sec
test 38
      Start 38: KokkosCore_UnitTest_DefaultInit_14

38: Test command: /var/jenkins/workspace/Kokkos/build/core/unit_test/KokkosCore_UnitTest_DefaultInit_14
38: Test timeout computed to be: 1500
38: [==========] Running 1 test from 1 test suite.
38: [----------] Global test environment set-up.
38: [----------] 1 test from defaultdevicetypeinit
38: [ RUN      ] defaultdevicetypeinit.initstruct_nthreads_numa
38: [       OK ] defaultdevicetypeinit.initstruct_nthreads_numa (247 ms)
38: [----------] 1 test from defaultdevicetypeinit (247 ms total)
38: 
38: [----------] Global test environment tear-down
38: [==========] 1 test from 1 test suite ran. (247 ms total)
38: [  PASSED  ] 1 test.
38/61 Test #38: KokkosCore_UnitTest_DefaultInit_14 ...........   Passed    0.31 sec
test 39
      Start 39: KokkosCore_UnitTest_DefaultInit_15

39: Test command: /var/jenkins/workspace/Kokkos/build/core/unit_test/KokkosCore_UnitTest_DefaultInit_15
39: Test timeout computed to be: 1500
39: [==========] Running 1 test from 1 test suite.
39: [----------] Global test environment set-up.
39: [----------] 1 test from defaultdevicetypeinit
39: [ RUN      ] defaultdevicetypeinit.initstruct_device
39: [       OK ] defaultdevicetypeinit.initstruct_device (280 ms)
39: [----------] 1 test from defaultdevicetypeinit (280 ms total)
39: 
39: [----------] Global test environment tear-down
39: [==========] 1 test from 1 test suite ran. (280 ms total)
39: [  PASSED  ] 1 test.
39/61 Test #39: KokkosCore_UnitTest_DefaultInit_15 ...........   Passed    0.35 sec
test 40
      Start 40: KokkosCore_UnitTest_DefaultInit_16

40: Test command: /var/jenkins/workspace/Kokkos/build/core/unit_test/KokkosCore_UnitTest_DefaultInit_16
40: Test timeout computed to be: 1500
40: [==========] Running 1 test from 1 test suite.
40: [----------] Global test environment set-up.
40: [----------] 1 test from defaultdevicetypeinit
40: [ RUN      ] defaultdevicetypeinit.initstruct_nthreads_device
40: [       OK ] defaultdevicetypeinit.initstruct_nthreads_device (267 ms)
40: [----------] 1 test from defaultdevicetypeinit (267 ms total)
40: 
40: [----------] Global test environment tear-down
40: [==========] 1 test from 1 test suite ran. (267 ms total)
40: [  PASSED  ] 1 test.
40/61 Test #40: KokkosCore_UnitTest_DefaultInit_16 ...........   Passed    0.33 sec
test 41
      Start 41: KokkosCore_UnitTest_DefaultInit_17

41: Test command: /var/jenkins/workspace/Kokkos/build/core/unit_test/KokkosCore_UnitTest_DefaultInit_17
41: Test timeout computed to be: 1500
41: [==========] Running 1 test from 1 test suite.
41: [----------] Global test environment set-up.
41: [----------] 1 test from defaultdevicetypeinit
41: [ RUN      ] defaultdevicetypeinit.initstruct_nthreads_numa_device
41: [       OK ] defaultdevicetypeinit.initstruct_nthreads_numa_device (248 ms)
41: [----------] 1 test from defaultdevicetypeinit (248 ms total)
41: 
41: [----------] Global test environment tear-down
41: [==========] 1 test from 1 test suite ran. (248 ms total)
41: [  PASSED  ] 1 test.
41/61 Test #41: KokkosCore_UnitTest_DefaultInit_17 ...........   Passed    0.32 sec
test 42
      Start 42: KokkosCore_UnitTest_DefaultInit_18

42: Test command: /var/jenkins/workspace/Kokkos/build/core/unit_test/KokkosCore_UnitTest_DefaultInit_18
42: Test timeout computed to be: 1500
42: [==========] Running 1 test from 1 test suite.
42: [----------] Global test environment set-up.
42: [----------] 1 test from defaultdevicetypeinit
42: [ RUN      ] defaultdevicetypeinit.initstruct_nthreads_numa_device_tune
42: [       OK ] defaultdevicetypeinit.initstruct_nthreads_numa_device_tune (243 ms)
42: [----------] 1 test from defaultdevicetypeinit (243 ms total)
42: 
42: [----------] Global test environment tear-down
42: [==========] 1 test from 1 test suite ran. (243 ms total)
42: [  PASSED  ] 1 test.
42/61 Test #42: KokkosCore_UnitTest_DefaultInit_18 ...........   Passed    0.31 sec
test 43
      Start 43: KokkosCore_IncrementalTest_CUDA

43: Test command: /var/jenkins/workspace/Kokkos/build/core/unit_test/KokkosCore_IncrementalTest_CUDA
43: Test timeout computed to be: 1500
43: [==========] Running 28 tests from 1 test suite.
43: [----------] Global test environment set-up.
43: [----------] 28 tests from CUDA
43: [ RUN      ] CUDA.IncrTest_01_execspace_typedef
43: [       OK ] CUDA.IncrTest_01_execspace_typedef (0 ms)
43: [ RUN      ] CUDA.IncrTest_01_execspace
43: Device Execution Space:
43:   KOKKOS_ENABLE_CUDA: yes
43: Cuda Atomics:
43:   KOKKOS_ENABLE_CUDA_ATOMICS: no
43: Cuda Options:
43:   KOKKOS_ENABLE_CUDA_LAMBDA: yes
43:   KOKKOS_ENABLE_CUDA_LDG_INTRINSIC: yes
43:   KOKKOS_ENABLE_CUDA_RELOCATABLE_DEVICE_CODE: no
43:   KOKKOS_ENABLE_CUDA_UVM: no
43:   KOKKOS_ENABLE_CXX11_DISPATCH_LAMBDA: yes
43: 
43: Cuda Runtime Configuration:
43: macro  KOKKOS_ENABLE_CUDA      : defined
43: macro  CUDA_VERSION          = 10010 = version 10.1
43: Kokkos::Cuda[ 0 ] Tesla V100-PCIE-32GB capability 7.0, Total Global Memory: 31.75 G, Shared Memory per Block: 48 K : Selected
43: Cuda
43: [       OK ] CUDA.IncrTest_01_execspace (0 ms)
43: [ RUN      ] CUDA.IncrTest_02_AtomicExchange
43: [       OK ] CUDA.IncrTest_02_AtomicExchange (0 ms)
43: [ RUN      ] CUDA.IncrTest_02_AtomicAdd
43: [       OK ] CUDA.IncrTest_02_AtomicAdd (0 ms)
43: [ RUN      ] CUDA.IncrTest_02_AtomicSub
43: [       OK ] CUDA.IncrTest_02_AtomicSub (0 ms)
43: [ RUN      ] CUDA.IncrTest_03a_memspace_malloc
43: [       OK ] CUDA.IncrTest_03a_memspace_malloc (0 ms)
43: [ RUN      ] CUDA.IncrTest_03b_memspace_free
43: [       OK ] CUDA.IncrTest_03b_memspace_free (31575 ms)
43: [ RUN      ] CUDA.IncrTest_04_simple_parallelFor
43: [       OK ] CUDA.IncrTest_04_simple_parallelFor (0 ms)
43: [ RUN      ] CUDA.IncrTest_04_RangePolicy_parallelFor
43: [       OK ] CUDA.IncrTest_04_RangePolicy_parallelFor (0 ms)
43: [ RUN      ] CUDA.IncrTest_05_reduction
43: [       OK ] CUDA.IncrTest_05_reduction (4 ms)
43: [ RUN      ] CUDA.IncrTest_06_mdrange2D
43: [       OK ] CUDA.IncrTest_06_mdrange2D (0 ms)
43: [ RUN      ] CUDA.IncrTest_06_mdrange3D
43: [       OK ] CUDA.IncrTest_06_mdrange3D (0 ms)
43: [ RUN      ] CUDA.IncrTest_06_mdrange4D
43: [       OK ] CUDA.IncrTest_06_mdrange4D (0 ms)
43: [ RUN      ] CUDA.IncrTest_08_deep_copy_2D
43: [       OK ] CUDA.IncrTest_08_deep_copy_2D (0 ms)
43: [ RUN      ] CUDA.IncrTest_08_deep_copy_3D
43: [       OK ] CUDA.IncrTest_08_deep_copy_3D (0 ms)
43: [ RUN      ] CUDA.IncrTest_08_deep_copy_4D
43: [       OK ] CUDA.IncrTest_08_deep_copy_4D (0 ms)
43: [ RUN      ] CUDA.IncrTest_10_Hierarchical_Basics
43: [       OK ] CUDA.IncrTest_10_Hierarchical_Basics (0 ms)
43: [ RUN      ] CUDA.IncrTest_11a_Hierarchical_ForLoop
43: [       OK ] CUDA.IncrTest_11a_Hierarchical_ForLoop (1 ms)
43: [ RUN      ] CUDA.IncrTest_11b_Hierarchical_ForLoop
43: [       OK ] CUDA.IncrTest_11b_Hierarchical_ForLoop (1 ms)
43: [ RUN      ] CUDA.IncrTest_11c_Hierarchical_ForLoop
43: [       OK ] CUDA.IncrTest_11c_Hierarchical_ForLoop (1352 ms)
43: [ RUN      ] CUDA.IncrTest_12a_ThreadScratch
43: [       OK ] CUDA.IncrTest_12a_ThreadScratch (4 ms)
43: [ RUN      ] CUDA.IncrTest_12b_TeamScratch
43: [       OK ] CUDA.IncrTest_12b_TeamScratch (1 ms)
43: [ RUN      ] CUDA.IncrTest_13a_Hierarchical_Red
43: [       OK ] CUDA.IncrTest_13a_Hierarchical_Red (0 ms)
43: [ RUN      ] CUDA.IncrTest_13b_Hierarchical_Red
43: [       OK ] CUDA.IncrTest_13b_Hierarchical_Red (0 ms)
43: [ RUN      ] CUDA.IncrTest_13c_Hierarchical_Red
43: [       OK ] CUDA.IncrTest_13c_Hierarchical_Red (0 ms)
43: [ RUN      ] CUDA.incr_14_MDrangeReduce
43: [       OK ] CUDA.incr_14_MDrangeReduce (0 ms)
43: [ RUN      ] CUDA.IncrTest_16_parallelscan
43: [       OK ] CUDA.IncrTest_16_parallelscan (5 ms)
43: [ RUN      ] CUDA.incr_17_atomicView
43: [       OK ] CUDA.incr_17_atomicView (0 ms)
43: [----------] 28 tests from CUDA (32953 ms total)
43: 
43: [----------] Global test environment tear-down
43: [==========] 28 tests from 1 test suite ran. (32953 ms total)
43: [  PASSED  ] 28 tests.
43/61 Test #43: KokkosCore_IncrementalTest_CUDA ..............   Passed   33.29 sec
test 44
      Start 44: KokkosCore_IncrementalTest_SERIAL

44: Test command: /var/jenkins/workspace/Kokkos/build/core/unit_test/KokkosCore_IncrementalTest_SERIAL
44: Test timeout computed to be: 1500
44: [==========] Running 28 tests from 1 test suite.
44: [----------] Global test environment set-up.
44: [----------] 28 tests from SERIAL
44: [ RUN      ] SERIAL.IncrTest_01_execspace_typedef
44: [       OK ] SERIAL.IncrTest_01_execspace_typedef (0 ms)
44: [ RUN      ] SERIAL.IncrTest_01_execspace
44: Host Serial Execution Space:
44:   KOKKOS_ENABLE_SERIAL: yes
44: Serial Atomics:
44:   KOKKOS_ENABLE_SERIAL_ATOMICS: no
44: 
44: Serial Runtime Configuration:
44: Serial
44: [       OK ] SERIAL.IncrTest_01_execspace (0 ms)
44: [ RUN      ] SERIAL.IncrTest_02_AtomicExchange
44: [       OK ] SERIAL.IncrTest_02_AtomicExchange (0 ms)
44: [ RUN      ] SERIAL.IncrTest_02_AtomicAdd
44: [       OK ] SERIAL.IncrTest_02_AtomicAdd (0 ms)
44: [ RUN      ] SERIAL.IncrTest_02_AtomicSub
44: [       OK ] SERIAL.IncrTest_02_AtomicSub (0 ms)
44: [ RUN      ] SERIAL.IncrTest_03a_memspace_malloc
44: [       OK ] SERIAL.IncrTest_03a_memspace_malloc (0 ms)
44: [ RUN      ] SERIAL.IncrTest_03b_memspace_free
44: [       OK ] SERIAL.IncrTest_03b_memspace_free (134 ms)
44: [ RUN      ] SERIAL.IncrTest_04_simple_parallelFor
44: [       OK ] SERIAL.IncrTest_04_simple_parallelFor (0 ms)
44: [ RUN      ] SERIAL.IncrTest_04_RangePolicy_parallelFor
44: [       OK ] SERIAL.IncrTest_04_RangePolicy_parallelFor (0 ms)
44: [ RUN      ] SERIAL.IncrTest_05_reduction
44: [       OK ] SERIAL.IncrTest_05_reduction (0 ms)
44: [ RUN      ] SERIAL.IncrTest_06_mdrange2D
44: [       OK ] SERIAL.IncrTest_06_mdrange2D (0 ms)
44: [ RUN      ] SERIAL.IncrTest_06_mdrange3D
44: [       OK ] SERIAL.IncrTest_06_mdrange3D (0 ms)
44: [ RUN      ] SERIAL.IncrTest_06_mdrange4D
44: [       OK ] SERIAL.IncrTest_06_mdrange4D (0 ms)
44: [ RUN      ] SERIAL.IncrTest_08_deep_copy_2D
44: [       OK ] SERIAL.IncrTest_08_deep_copy_2D (0 ms)
44: [ RUN      ] SERIAL.IncrTest_08_deep_copy_3D
44: [       OK ] SERIAL.IncrTest_08_deep_copy_3D (0 ms)
44: [ RUN      ] SERIAL.IncrTest_08_deep_copy_4D
44: [       OK ] SERIAL.IncrTest_08_deep_copy_4D (0 ms)
44: [ RUN      ] SERIAL.IncrTest_10_Hierarchical_Basics
44: [       OK ] SERIAL.IncrTest_10_Hierarchical_Basics (0 ms)
44: [ RUN      ] SERIAL.IncrTest_11a_Hierarchical_ForLoop
44: [       OK ] SERIAL.IncrTest_11a_Hierarchical_ForLoop (0 ms)
44: [ RUN      ] SERIAL.IncrTest_11b_Hierarchical_ForLoop
44: [       OK ] SERIAL.IncrTest_11b_Hierarchical_ForLoop (0 ms)
44: [ RUN      ] SERIAL.IncrTest_11c_Hierarchical_ForLoop
44: [       OK ] SERIAL.IncrTest_11c_Hierarchical_ForLoop (544 ms)
44: [ RUN      ] SERIAL.IncrTest_12a_ThreadScratch
44: [       OK ] SERIAL.IncrTest_12a_ThreadScratch (0 ms)
44: [ RUN      ] SERIAL.IncrTest_12b_TeamScratch
44: [       OK ] SERIAL.IncrTest_12b_TeamScratch (5 ms)
44: [ RUN      ] SERIAL.IncrTest_13a_Hierarchical_Red
44: [       OK ] SERIAL.IncrTest_13a_Hierarchical_Red (0 ms)
44: [ RUN      ] SERIAL.IncrTest_13b_Hierarchical_Red
44: [       OK ] SERIAL.IncrTest_13b_Hierarchical_Red (0 ms)
44: [ RUN      ] SERIAL.IncrTest_13c_Hierarchical_Red
44: [       OK ] SERIAL.IncrTest_13c_Hierarchical_Red (0 ms)
44: [ RUN      ] SERIAL.incr_14_MDrangeReduce
44: [       OK ] SERIAL.incr_14_MDrangeReduce (0 ms)
44: [ RUN      ] SERIAL.IncrTest_16_parallelscan
44: [       OK ] SERIAL.IncrTest_16_parallelscan (0 ms)
44: [ RUN      ] SERIAL.incr_17_atomicView
44: [       OK ] SERIAL.incr_17_atomicView (0 ms)
44: [----------] 28 tests from SERIAL (688 ms total)
44: 
44: [----------] Global test environment tear-down
44: [==========] 28 tests from 1 test suite ran. (688 ms total)
44: [  PASSED  ] 28 tests.
44/61 Test #44: KokkosCore_IncrementalTest_SERIAL ............   Passed    1.04 sec
test 45
      Start 45: KokkosCore_UnitTest_CTestDevice

45: Test command: /var/jenkins/workspace/Kokkos/build/core/unit_test/KokkosCore_UnitTest_CTestDevice
45: Test timeout computed to be: 1500
45: [==========] Running 8 tests from 1 test suite.
45: [----------] Global test environment set-up.
45: [----------] 8 tests from ctest_environment
45: [ RUN      ] ctest_environment.no_device_type
45: [       OK ] ctest_environment.no_device_type (0 ms)
45: [ RUN      ] ctest_environment.no_process_count
45: [       OK ] ctest_environment.no_process_count (0 ms)
45: [ RUN      ] ctest_environment.invalid_rank
45: [       OK ] ctest_environment.invalid_rank (0 ms)
45: [ RUN      ] ctest_environment.no_type_str
45: [       OK ] ctest_environment.no_type_str (0 ms)
45: [ RUN      ] ctest_environment.missing_type
45: [       OK ] ctest_environment.missing_type (0 ms)
45: [ RUN      ] ctest_environment.no_id_str
45: [       OK ] ctest_environment.no_id_str (0 ms)
45: [ RUN      ] ctest_environment.invalid_id_str
45: [       OK ] ctest_environment.invalid_id_str (0 ms)
45: [ RUN      ] ctest_environment.good
45: [       OK ] ctest_environment.good (0 ms)
45: [----------] 8 tests from ctest_environment (1 ms total)
45: 
45: [----------] Global test environment tear-down
45: [==========] 8 tests from 1 test suite ran. (1 ms total)
45: [  PASSED  ] 8 tests.
45/61 Test #45: KokkosCore_UnitTest_CTestDevice ..............   Passed    0.02 sec
test 46
      Start 46: KokkosCore_UnitTest_CMakePassCmdLineArgs0

46: Test command: /var/jenkins/workspace/Kokkos/build/core/unit_test/KokkosCore_UnitTest_CMakePassCmdLineArgs "one" "2" "THREE"
46: Test timeout computed to be: 1500
46/61 Test #46: KokkosCore_UnitTest_CMakePassCmdLineArgs0 ....   Passed    0.01 sec
test 47
      Start 47: KokkosCore_PerfTestExec

47: Test command: /var/jenkins/workspace/Kokkos/build/core/perf_test/KokkosCore_PerfTestExec
47: Test timeout computed to be: 1500
47: [==========] Running 37 tests from 1 test suite.
47: [----------] Global test environment set-up.
47: [----------] 37 tests from default_exec
47: [ RUN      ] default_exec.gramschmidt
47: "GramSchmidt< double , Cuda >" , 1024 , 0.00733177 , 7.15994e-06, 0.00792278
47: "GramSchmidt< double , Cuda >" , 2048 , 0.00680756 , 3.32401e-06, 0.00712567
47: "GramSchmidt< double , Cuda >" , 4096 , 0.00694099 , 1.69458e-06, 0.00737976
47: "GramSchmidt< double , Cuda >" , 8192 , 0.00700942 , 8.55642e-07, 0.00749389
47: "GramSchmidt< double , Cuda >" , 16384 , 0.0072038 , 4.39685e-07, 0.00749145
47: "GramSchmidt< double , Cuda >" , 32768 , 0.00687712 , 2.09873e-07, 0.0073189
47: "GramSchmidt< double , Cuda >" , 65536 , 0.00704306 , 1.07469e-07, 0.00728081
47: "GramSchmidt< double , Cuda >" , 131072 , 0.00790191 , 6.02868e-08, 0.00832636
47: "GramSchmidt< double , Cuda >" , 262144 , 0.0104413 , 3.98305e-08, 0.0104794
47: "GramSchmidt< double , Cuda >" , 524288 , 0.0202182 , 3.85631e-08, 0.0202456
47: [       OK ] default_exec.gramschmidt (2796 ms)
47: [ RUN      ] default_exec.hexgrad
47: "HexGrad< double , Cuda >" , 1024 , 1.9315e-05 , 1.88623e-083.03736e-05
47: "HexGrad< double , Cuda >" , 2048 , 1.9675e-05 , 9.60693e-092.54726e-05
47: "HexGrad< double , Cuda >" , 4096 , 1.8829e-05 , 4.59692e-092.11694e-05
47: "HexGrad< double , Cuda >" , 8192 , 1.9221e-05 , 2.34631e-091.95618e-05
47: "HexGrad< double , Cuda >" , 16384 , 2.3614e-05 , 1.44128e-092.89882e-05
47: "HexGrad< double , Cuda >" , 32768 , 3.777e-05 , 1.15265e-093.88616e-05
47: "HexGrad< double , Cuda >" , 65536 , 5.8893e-05 , 8.98636e-106.1556e-05
47: "HexGrad< double , Cuda >" , 131072 , 9.0781e-05 , 6.92604e-109.43022e-05
47: "HexGrad< double , Cuda >" , 262144 , 0.000169929 , 6.48228e-100.000185927
47: "HexGrad< double , Cuda >" , 524288 , 0.000355511 , 6.78083e-100.000383059
47: [       OK ] default_exec.hexgrad (62 ms)
47: [ RUN      ] default_exec.custom_reduction
47: 3.683955e-03 2.022441e+02 1.150000e+01
47: [       OK ] default_exec.custom_reduction (14 ms)
47: [ RUN      ] default_exec.overlap_range_policy
47: Time RangePolicy: NonOverlap: 0.086751 Time Overlap: 0.041903
47: Time RangePolicy Reduce: NonOverlap: 0.064242 Time Overlap: 0.030053
47: [       OK ] default_exec.overlap_range_policy (462 ms)
47: [ RUN      ] default_exec.overlap_mdrange_policy
47: Time MDRangePolicy: NonOverlap: 0.006704 Time Overlap: 0.003381
47: Time MDRangePolicy Reduce: NonOverlap: 0.001428 Time Overlap: 0.000744
47: [       OK ] default_exec.overlap_mdrange_policy (30 ms)
47: [ RUN      ] default_exec.overlap_team_policy
47: Time TeamPolicy: NonOverlap: 0.070018 Time Overlap: 0.033507
47: Time TeamPolicy Reduce: NonOverlap: 0.058145 Time Overlap: 0.028285
47: [       OK ] default_exec.overlap_team_policy (388 ms)
47: [ RUN      ] default_exec.ViewDeepCopy_LeftLeft_Rank123
47: DeepCopy Performance for LayoutLeft to LayoutLeft:
47:    Raw:   0.002239 s   762.939453 MB   665.584894 GB/s
47:    Rank1: 0.002119 s   762.939453 MB   703.059732 GB/s
47:    Rank2: 0.002250 s   762.939453 MB   662.244986 GB/s
47:    Rank3: 0.002255 s   762.939453 MB   660.914403 GB/s
47: [       OK ] default_exec.ViewDeepCopy_LeftLeft_Rank123 (38 ms)
47: [ RUN      ] default_exec.ViewDeepCopy_RightRight_Rank123
47: DeepCopy Performance for LayoutRight to LayoutRight:
47:    Raw:   0.002249 s   762.939453 MB   662.645207 GB/s
47:    Rank1: 0.002307 s   762.939453 MB   645.778356 GB/s
47:    Rank2: 0.002265 s   762.939453 MB   657.911439 GB/s
47:    Rank3: 0.002272 s   762.939453 MB   655.716953 GB/s
47: [       OK ] default_exec.ViewDeepCopy_RightRight_Rank123 (40 ms)
47: [ RUN      ] default_exec.ViewDeepCopy_LeftRight_Rank123
47: DeepCopy Performance for LayoutLeft to LayoutRight:
47:    Raw:   0.002182 s   762.939453 MB   682.881370 GB/s
47:    Rank1: 0.002263 s   762.939453 MB   658.387879 GB/s
47:    Rank2: 0.005765 s   762.939453 MB   258.487463 GB/s
47:    Rank3: 0.012278 s   762.939453 MB   121.361228 GB/s
47: [       OK ] default_exec.ViewDeepCopy_LeftRight_Rank123 (53 ms)
47: [ RUN      ] default_exec.ViewDeepCopy_RightLeft_Rank123
47: DeepCopy Performance for LayoutRight to LayoutLeft:
47:    Raw:   0.002187 s   762.939453 MB   681.365386 GB/s
47:    Rank1: 0.002255 s   762.939453 MB   660.710736 GB/s
47:    Rank2: 0.005279 s   762.939453 MB   282.269963 GB/s
47:    Rank3: 0.008112 s   762.939453 MB   183.702825 GB/s
47: [       OK ] default_exec.ViewDeepCopy_RightLeft_Rank123 (52 ms)
47: [ RUN      ] default_exec.ViewDeepCopy_LeftLeft_Rank45
47: DeepCopy Performance for LayoutLeft to LayoutLeft:
47:    Raw:   0.002225 s   762.939453 MB   669.678691 GB/s
47:    Rank4: 0.002271 s   762.939453 MB   656.129253 GB/s
47:    Rank5: 0.002266 s   762.939453 MB   657.587715 GB/s
47: [       OK ] default_exec.ViewDeepCopy_LeftLeft_Rank45 (31 ms)
47: [ RUN      ] default_exec.ViewDeepCopy_RightRight_Rank45
47: DeepCopy Performance for LayoutRight to LayoutRight:
47:    Raw:   0.002248 s   762.939453 MB   662.930869 GB/s
47:    Rank4: 0.002264 s   762.939453 MB   658.061651 GB/s
47:    Rank5: 0.002269 s   762.939453 MB   656.867954 GB/s
47: [       OK ] default_exec.ViewDeepCopy_RightRight_Rank45 (31 ms)
47: [ RUN      ] default_exec.ViewDeepCopy_LeftRight_Rank45
47: DeepCopy Performance for LayoutLeft to LayoutRight:
47:    Raw:   0.002206 s   762.939453 MB   675.606091 GB/s
47:    Rank4: 0.013202 s   762.939453 MB   112.870107 GB/s
47:    Rank5: 0.023538 s   762.939453 MB   63.307928 GB/s
47: [       OK ] default_exec.ViewDeepCopy_LeftRight_Rank45 (63 ms)
47: [ RUN      ] default_exec.ViewDeepCopy_RightLeft_Rank45
47: DeepCopy Performance for LayoutRight to LayoutLeft:
47:    Raw:   0.002209 s   762.939453 MB   674.541187 GB/s
47:    Rank4: 0.010410 s   762.939453 MB   143.142951 GB/s
47:    Rank5: 0.021328 s   762.939453 MB   69.867659 GB/s
47: [       OK ] default_exec.ViewDeepCopy_RightLeft_Rank45 (59 ms)
47: [ RUN      ] default_exec.ViewDeepCopy_LeftLeft_Rank6
47: DeepCopy Performance for LayoutLeft to LayoutLeft:
47:    Raw:   0.002223 s   762.939453 MB   670.189514 GB/s
47:    Rank6: 0.002262 s   762.939453 MB   658.620973 GB/s
47: [       OK ] default_exec.ViewDeepCopy_LeftLeft_Rank6 (86 ms)
47: [ RUN      ] default_exec.ViewDeepCopy_RightRight_Rank6
47: DeepCopy Performance for LayoutRight to LayoutRight:
47:    Raw:   0.002226 s   762.939453 MB   669.403724 GB/s
47:    Rank6: 0.002254 s   762.939453 MB   661.123769 GB/s
47: [       OK ] default_exec.ViewDeepCopy_RightRight_Rank6 (88 ms)
47: [ RUN      ] default_exec.ViewDeepCopy_LeftRight_Rank6
47: DeepCopy Performance for LayoutLeft to LayoutRight:
47:    Raw:   0.002192 s   762.939453 MB   679.805873 GB/s
47:    Rank6: 0.030437 s   762.939453 MB   48.956783 GB/s
47: [       OK ] default_exec.ViewDeepCopy_LeftRight_Rank6 (83 ms)
47: [ RUN      ] default_exec.ViewDeepCopy_RightLeft_Rank6
47: DeepCopy Performance for LayoutRight to LayoutLeft:
47:    Raw:   0.002189 s   762.939453 MB   680.753101 GB/s
47:    Rank6: 0.026340 s   762.939453 MB   56.572007 GB/s
47: [       OK ] default_exec.ViewDeepCopy_RightLeft_Rank6 (82 ms)
47: [ RUN      ] default_exec.ViewDeepCopy_LeftLeft_Rank7
47: DeepCopy Performance for LayoutLeft to LayoutLeft:
47:    Raw:   0.002277 s   762.939453 MB   654.461595 GB/s
47:    Rank7: 0.002305 s   762.939453 MB   646.610623 GB/s
47: [       OK ] default_exec.ViewDeepCopy_LeftLeft_Rank7 (80 ms)
47: [ RUN      ] default_exec.ViewDeepCopy_RightRight_Rank7
47: DeepCopy Performance for LayoutRight to LayoutRight:
47:    Raw:   0.002247 s   762.939453 MB   663.062433 GB/s
47:    Rank7: 0.002276 s   762.939453 MB   654.608223 GB/s
47: [       OK ] default_exec.ViewDeepCopy_RightRight_Rank7 (88 ms)
47: [ RUN      ] default_exec.ViewDeepCopy_LeftRight_Rank7
47: DeepCopy Performance for LayoutLeft to LayoutRight:
47:    Raw:   0.002202 s   762.939453 MB   676.758877 GB/s
47:    Rank7: 0.017989 s   762.939453 MB   82.835136 GB/s
47: [       OK ] default_exec.ViewDeepCopy_LeftRight_Rank7 (107 ms)
47: [ RUN      ] default_exec.ViewDeepCopy_RightLeft_Rank7
47: DeepCopy Performance for LayoutRight to LayoutLeft:
47:    Raw:   0.002214 s   762.939453 MB   673.193022 GB/s
47:    Rank7: 0.009931 s   762.939453 MB   150.043839 GB/s
47: [       OK ] default_exec.ViewDeepCopy_RightLeft_Rank7 (89 ms)
47: [ RUN      ] default_exec.ViewDeepCopy_LeftLeft_Rank8
47: DeepCopy Performance for LayoutLeft to LayoutLeft:
47:    Raw:   0.002298 s   762.939453 MB   648.418990 GB/s
47:    Rank8: 0.002263 s   762.939453 MB   658.552279 GB/s
47: [       OK ] default_exec.ViewDeepCopy_LeftLeft_Rank8 (88 ms)
47: [ RUN      ] default_exec.ViewDeepCopy_RightRight_Rank8
47: DeepCopy Performance for LayoutRight to LayoutRight:
47:    Raw:   0.002264 s   762.939453 MB   658.141289 GB/s
47:    Rank8: 0.002273 s   762.939453 MB   655.619439 GB/s
47: [       OK ] default_exec.ViewDeepCopy_RightRight_Rank8 (86 ms)
47: [ RUN      ] default_exec.ViewDeepCopy_LeftRight_Rank8
47: DeepCopy Performance for LayoutLeft to LayoutRight:
47:    Raw:   0.002206 s   762.939453 MB   675.556778 GB/s
47:    Rank8: 0.021399 s   762.939453 MB   69.634747 GB/s
47: [       OK ] default_exec.ViewDeepCopy_LeftRight_Rank8 (74 ms)
47: [ RUN      ] default_exec.ViewDeepCopy_RightLeft_Rank8
47: DeepCopy Performance for LayoutRight to LayoutLeft:
47:    Raw:   0.002185 s   762.939453 MB   681.823374 GB/s
47:    Rank8: 0.008080 s   762.939453 MB   184.415724 GB/s
47: [       OK ] default_exec.ViewDeepCopy_RightLeft_Rank8 (83 ms)
47: [ RUN      ] default_exec.ViewCreate
47: Create View Performance for LayoutLeft:
47:    Raw:   0.040252 s   762.939453 MB   18.510034 GB/s
47:    Rank1: 0.037709 s   762.939453 MB   19.758110 GB/s
47:    Rank2: 0.004144 s   762.939453 MB   179.810140 GB/s
47:    Rank3: 0.039967 s   762.939453 MB   18.641846 GB/s
47:    Rank4: 0.004184 s   762.939453 MB   178.080088 GB/s
47:    Rank5: 0.038823 s   762.939453 MB   19.191296 GB/s
47:    Rank6: 0.004178 s   762.939453 MB   178.308522 GB/s
47:    Rank7: 0.040030 s   762.939453 MB   18.612318 GB/s
47:    Rank8: 0.004140 s   762.939453 MB   179.966932 GB/s
47: Create View Performance for LayoutRight:
47:    Raw:   0.004559 s   762.939453 MB   163.437164 GB/s
47:    Rank1: 0.003840 s   762.939453 MB   194.010986 GB/s
47:    Rank2: 0.039918 s   762.939453 MB   18.664486 GB/s
47:    Rank3: 0.004123 s   762.939453 MB   180.726162 GB/s
47:    Rank4: 0.039893 s   762.939453 MB   18.676618 GB/s
47:    Rank5: 0.004323 s   762.939453 MB   172.364882 GB/s
47:    Rank6: 0.039814 s   762.939453 MB   18.713452 GB/s
47:    Rank7: 0.004225 s   762.939453 MB   176.347691 GB/s
47:    Rank8: 0.041024 s   762.939453 MB   18.161582 GB/s
47: [       OK ] default_exec.ViewCreate (395 ms)
47: [ RUN      ] default_exec.ViewFill_Rank123
47: ViewFill Performance for LayoutLeft:
47:    Raw:   0.001290 s   762.939453 MB   577.762349 GB/s
47:    Rank1: 0.001333 s   762.939453 MB   559.036027 GB/s
47:    Rank2: 0.001327 s   762.939453 MB   561.566278 GB/s
47:    Rank3: 0.001304 s   762.939453 MB   571.346893 GB/s
47: ViewFill Performance for LayoutRight:
47:    Raw:   0.001286 s   762.939453 MB   579.497393 GB/s
47:    Rank1: 0.001273 s   762.939453 MB   585.370231 GB/s
47:    Rank2: 0.001272 s   762.939453 MB   585.861365 GB/s
47:    Rank3: 0.001302 s   762.939453 MB   572.052726 GB/s
47: [       OK ] default_exec.ViewFill_Rank123 (177 ms)
47: [ RUN      ] default_exec.ViewFill_Rank45
47: ViewFill Performance for LayoutLeft:
47:    Raw:   0.001301 s   762.939453 MB   572.890225 GB/s
47:    Rank4: 0.001281 s   762.939453 MB   581.678523 GB/s
47:    Rank5: 0.001282 s   762.939453 MB   581.068818 GB/s
47: ViewFill Performance for LayoutRight:
47:    Raw:   0.001281 s   762.939453 MB   581.628573 GB/s
47:    Rank4: 0.001271 s   762.939453 MB   586.134215 GB/s
47:    Rank5: 0.001312 s   762.939453 MB   568.070130 GB/s
47: [       OK ] default_exec.ViewFill_Rank45 (132 ms)
47: [ RUN      ] default_exec.ViewFill_Rank6
47: ViewFill Performance for LayoutLeft:
47:    Raw:   0.001315 s   762.939453 MB   566.708191 GB/s
47:    Rank6: 0.001294 s   762.939453 MB   575.954839 GB/s
47: ViewFill Performance for LayoutRight:
47:    Raw:   0.001293 s   762.939453 MB   576.192691 GB/s
47:    Rank6: 0.001270 s   762.939453 MB   586.702391 GB/s
47: [       OK ] default_exec.ViewFill_Rank6 (89 ms)
47: [ RUN      ] default_exec.ViewFill_Rank7
47: ViewFill Performance for LayoutLeft:
47:    Raw:   0.001323 s   762.939453 MB   563.347931 GB/s
47:    Rank7: 0.001273 s   762.939453 MB   585.506856 GB/s
47: ViewFill Performance for LayoutRight:
47:    Raw:   0.001280 s   762.939453 MB   581.961581 GB/s
47:    Rank7: 0.001280 s   762.939453 MB   582.186224 GB/s
47: [       OK ] default_exec.ViewFill_Rank7 (87 ms)
47: [ RUN      ] default_exec.ViewFill_Rank8
47: ViewFill Performance for LayoutLeft:
47:    Raw:   0.001322 s   762.939453 MB   563.488105 GB/s
47:    Rank8: 0.001283 s   762.939453 MB   580.887152 GB/s
47: ViewFill Performance for LayoutRight:
47:    Raw:   0.001287 s   762.939453 MB   578.992569 GB/s
47:    Rank8: 0.001282 s   762.939453 MB   581.078335 GB/s
47: [       OK ] default_exec.ViewFill_Rank8 (88 ms)
47: [ RUN      ] default_exec.ViewResize_Rank123
47: Resize View Performance for LayoutLeft:
47:    Raw:   0.006235 s   762.939453 MB   238.973801 GB/s
47:    Rank1: 0.047538 s   762.939453 MB   31.345849 GB/s
47:    Rank2: 0.043140 s   762.939453 MB   34.541191 GB/s
47:    Rank3: 0.044784 s   762.939453 MB   33.273562 GB/s
47:    Rank1 (WithoutInitializing): 0.032790 s   762.939453 MB   45.444683 GB/s
47:    Rank2 (WithoutInitializing): 0.043196 s   762.939453 MB   34.496577 GB/s
47:    Rank3 (WithoutInitializing): 0.088810 s   762.939453 MB   16.778604 GB/s
47: Resize View Performance for LayoutRight:
47:    Raw:   0.005700 s   762.939453 MB   261.411681 GB/s
47:    Rank1: 0.045028 s   762.939453 MB   33.093175 GB/s
47:    Rank2: 0.089505 s   762.939453 MB   16.648346 GB/s
47:    Rank3: 0.014769 s   762.939453 MB   100.892970 GB/s
47:    Rank1 (WithoutInitializing): 0.036966 s   762.939453 MB   40.310909 GB/s
47:    Rank2 (WithoutInitializing): 0.044206 s   762.939453 MB   33.708528 GB/s
47:    Rank3 (WithoutInitializing): 0.013107 s   762.939453 MB   113.691608 GB/s
47: [       OK ] default_exec.ViewResize_Rank123 (705 ms)
47: [ RUN      ] default_exec.ViewResize_Rank_45
47: Resize View Performance for LayoutLeft:
47:    Raw:   0.005591 s   762.939453 MB   266.514399 GB/s
47:    Rank4: 0.017101 s   762.939453 MB   87.135214 GB/s
47:    Rank5: 0.029477 s   762.939453 MB   50.552150 GB/s
47:    Rank4 (WithoutInitializing): 0.045283 s   762.939453 MB   32.906898 GB/s
47:    Rank5 (WithoutInitializing): 0.052623 s   762.939453 MB   28.316593 GB/s
47: Resize View Performance for LayoutRight:
47:    Raw:   0.010970 s   762.939453 MB   135.836603 GB/s
47:    Rank4: 0.061077 s   762.939453 MB   24.397408 GB/s
47:    Rank5: 0.078128 s   762.939453 MB   19.072768 GB/s
47:    Rank4 (WithoutInitializing): 0.016533 s   762.939453 MB   90.130615 GB/s
47:    Rank5 (WithoutInitializing): 0.029828 s   762.939453 MB   49.957158 GB/s
47: [       OK ] default_exec.ViewResize_Rank_45 (427 ms)
47: [ RUN      ] default_exec.ViewResize_Rank6
47: Resize View Performance for LayoutLeft:
47:    Raw:   0.005618 s   762.939453 MB   265.221055 GB/s
47:    Rank6: 0.078117 s   762.939453 MB   19.075319 GB/s
47:    Rank6 (WithoutInitializing): 0.034606 s   762.939453 MB   43.060037 GB/s
47: Resize View Performance for LayoutRight:
47:    Raw:   0.005523 s   762.939453 MB   269.777957 GB/s
47:    Rank6: 0.035658 s   762.939453 MB   41.789337 GB/s
47:    Rank6 (WithoutInitializing): 0.033825 s   762.939453 MB   44.054064 GB/s
47: [       OK ] default_exec.ViewResize_Rank6 (257 ms)
47: [ RUN      ] default_exec.ViewResize_Rank7
47: Resize View Performance for LayoutLeft:
47:    Raw:   0.038164 s   762.939453 MB   39.044944 GB/s
47:    Rank7: 0.054540 s   762.939453 MB   27.321714 GB/s
47:    Rank7 (WithoutInitializing): 0.040778 s   762.939453 MB   36.542572 GB/s
47: Resize View Performance for LayoutRight:
47:    Raw:   0.034890 s   762.939453 MB   42.709352 GB/s
47:    Rank7: 0.014861 s   762.939453 MB   100.269449 GB/s
47:    Rank7 (WithoutInitializing): 0.052969 s   762.939453 MB   28.131939 GB/s
47: [       OK ] default_exec.ViewResize_Rank7 (297 ms)
47: [ RUN      ] default_exec.ViewResize_Rank8
47: Resize View Performance for LayoutLeft:
47:    Raw:   0.039110 s   762.939453 MB   38.100728 GB/s
47:    Rank8: 0.047487 s   762.939453 MB   31.379495 GB/s
47:    Rank8 (WithoutInitializing): 0.040026 s   762.939453 MB   37.228940 GB/s
47: Resize View Performance for LayoutRight:
47:    Raw:   0.038153 s   762.939453 MB   39.056169 GB/s
47:    Rank8: 0.048040 s   762.939453 MB   31.017922 GB/s
47:    Rank8 (WithoutInitializing): 0.040675 s   762.939453 MB   36.634585 GB/s
47: [       OK ] default_exec.ViewResize_Rank8 (277 ms)
47: [----------] 37 tests from default_exec (8101 ms total)
47: 
47: [----------] Global test environment tear-down
47: [==========] 37 tests from 1 test suite ran. (8101 ms total)
47: [  PASSED  ] 37 tests.
47/61 Test #47: KokkosCore_PerfTestExec ......................   Passed    8.50 sec
test 48
      Start 48: KokkosCore_PerformanceTest_Atomic

48: Test command: /var/jenkins/workspace/Kokkos/build/core/perf_test/KokkosCore_PerformanceTest_Atomic
48: Test timeout computed to be: 1500
48: Using KOKKOS_DESUL_ATOMICS
48: int                     Test 1 PASSED  --- Loop: 100000 Value (S,A,NA): 1.000000e+05 1.000000e+05 1.000000e+00 Time: 4.3810e-05 1.3851e-03 2.1876e-03 Size of Type 4)
48: int                     Test 2 PASSED  --- Loop: 100000 Value (S,A,NA): 1.000000e+05 1.000000e+05 1.000000e+00 Time: 4.0500e-05 6.4677e+00 2.0861e-03 Size of Type 4)
48: int                     Test 3 PASSED  --- Loop: 100000 Value (S,A,NA): 7.049827e+08 7.049827e+08 1.859520e+05 Time: 1.7418e-04 2.5864e-03 2.2083e-03 Size of Type 4)
48: long int                Test 1 PASSED  --- Loop: 100000 Value (S,A,NA): 1.000000e+05 1.000000e+05 4.000000e+00 Time: 3.6710e-05 6.0400e+00 1.6604e-03 Size of Type 8)
48: long int                Test 2 PASSED  --- Loop: 100000 Value (S,A,NA): 1.000000e+05 1.000000e+05 1.000000e+00 Time: 4.1650e-05 6.1632e+00 2.5213e-03 Size of Type 8)
48: long int                Test 3 PASSED  --- Loop: 100000 Value (S,A,NA): 4.999950e+09 4.999950e+09 1.881600e+05 Time: 1.3556e-04 6.1146e+00 2.3789e-03 Size of Type 8)
48: long long int           Test 1 PASSED  --- Loop: 100000 Value (S,A,NA): 1.000000e+05 1.000000e+05 4.000000e+00 Time: 3.8940e-05 6.1285e+00 1.8976e-03 Size of Type 8)
48: long long int           Test 2 PASSED  --- Loop: 100000 Value (S,A,NA): 1.000000e+05 1.000000e+05 2.000000e+00 Time: 3.7320e-05 5.9113e+00 2.0072e-03 Size of Type 8)
48: long long int           Test 3 PASSED  --- Loop: 100000 Value (S,A,NA): 4.999950e+09 4.999950e+09 1.821440e+05 Time: 1.4204e-04 6.0950e+00 2.4773e-03 Size of Type 8)
48: unsigned int            Test 1 PASSED  --- Loop: 100000 Value (S,A,NA): 1.000000e+05 1.000000e+05 1.000000e+00 Time: 4.3860e-05 9.8463e-04 1.5059e-03 Size of Type 4)
48: unsigned int            Test 2 PASSED  --- Loop: 100000 Value (S,A,NA): 1.000000e+05 1.000000e+05 1.000000e+00 Time: 3.6860e-05 6.5881e+00 1.7054e-03 Size of Type 4)
48: unsigned int            Test 3 PASSED  --- Loop: 100000 Value (S,A,NA): 7.049827e+08 7.049827e+08 2.731520e+05 Time: 1.6876e-04 2.6811e-03 2.2528e-03 Size of Type 4)
48: unsigned long int       Test 1 PASSED  --- Loop: 100000 Value (S,A,NA): 1.000000e+05 1.000000e+05 5.000000e+00 Time: 4.0810e-05 1.8068e-03 2.0080e-03 Size of Type 8)
48: unsigned long int       Test 2 PASSED  --- Loop: 100000 Value (S,A,NA): 1.000000e+05 1.000000e+05 2.000000e+00 Time: 3.9520e-05 6.3046e+00 2.0560e-03 Size of Type 8)
48: unsigned long int       Test 3 PASSED  --- Loop: 100000 Value (S,A,NA): 4.999950e+09 4.999950e+09 1.880000e+05 Time: 1.3906e-04 3.4975e-03 2.3192e-03 Size of Type 8)
48: unsigned long long int  Test 1 PASSED  --- Loop: 100000 Value (S,A,NA): 1.000000e+05 1.000000e+05 5.000000e+00 Time: 3.8130e-05 6.1112e+00 1.7991e-03 Size of Type 8)
48: unsigned long long int  Test 2 PASSED  --- Loop: 100000 Value (S,A,NA): 1.000000e+05 1.000000e+05 2.000000e+00 Time: 3.7910e-05 6.1692e+00 1.7610e-03 Size of Type 8)
48: unsigned long long int  Test 3 PASSED  --- Loop: 100000 Value (S,A,NA): 4.999950e+09 4.999950e+09 1.821760e+05 Time: 1.4418e-04 6.1805e+00 2.8765e-03 Size of Type 8)
48: double                  Test 1 PASSED  --- Loop: 100000 Value (S,A,NA): 1.000000e+05 1.000000e+05 6.000000e+00 Time: 1.1524e-03 3.3657e-03 2.2979e-03 Size of Type 8)
48: double                  Test 2 PASSED  --- Loop: 100000 Value (S,A,NA): 1.000000e+05 1.000000e+05 2.000000e+00 Time: 1.5065e-03 6.5219e+00 1.5095e-03 Size of Type 8)
48: double                  Test 3 PASSED  --- Loop: 100000 Value (S,A,NA): 4.999950e+09 4.999950e+09 4.955840e+05 Time: 1.0950e-03 5.3049e-03 2.3902e-03 Size of Type 8)
48/61 Test #48: KokkosCore_PerformanceTest_Atomic ............   Passed   16.67 sec
test 49
      Start 49: KokkosCore_PerformanceTest_Atomic_MinMax

49: Test command: /var/jenkins/workspace/Kokkos/build/core/perf_test/KokkosCore_PerformanceTest_Atomic_MinMax
49: Test timeout computed to be: 1500
49: ================ int
49: Time for 100% min replacements: 5.513e-05
49: Time for 100% max replacements: 6.1152e-05
49: Time for 100% max early exits: 5.8898e-05
49: Time for 100% min early exits: 3.7612e-05
49: Time for contentious max 200000 replacements: 0.000268037
49: Time for contentious min 200000 replacements: 0.000261158
49: ================ long
49: Time for 100% min replacements: 5.7102e-05
49: Time for 100% max replacements: 5.8603e-05
49: Time for 100% max early exits: 4.2219e-05
49: Time for 100% min early exits: 5.2699e-05
49: Time for contentious max 200000 replacements: 0.000262547
49: Time for contentious min 200000 replacements: 0.000253674
49: ================ long long
49: Time for 100% min replacements: 4.8084e-05
49: Time for 100% max replacements: 4.7353e-05
49: Time for 100% max early exits: 5.4499e-05
49: Time for 100% min early exits: 4.7433e-05
49: Time for contentious max 200000 replacements: 0.000261232
49: Time for contentious min 200000 replacements: 0.000251124
49: ================ unsigned int
49: Time for 100% min replacements: 6.821e-05
49: Time for 100% max replacements: 4.8298e-05
49: Time for 100% max early exits: 4.5458e-05
49: Time for 100% min early exits: 4.6525e-05
49: Time for contentious max 200000 replacements: 0.000256631
49: Time for contentious min 200000 replacements: 0.00024279
49: ================ unsigned long
49: Time for 100% min replacements: 7.1146e-05
49: Time for 100% max replacements: 5.5625e-05
49: Time for 100% max early exits: 5.4406e-05
49: Time for 100% min early exits: 5.1037e-05
49: Time for contentious max 200000 replacements: 0.000269976
49: Time for contentious min 200000 replacements: 0.000259731
49: ================ unsigned long long
49: Time for 100% min replacements: 5.5943e-05
49: Time for 100% max replacements: 5.6559e-05
49: Time for 100% max early exits: 4.8678e-05
49: Time for 100% min early exits: 6.3577e-05
49: Time for contentious max 200000 replacements: 0.000257096
49: Time for contentious min 200000 replacements: 0.000251549
49: ================ float
49: Time for 100% min replacements: 4.6755e-05
49: Time for 100% max replacements: 4.7839e-05
49: Time for 100% max early exits: 4.7285e-05
49: Time for 100% min early exits: 3.3088e-05
49: Time for contentious max 200000 replacements: 0.000230038
49: Time for contentious min 200000 replacements: 0.00020931
49: ================ double
49: Time for 100% min replacements: 5.7164e-05
49: Time for 100% max replacements: 6.4664e-05
49: Time for 100% max early exits: 3.7432e-05
49: Time for 100% min early exits: 9.6092e-05
49: Time for contentious max 200000 replacements: 0.000215523
49: Time for contentious min 200000 replacements: 0.000228416
49/61 Test #49: KokkosCore_PerformanceTest_Atomic_MinMax .....   Passed    0.33 sec
test 50
      Start 50: KokkosCore_PerformanceTest_Mempool

50: Test command: /var/jenkins/workspace/Kokkos/build/core/perf_test/KokkosCore_PerformanceTest_Mempool
50: Test timeout computed to be: 1500
50: "mempool: alloc super stride level span inner outer number" 1000000 10000 1 70 5 1 1 5555
50: "mempool: fill time (min, avg)" 0.00323728 0.00323728
50: "mempool: cycle time (min, avg)" 0.00011547 0.00011547
50: "mempool: test time (min, avg)" 0.00335275 0.00335275
50: "mempool: fill ops per second (max, avg)" 1.71595e+06 1.71595e+06
50: "mempool: cycle ops per second (max, avg)" 9.6213e+07 9.6213e+07
50/61 Test #50: KokkosCore_PerformanceTest_Mempool ...........   Passed    0.33 sec
test 51
      Start 51: KokkosCore_PerformanceTest_TaskDag

51: Test command: /var/jenkins/workspace/Kokkos/build/core/perf_test/KokkosCore_PerformanceTest_TaskDag
51: Test timeout computed to be: 1500
51/61 Test #51: KokkosCore_PerformanceTest_TaskDag ...........   Passed    0.01 sec
test 52
      Start 52: KokkosContainers_UnitTest_Serial

52: Test command: /var/jenkins/workspace/Kokkos/build/containers/unit_tests/KokkosContainers_UnitTest_Serial
52: Test timeout computed to be: 1500
52: [==========] Running 58 tests from 1 test suite.
52: [----------] Global test environment set-up.
52: [----------] 58 tests from serial
52: [ RUN      ] serial.bitset
52: [       OK ] serial.bitset (2965 ms)
52: [ RUN      ] serial.dualview_combination
52: [       OK ] serial.dualview_combination (0 ms)
52: [ RUN      ] serial.dualview_alloc
52: [       OK ] serial.dualview_alloc (0 ms)
52: [ RUN      ] serial.dualview_combinations_without_init
52: [       OK ] serial.dualview_combinations_without_init (0 ms)
52: [ RUN      ] serial.dualview_deep_copy
52: [       OK ] serial.dualview_deep_copy (0 ms)
52: [ RUN      ] serial.dualview_realloc
52: [       OK ] serial.dualview_realloc (0 ms)
52: [ RUN      ] serial.dualview_resize
52: [       OK ] serial.dualview_resize (0 ms)
52: [ RUN      ] serial.dualview_device_correct_kokkos_device
52: [       OK ] serial.dualview_device_correct_kokkos_device (1 ms)
52: [ RUN      ] serial.dualview_host_correct_kokkos_device
52: [       OK ] serial.dualview_host_correct_kokkos_device (0 ms)
52: [ RUN      ] serial.dualview_host_modify_template_device_sync
52: [       OK ] serial.dualview_host_modify_template_device_sync (1 ms)
52: [ RUN      ] serial.dualview_host_modify_template_device_execspace_sync
52: [       OK ] serial.dualview_host_modify_template_device_execspace_sync (0 ms)
52: [ RUN      ] serial.dualview_device_modify_template_host_sync
52: [       OK ] serial.dualview_device_modify_template_host_sync (0 ms)
52: [ RUN      ] serial.dualview_device_modify_template_host_execspace_sync
52: [       OK ] serial.dualview_device_modify_template_host_execspace_sync (0 ms)
52: [ RUN      ] serial.dualview_template_views_return_correct_executionspace_views
52: [       OK ] serial.dualview_template_views_return_correct_executionspace_views (0 ms)
52: [ RUN      ] serial.dynamic_view
52: [       OK ] serial.dynamic_view (8 ms)
52: [ RUN      ] serial.dyn_rank_view_api_generic
52: [       OK ] serial.dyn_rank_view_api_generic (13 ms)
52: [ RUN      ] serial.dyn_rank_view_api_operator_rank12345
52: [       OK ] serial.dyn_rank_view_api_operator_rank12345 (0 ms)
52: [ RUN      ] serial.dyn_rank_view_api_operator_rank67
52: [       OK ] serial.dyn_rank_view_api_operator_rank67 (0 ms)
52: [ RUN      ] serial.ErrorReporterViaLambda
52: [       OK ] serial.ErrorReporterViaLambda (0 ms)
52: [ RUN      ] serial.ErrorReporter
52: [       OK ] serial.ErrorReporter (0 ms)
52: [ RUN      ] serial.offsetview_construction
52: [       OK ] serial.offsetview_construction (38 ms)
52: [ RUN      ] serial.offsetview_unmanaged_construction
52: [       OK ] serial.offsetview_unmanaged_construction (0 ms)
52: [ RUN      ] serial.offsetview_subview
52: [       OK ] serial.offsetview_subview (46 ms)
52: [ RUN      ] serial.offsetview_offsets_rank1
52: [       OK ] serial.offsetview_offsets_rank1 (0 ms)
52: [ RUN      ] serial.offsetview_offsets_rank2
52: [       OK ] serial.offsetview_offsets_rank2 (0 ms)
52: [ RUN      ] serial.offsetview_offsets_rank3
52: [       OK ] serial.offsetview_offsets_rank3 (0 ms)
52: [ RUN      ] serial.scatterview
52: [       OK ] serial.scatterview (2724 ms)
52: [ RUN      ] serial.scatterview_devicetype
52: [       OK ] serial.scatterview_devicetype (3 ms)
52: [ RUN      ] serial.staticcrsgraph
52: [       OK ] serial.staticcrsgraph (32 ms)
52: [ RUN      ] serial.resize_realloc_no_init_dualview
52: [       OK ] serial.resize_realloc_no_init_dualview (0 ms)
52: [ RUN      ] serial.resize_realloc_no_alloc_dualview
52: [       OK ] serial.resize_realloc_no_alloc_dualview (0 ms)
52: [ RUN      ] serial.resize_exec_space_dualview
52: [       OK ] serial.resize_exec_space_dualview (0 ms)
52: [ RUN      ] serial.realloc_exec_space_dualview
52: [       OK ] serial.realloc_exec_space_dualview (0 ms)
52: [ RUN      ] serial.resize_realloc_no_init_dynrankview
52: [       OK ] serial.resize_realloc_no_init_dynrankview (0 ms)
52: [ RUN      ] serial.resize_exec_space_dynrankview
52: [       OK ] serial.resize_exec_space_dynrankview (0 ms)
52: [ RUN      ] serial.realloc_exec_space_dynrankview
52: [       OK ] serial.realloc_exec_space_dynrankview (0 ms)
52: [ RUN      ] serial.resize_realloc_no_init_scatterview
52: [       OK ] serial.resize_realloc_no_init_scatterview (0 ms)
52: [ RUN      ] serial.resize_realloc_no_alloc_scatterview
52: [       OK ] serial.resize_realloc_no_alloc_scatterview (0 ms)
52: [ RUN      ] serial.resize_exec_space_scatterview
52: [       OK ] serial.resize_exec_space_scatterview (0 ms)
52: [ RUN      ] serial.realloc_exec_space_scatterview
52: [       OK ] serial.realloc_exec_space_scatterview (0 ms)
52: [ RUN      ] serial.create_mirror_no_init_dynrankview
52: [       OK ] serial.create_mirror_no_init_dynrankview (0 ms)
52: [ RUN      ] serial.create_mirror_no_init_dynrankview_viewctor
52: [       OK ] serial.create_mirror_no_init_dynrankview_viewctor (0 ms)
52: [ RUN      ] serial.create_mirror_view_and_copy_dynrankview
52: [       OK ] serial.create_mirror_view_and_copy_dynrankview (0 ms)
52: [ RUN      ] serial.create_mirror_no_init_offsetview
52: [       OK ] serial.create_mirror_no_init_offsetview (0 ms)
52: [ RUN      ] serial.create_mirror_no_init_offsetview_view_ctor
52: [       OK ] serial.create_mirror_no_init_offsetview_view_ctor (0 ms)
52: [ RUN      ] serial.create_mirror_view_and_copy_offsetview
52: [       OK ] serial.create_mirror_view_and_copy_offsetview (0 ms)
52: [ RUN      ] serial.create_mirror_no_init_dynamicview
52: [       OK ] serial.create_mirror_no_init_dynamicview (0 ms)
52: [ RUN      ] serial.create_mirror_view_and_copy_dynamicview
52: [       OK ] serial.create_mirror_view_and_copy_dynamicview (0 ms)
52: [ RUN      ] serial.create_mirror_no_init_dynamicview_view_ctor
52: [       OK ] serial.create_mirror_no_init_dynamicview_view_ctor (0 ms)
52: [ RUN      ] serial.UnorderedMap_insert
52: [       OK ] serial.UnorderedMap_insert (6936 ms)
52: [ RUN      ] serial.UnorderedMap_failed_insert
52: [       OK ] serial.UnorderedMap_failed_insert (5656 ms)
52: [ RUN      ] serial.UnorderedMap_deep_copy
52: [       OK ] serial.UnorderedMap_deep_copy (5 ms)
52: [ RUN      ] serial.UnorderedMap_valid_empty
52: [       OK ] serial.UnorderedMap_valid_empty (0 ms)
52: [ RUN      ] serial.UnorderedMap_clear_zero_size
52: [       OK ] serial.UnorderedMap_clear_zero_size (0 ms)
52: [ RUN      ] serial.vector_combination
52: [       OK ] serial.vector_combination (0 ms)
52: [ RUN      ] serial.vector_insert
52: [       OK ] serial.vector_insert (0 ms)
52: [ RUN      ] serial.vector_push_back_default_exec
52: [       OK ] serial.vector_push_back_default_exec (0 ms)
52: [ RUN      ] serial.viewctorprop_embedded_dim
52: [       OK ] serial.viewctorprop_embedded_dim (0 ms)
52: [----------] 58 tests from serial (18444 ms total)
52: 
52: [----------] Global test environment tear-down
52: [==========] 58 tests from 1 test suite ran. (18444 ms total)
52: [  PASSED  ] 58 tests.
52/61 Test #52: KokkosContainers_UnitTest_Serial .............   Passed   18.78 sec
test 53
      Start 53: KokkosContainers_UnitTest_Cuda

53: Test command: /var/jenkins/workspace/Kokkos/build/containers/unit_tests/KokkosContainers_UnitTest_Cuda
53: Test timeout computed to be: 1500
53: [==========] Running 58 tests from 1 test suite.
53: [----------] Global test environment set-up.
53: [----------] 58 tests from cuda
53: [ RUN      ] cuda.bitset
53: [       OK ] cuda.bitset (12 ms)
53: [ RUN      ] cuda.dualview_combination
53: [       OK ] cuda.dualview_combination (0 ms)
53: [ RUN      ] cuda.dualview_alloc
53: [       OK ] cuda.dualview_alloc (0 ms)
53: [ RUN      ] cuda.dualview_combinations_without_init
53: [       OK ] cuda.dualview_combinations_without_init (0 ms)
53: [ RUN      ] cuda.dualview_deep_copy
53: [       OK ] cuda.dualview_deep_copy (1 ms)
53: [ RUN      ] cuda.dualview_realloc
53: [       OK ] cuda.dualview_realloc (0 ms)
53: [ RUN      ] cuda.dualview_resize
53: [       OK ] cuda.dualview_resize (0 ms)
53: [ RUN      ] cuda.dualview_device_correct_kokkos_device
53: [       OK ] cuda.dualview_device_correct_kokkos_device (0 ms)
53: [ RUN      ] cuda.dualview_host_correct_kokkos_device
53: [       OK ] cuda.dualview_host_correct_kokkos_device (0 ms)
53: [ RUN      ] cuda.dualview_host_modify_template_device_sync
53: [       OK ] cuda.dualview_host_modify_template_device_sync (0 ms)
53: [ RUN      ] cuda.dualview_host_modify_template_device_execspace_sync
53: [       OK ] cuda.dualview_host_modify_template_device_execspace_sync (0 ms)
53: [ RUN      ] cuda.dualview_device_modify_template_host_sync
53: [       OK ] cuda.dualview_device_modify_template_host_sync (0 ms)
53: [ RUN      ] cuda.dualview_device_modify_template_host_execspace_sync
53: [       OK ] cuda.dualview_device_modify_template_host_execspace_sync (0 ms)
53: [ RUN      ] cuda.dualview_template_views_return_correct_executionspace_views
53: [       OK ] cuda.dualview_template_views_return_correct_executionspace_views (0 ms)
53: [ RUN      ] cuda.dynamic_view
53: [       OK ] cuda.dynamic_view (15 ms)
53: [ RUN      ] cuda.dyn_rank_view_api_generic
53: unknown file: Failure
53: C++ exception with description "cudaMemcpyAsync(dst, src, n, cudaMemcpyDefault, instance.cuda_stream()) error( cudaErrorInvalidValue): invalid argument /var/jenkins/workspace/Kokkos/core/src/Cuda/Kokkos_CudaSpace.cpp:103" thrown in the test body.
53: [  FAILED  ] cuda.dyn_rank_view_api_generic (12 ms)
53: [ RUN      ] cuda.dyn_rank_view_api_operator_rank12345
53: [       OK ] cuda.dyn_rank_view_api_operator_rank12345 (1 ms)
53: [ RUN      ] cuda.dyn_rank_view_api_operator_rank67
53: [       OK ] cuda.dyn_rank_view_api_operator_rank67 (1 ms)
53: [ RUN      ] cuda.ErrorReporterViaLambda
53: [       OK ] cuda.ErrorReporterViaLambda (1 ms)
53: [ RUN      ] cuda.ErrorReporter
53: [       OK ] cuda.ErrorReporter (1 ms)
53: [ RUN      ] cuda.offsetview_construction
53: [       OK ] cuda.offsetview_construction (2 ms)
53: [ RUN      ] cuda.offsetview_unmanaged_construction
53: [       OK ] cuda.offsetview_unmanaged_construction (0 ms)
53: [ RUN      ] cuda.offsetview_subview
53: [       OK ] cuda.offsetview_subview (0 ms)
53: [ RUN      ] cuda.offsetview_offsets_rank1
53: [       OK ] cuda.offsetview_offsets_rank1 (0 ms)
53: [ RUN      ] cuda.offsetview_offsets_rank2
53: [       OK ] cuda.offsetview_offsets_rank2 (0 ms)
53: [ RUN      ] cuda.offsetview_offsets_rank3
53: [       OK ] cuda.offsetview_offsets_rank3 (0 ms)
53: [ RUN      ] cuda.scatterview
53: [       OK ] cuda.scatterview (29945 ms)
53: [ RUN      ] cuda.scatterview_devicetype
53: [       OK ] cuda.scatterview_devicetype (41 ms)
53: [ RUN      ] cuda.staticcrsgraph
53: [       OK ] cuda.staticcrsgraph (43 ms)
53: [ RUN      ] cuda.resize_realloc_no_init_dualview
53: [       OK ] cuda.resize_realloc_no_init_dualview (0 ms)
53: [ RUN      ] cuda.resize_realloc_no_alloc_dualview
53: [       OK ] cuda.resize_realloc_no_alloc_dualview (0 ms)
53: [ RUN      ] cuda.resize_exec_space_dualview
53: [       OK ] cuda.resize_exec_space_dualview (0 ms)
53: [ RUN      ] cuda.realloc_exec_space_dualview
53: [       OK ] cuda.realloc_exec_space_dualview (0 ms)
53: [ RUN      ] cuda.resize_realloc_no_init_dynrankview
53: [       OK ] cuda.resize_realloc_no_init_dynrankview (0 ms)
53: [ RUN      ] cuda.resize_exec_space_dynrankview
53: [       OK ] cuda.resize_exec_space_dynrankview (0 ms)
53: [ RUN      ] cuda.realloc_exec_space_dynrankview
53: [       OK ] cuda.realloc_exec_space_dynrankview (0 ms)
53: [ RUN      ] cuda.resize_realloc_no_init_scatterview
53: [       OK ] cuda.resize_realloc_no_init_scatterview (0 ms)
53: [ RUN      ] cuda.resize_realloc_no_alloc_scatterview
53: [       OK ] cuda.resize_realloc_no_alloc_scatterview (0 ms)
53: [ RUN      ] cuda.resize_exec_space_scatterview
53: [       OK ] cuda.resize_exec_space_scatterview (0 ms)
53: [ RUN      ] cuda.realloc_exec_space_scatterview
53: [       OK ] cuda.realloc_exec_space_scatterview (0 ms)
53: [ RUN      ] cuda.create_mirror_no_init_dynrankview
53: [       OK ] cuda.create_mirror_no_init_dynrankview (0 ms)
53: [ RUN      ] cuda.create_mirror_no_init_dynrankview_viewctor
53: [       OK ] cuda.create_mirror_no_init_dynrankview_viewctor (0 ms)
53: [ RUN      ] cuda.create_mirror_view_and_copy_dynrankview
53: [       OK ] cuda.create_mirror_view_and_copy_dynrankview (0 ms)
53: [ RUN      ] cuda.create_mirror_no_init_offsetview
53: [       OK ] cuda.create_mirror_no_init_offsetview (0 ms)
53: [ RUN      ] cuda.create_mirror_no_init_offsetview_view_ctor
53: [       OK ] cuda.create_mirror_no_init_offsetview_view_ctor (0 ms)
53: [ RUN      ] cuda.create_mirror_view_and_copy_offsetview
53: [       OK ] cuda.create_mirror_view_and_copy_offsetview (0 ms)
53: [ RUN      ] cuda.create_mirror_no_init_dynamicview
53: [       OK ] cuda.create_mirror_no_init_dynamicview (0 ms)
53: [ RUN      ] cuda.create_mirror_view_and_copy_dynamicview
53: [       OK ] cuda.create_mirror_view_and_copy_dynamicview (0 ms)
53: [ RUN      ] cuda.create_mirror_no_init_dynamicview_view_ctor
53: [       OK ] cuda.create_mirror_no_init_dynamicview_view_ctor (0 ms)
53: [ RUN      ] cuda.UnorderedMap_insert
53: [       OK ] cuda.UnorderedMap_insert (1106 ms)
53: [ RUN      ] cuda.UnorderedMap_failed_insert
53: [       OK ] cuda.UnorderedMap_failed_insert (523 ms)
53: [ RUN      ] cuda.UnorderedMap_deep_copy
53: [       OK ] cuda.UnorderedMap_deep_copy (6 ms)
53: [ RUN      ] cuda.UnorderedMap_valid_empty
53: [       OK ] cuda.UnorderedMap_valid_empty (2 ms)
53: [ RUN      ] cuda.UnorderedMap_clear_zero_size
53: [       OK ] cuda.UnorderedMap_clear_zero_size (0 ms)
53: [ RUN      ] cuda.vector_combination
53: [       OK ] cuda.vector_combination (0 ms)
53: [ RUN      ] cuda.vector_insert
53: [       OK ] cuda.vector_insert (1 ms)
53: [ RUN      ] cuda.vector_push_back_default_exec
53: [       OK ] cuda.vector_push_back_default_exec (0 ms)
53: [ RUN      ] cuda.viewctorprop_embedded_dim
53: [       OK ] cuda.viewctorprop_embedded_dim (0 ms)
53: [----------] 58 tests from cuda (31737 ms total)
53: 
53: [----------] Global test environment tear-down
53: [==========] 58 tests from 1 test suite ran. (31737 ms total)
53: [  PASSED  ] 57 tests.
53: [  FAILED  ] 1 test, listed below:
53: [  FAILED  ] cuda.dyn_rank_view_api_generic
53: 
53:  1 FAILED TEST
53/61 Test #53: KokkosContainers_UnitTest_Cuda ...............***Failed  Error regular expression found in output. Regex=[  FAILED  ] 32.15 sec
test 54
      Start 54: KokkosContainers_PerformanceTest_Cuda

54: Test command: /var/jenkins/workspace/Kokkos/build/containers/performance_tests/KokkosContainers_PerformanceTest_Cuda
54: Test timeout computed to be: 1500
54: [==========] Running 4 tests from 1 test suite.
54: [----------] Global test environment set-up.
54: [----------] 4 tests from TEST_CATEGORY
54: [ RUN      ] TEST_CATEGORY.dynrankview_perf
54: Cuda
54:  DynRankView vs View: Initialization Only 
54:  View time (init only): 0.00128883
54:  View sum computation time: 0.00128883
54:  Strided View time (init only): 0.00132656
54:  View Rank7 time (init only): 0.00137706
54:  DynRankView time (init only): 0.00137348
54:  DynRankView sum computation time: 0.00267354
54:  Ratio of View to DynRankView time: 0.938371
54:  Ratio of View to DynRankView sum computation time: 0.697464
54:  Ratio of View to View Rank7  time: 0.935932
54:  Ratio of StrideView to DynRankView time: 0.965841
54:  Ratio of DynRankView to View Rank7  time: 0.9974
54: [       OK ] TEST_CATEGORY.dynrankview_perf (22 ms)
54: [ RUN      ] TEST_CATEGORY.global_2_local
54: Cuda
54: size, create, generate, fill, find
54: 256, 0.000463321, 4.7219e-05, 0.0054945, 0.00285232
54: 512, 0.000350454, 6.0401e-05, 6.1812e-05, 0.00277021
54: 1024, 0.0003257, 5.6919e-05, 7.3689e-05, 0.0026706
54: 2048, 0.000335008, 5.7073e-05, 5.9158e-05, 0.0026806
54: 4096, 0.000304467, 5.4426e-05, 5.418e-05, 0.00253312
54: 8192, 0.000283123, 5.8993e-05, 6.6756e-05, 0.00271482
54: 16384, 0.00190983, 5.7727e-05, 5.46e-05, 0.00355421
54: 32768, 0.00138669, 5.706e-05, 5.6892e-05, 0.00499762
54: 65536, 0.00115504, 7.3735e-05, 7.492e-05, 0.00744552
54: 131072, 0.00261359, 5.5866e-05, 9.2663e-05, 0.00898243
54: 262144, 0.00128016, 6.0388e-05, 0.000157851, 0.0118463
54: 524288, 0.0015275, 6.5562e-05, 0.000538448, 0.0227175
54: 1048576, 0.00132922, 6.9278e-05, 0.00145935, 0.0557361
54: 2097152, 0.00183471, 8.3833e-05, 0.00339936, 0.12249
54: 4194304, 0.00265362, 0.000107096, 0.00763852, 0.259003
54: [       OK ] TEST_CATEGORY.global_2_local (559 ms)
54: [ RUN      ] TEST_CATEGORY.unordered_map_performance_near
54: skipping test
54: [       OK ] TEST_CATEGORY.unordered_map_performance_near (0 ms)
54: [ RUN      ] TEST_CATEGORY.unordered_map_performance_far
54: skipping test
54: [       OK ] TEST_CATEGORY.unordered_map_performance_far (0 ms)
54: [----------] 4 tests from TEST_CATEGORY (582 ms total)
54: 
54: [----------] Global test environment tear-down
54: [==========] 4 tests from 1 test suite ran. (582 ms total)
54: [  PASSED  ] 4 tests.
54/61 Test #54: KokkosContainers_PerformanceTest_Cuda ........   Passed    0.91 sec
test 55
      Start 55: KokkosAlgorithms_UnitTest_RandomAndSort

55: Test command: /var/jenkins/workspace/Kokkos/build/algorithms/unit_tests/KokkosAlgorithms_UnitTest_RandomAndSort
55: Test timeout computed to be: 1500
55: [==========] Running 3 tests from 1 test suite.
55: [----------] Global test environment set-up.
55: [----------] 3 tests from cuda
55: [ RUN      ] cuda.Random_XorShift64
55: Test Seed:1659743844825132469
55: Test Scalar=int
55:  -- Testing randomness properties
55:  -- Testing 1-D histogram
55: Density 1D: 6.43252e-07 -0.0041716 -0.0271691 || 0.051031 27991 29524 || 28794.5 28674.4 || -375.585 -2.0744
55:  -- Testing 3-D histogram
55: Density 3D: 6.43252e-07 -0.00308042 0.00876155 || 0.051031 1e+64 -1e+64
55: Test Scalar=unsigned int
55:  -- Testing randomness properties
55:  -- Testing 1-D histogram
55: Density 1D: 6.43252e-07 -0.0128079 0.024867 || 0.051031 27975 29294 || 29046.4 28674.4 || 343.762 -2.0744
55:  -- Testing 3-D histogram
55: Density 3D: 6.43252e-07 -0.00660574 0.00580493 || 0.051031 1e+64 -1e+64
55: Test Scalar=int64_t
55:  -- Testing randomness properties
55:  -- Testing 1-D histogram
55: Density 1D: 6.43252e-07 -0.0110345 0.0429612 || 0.051031 28056 29319 || 28994.3 28674.4 || 593.896 -2.0744
55:  -- Testing 3-D histogram
55: Density 3D: 6.43252e-07 -0.0209106 -0.00675175 || 0.051031 1e+64 -1e+64
55: Test Scalar=uint64_t
55:  -- Testing randomness properties
55:  -- Testing 1-D histogram
55: Density 1D: 6.43252e-07 0.0105592 -0.00288807 || 0.051031 27950 29300 || 28374.8 28674.4 || -39.9247 -2.0744
55:  -- Testing 3-D histogram
55: Density 3D: 6.43252e-07 0.00286499 0.00123937 || 0.051031 1e+64 -1e+64
55: Test Scalar=half
55:  -- Testing randomness properties
55:  -- Testing 1-D histogram
55: Density 1D: 0.000244359 -0.99999 -48245.7 || 0.051031 0 194941 || 2.92889e+09 28674.4 || -6.66949e+08 -2.0744
55:  -- Testing 3-D histogram
55: Density 3D: 0.000731988 -0.323384 0.160826 || 0.051031 1e+64 -1e+64
55: Test Scalar=bhalf
55:  -- Testing randomness properties
55:  -- Testing 1-D histogram
55: Density 1D: 6.63432e-07 -0.0212028 -0.0127547 || 0.051031 28014 29422 || 29295.5 28674.4 || -176.32 -2.0744
55:  -- Testing 3-D histogram
55: Density 3D: 7.03793e-07 -0.0144558 -0.00194763 || 0.051031 1e+64 -1e+64
55: Test Scalar=float
55:  -- Testing randomness properties
55:  -- Testing 1-D histogram
55: Density 1D: 6.76045e-07 0.0131881 -0.00503533 || 0.051031 28053 29258 || 28301.2 28674.4 || -69.6084 -2.0744
55:  -- Testing 3-D histogram
55: Density 3D: 7.41632e-07 -0.00630963 0.00240043 || 0.051031 1e+64 -1e+64
55: Test Scalar=double
55:  -- Testing randomness properties
55:  -- Testing 1-D histogram
55: Density 1D: 6.43252e-07 0.00844782 -0.0154866 || 0.051031 27997 29323 || 28434.2 28674.4 || -214.087 -2.0744
55:  -- Testing 3-D histogram
55: Density 3D: 6.43252e-07 -0.0143284 0.00700515 || 0.051031 1e+64 -1e+64
55: Test Seed:1659743844940646682
55: Test Scalar=int
55:  -- Testing randomness properties
55:  -- Testing 1-D histogram
55: Density 1D: 6.43252e-07 -0.00309305 0.0385163 || 0.051031 28027 29394 || 28763.4 28674.4 || 532.449 -2.0744
55:  -- Testing 3-D histogram
55: Density 3D: 6.43252e-07 0.0141488 -0.00114043 || 0.051031 1e+64 -1e+64
55: Test Scalar=unsigned int
55:  -- Testing randomness properties
55:  -- Testing 1-D histogram
55: Density 1D: 6.43252e-07 0.00166568 0.0131316 || 0.051031 28103 29350 || 28626.7 28674.4 || 181.531 -2.0744
55:  -- Testing 3-D histogram
55: Density 3D: 6.43252e-07 -0.00737158 -0.0123113 || 0.051031 1e+64 -1e+64
55: Test Scalar=int64_t
55:  -- Testing randomness properties
55:  -- Testing 1-D histogram
55: Density 1D: 6.43252e-07 0.0243403 -0.00213131 || 0.051031 28084 29284 || 27993 28674.4 || -29.4632 -2.0744
55:  -- Testing 3-D histogram
55: Density 3D: 6.43252e-07 0.0113655 -0.0100534 || 0.051031 1e+64 -1e+64
55: Test Scalar=uint64_t
55:  -- Testing randomness properties
55:  -- Testing 1-D histogram
55: Density 1D: 6.43252e-07 -0.00344023 -0.0184147 || 0.051031 27993 29372 || 28773.4 28674.4 || -254.564 -2.0744
55:  -- Testing 3-D histogram
55: Density 3D: 6.43252e-07 -0.00577108 -0.00102161 || 0.051031 1e+64 -1e+64
55: Test Scalar=half
55:  -- Testing randomness properties
55:  -- Testing 1-D histogram
55: Density 1D: 0.000244445 -0.99999 -48244.5 || 0.051031 0 195172 || 2.92842e+09 28674.4 || -6.66933e+08 -2.0744
55:  -- Testing 3-D histogram
55: Density 3D: 0.000732238 -0.314315 0.165303 || 0.051031 1e+64 -1e+64
55: Test Scalar=bhalf
55:  -- Testing randomness properties
55:  -- Testing 1-D histogram
55: Density 1D: 6.65955e-07 0.00566279 -0.00064442 || 0.051031 28042 29300 || 28512.9 28674.4 || -8.90846 -2.0744
55:  -- Testing 3-D histogram
55: Density 3D: 7.11361e-07 -0.0158225 -0.00169366 || 0.051031 1e+64 -1e+64
55: Test Scalar=float
55:  -- Testing randomness properties
55:  -- Testing 1-D histogram
55: Density 1D: 6.88658e-07 -0.0294169 0.0139486 || 0.051031 28071 29310 || 29543.5 28674.4 || 192.825 -2.0744
55:  -- Testing 3-D histogram
55: Density 3D: 7.7947e-07 0.00969047 0.00444155 || 0.051031 1e+64 -1e+64
55: Test Scalar=double
55:  -- Testing randomness properties
55:  -- Testing 1-D histogram
55: Density 1D: 6.43252e-07 -0.000536297 -0.00110192 || 0.051031 28045 29309 || 28689.8 28674.4 || -15.233 -2.0744
55:  -- Testing 3-D histogram
55: Density 3D: 6.43252e-07 0.00281841 -0.005688 || 0.051031 1e+64 -1e+64
55: [       OK ] cuda.Random_XorShift64 (234 ms)
55: [ RUN      ] cuda.Random_XorShift1024_0
55: Test Seed:1659743845059645559
55: Test Scalar=int
55:  -- Testing randomness properties
55:  -- Testing 1-D histogram
55: Density 1D: 2.54313e-07 -0.0219678 -0.000651405 || 0.051031 10940 11858 || 11632.5 11377 || -9.00502 -0.823045
55:  -- Testing 3-D histogram
55: Density 3D: 2.67029e-07 0.0104091 -0.00144318 || 0.051031 1e+64 -1e+64
55: Test Scalar=unsigned int
55:  -- Testing randomness properties
55:  -- Testing 1-D histogram
55: Density 1D: 2.47955e-07 0.00841079 0.00214919 || 0.051031 10944 11741 || 11282.1 11377 || 29.7104 -0.823045
55:  -- Testing 3-D histogram
55: Density 3D: 2.47955e-07 0.0151148 -0.00219283 || 0.051031 1e+64 -1e+64
55: Test Scalar=int64_t
55:  -- Testing randomness properties
55:  -- Testing 1-D histogram
55: Density 1D: 2.47955e-07 -0.0196044 -0.0142951 || 0.051031 10943 11781 || 11604.5 11377 || -197.615 -0.823045
55:  -- Testing 3-D histogram
55: Density 3D: 2.47955e-07 0.00910842 -0.00277633 || 0.051031 1e+64 -1e+64
55: Test Scalar=uint64_t
55:  -- Testing randomness properties
55:  -- Testing 1-D histogram
55: Density 1D: 2.47955e-07 0.0225781 0.00331817 || 0.051031 10977 11795 || 11125.8 11377 || 45.8703 -0.823045
55:  -- Testing 3-D histogram
55: Density 3D: 2.47955e-07 0.000989913 0.000956476 || 0.051031 1e+64 -1e+64
55: Test Scalar=half
55:  -- Testing randomness properties
55:  -- Testing 1-D histogram
55: Density 1D: 0.000243322 -0.999975 -7595.68 || 0.051031 0 77865 || 4.61036e+08 11377 || -1.05003e+08 -0.823045
55:  -- Testing 3-D histogram
55: Density 3D: 0.000729749 -0.143737 0.0215867 || 0.051031 1e+64 -1e+64
55: Test Scalar=bhalf
55:  -- Testing randomness properties
55:  -- Testing 1-D histogram
55: Density 1D: 2.9246e-07 0.00397482 -0.00138946 || 0.051031 10954 11789 || 11331.9 11377 || -19.2079 -0.823045
55:  -- Testing 3-D histogram
55: Density 3D: 3.8147e-07 -0.00387127 0.00385551 || 0.051031 1e+64 -1e+64
55: Test Scalar=float
55:  -- Testing randomness properties
55:  -- Testing 1-D histogram
55: Density 1D: 2.54313e-07 0.00132491 -0.00623126 || 0.051031 10936 11768 || 11361.9 11377 || -86.1409 -0.823045
55:  -- Testing 3-D histogram
55: Density 3D: 2.67029e-07 0.0049316 -0.000214054 || 0.051031 1e+64 -1e+64
55: Test Scalar=double
55:  -- Testing randomness properties
55:  -- Testing 1-D histogram
55: Density 1D: 2.47955e-07 -0.00450989 -0.00652129 || 0.051031 10992 11788 || 11428.5 11377 || -90.1503 -0.823045
55:  -- Testing 3-D histogram
55: Density 3D: 2.47955e-07 0.00117515 -0.00731462 || 0.051031 1e+64 -1e+64
55: Test Seed:1659743845185339486
55: Test Scalar=int
55:  -- Testing randomness properties
55:  -- Testing 1-D histogram
55: Density 1D: 2.47955e-07 0.0278017 0.0016633 || 0.051031 10916 11761 || 11069.2 11377 || 22.9934 -0.823045
55:  -- Testing 3-D histogram
55: Density 3D: 2.47955e-07 0.00265747 0.000705308 || 0.051031 1e+64 -1e+64
55: Test Scalar=unsigned int
55:  -- Testing randomness properties
55:  -- Testing 1-D histogram
55: Density 1D: 2.47955e-07 0.0174422 0.00791683 || 0.051031 10948 11757 || 11181.9 11377 || 109.442 -0.823045
55:  -- Testing 3-D histogram
55: Density 3D: 2.47955e-07 0.00168246 -0.00176524 || 0.051031 1e+64 -1e+64
55: Test Scalar=int64_t
55:  -- Testing randomness properties
55:  -- Testing 1-D histogram
55: Density 1D: 2.47955e-07 -0.0124819 -0.00688266 || 0.051031 10947 11829 || 11520.8 11377 || -95.1459 -0.823045
55:  -- Testing 3-D histogram
55: Density 3D: 2.47955e-07 0.00706195 0.000137802 || 0.051031 1e+64 -1e+64
55: Test Scalar=uint64_t
55:  -- Testing randomness properties
55:  -- Testing 1-D histogram
55: Density 1D: 2.47955e-07 0.000576086 -0.00588209 || 0.051031 10946 11766 || 11370.4 11377 || -81.314 -0.823045
55:  -- Testing 3-D histogram
55: Density 3D: 2.47955e-07 0.023493 -0.00064083 || 0.051031 1e+64 -1e+64
55: Test Scalar=half
55:  -- Testing randomness properties
55:  -- Testing 1-D histogram
55: Density 1D: 0.000244932 -0.999975 -7594.18 || 0.051031 0 77723 || 4.61014e+08 11377 || -1.04982e+08 -0.823045
55:  -- Testing 3-D histogram
55: Density 3D: 0.000734391 -0.142156 0.0248662 || 0.051031 1e+64 -1e+64
55: Test Scalar=bhalf
55:  -- Testing randomness properties
55:  -- Testing 1-D histogram
55: Density 1D: 2.60671e-07 0.00415311 -0.00870526 || 0.051031 10883 11794 || 11329.9 11377 || -120.342 -0.823045
55:  -- Testing 3-D histogram
55: Density 3D: 2.86102e-07 -0.00748115 -0.00326154 || 0.051031 1e+64 -1e+64
55: Test Scalar=float
55:  -- Testing randomness properties
55:  -- Testing 1-D histogram
55: Density 1D: 2.79744e-07 -0.0112186 -0.00405729 || 0.051031 10981 11754 || 11506 11377 || -56.088 -0.823045
55:  -- Testing 3-D histogram
55: Density 3D: 3.43323e-07 0.0171765 0.00132645 || 0.051031 1e+64 -1e+64
55: Test Scalar=double
55:  -- Testing randomness properties
55:  -- Testing 1-D histogram
55: Density 1D: 2.47955e-07 -0.0156705 0.00449145 || 0.051031 10940 11824 || 11558.1 11377 || 62.0898 -0.823045
55:  -- Testing 3-D histogram
55: Density 3D: 2.47955e-07 -0.00231757 -0.000228523 || 0.051031 1e+64 -1e+64
55: [       OK ] cuda.Random_XorShift1024_0 (278 ms)
55: [ RUN      ] cuda.SortUnsigned
55: [       OK ] cuda.SortUnsigned (75 ms)
55: [----------] 3 tests from cuda (587 ms total)
55: 
55: [----------] Global test environment tear-down
55: [==========] 3 tests from 1 test suite ran. (588 ms total)
55: [  PASSED  ] 3 tests.
55/61 Test #55: KokkosAlgorithms_UnitTest_RandomAndSort ......   Passed    0.94 sec
test 56
      Start 56: KokkosAlgorithms_UnitTest_StdSet_A

56: Test command: /var/jenkins/workspace/Kokkos/build/algorithms/unit_tests/KokkosAlgorithms_UnitTest_StdSet_A
56: Test timeout computed to be: 1500
56: [==========] Running 13 tests from 3 test suites.
56: [----------] Global test environment set-up.
56: [----------] 3 tests from std_algorithms_reducers
56: [ RUN      ] std_algorithms_reducers.max_first_loc
56: checking reduction with order: LeftToRight
56: checking reduction with order: RightToLeft
56: checking reduction with order: Random
56: [       OK ] std_algorithms_reducers.max_first_loc (0 ms)
56: [ RUN      ] std_algorithms_reducers.min_first_loc
56: checking reduction with order: LeftToRight
56: checking reduction with order: RightToLeft
56: checking reduction with order: Random
56: [       OK ] std_algorithms_reducers.min_first_loc (0 ms)
56: [ RUN      ] std_algorithms_reducers.min_max_first_last_loc
56: checking reduction with order: LeftToRight
56: checking reduction with order: RightToLeft
56: checking reduction with order: Random
56: [       OK ] std_algorithms_reducers.min_max_first_last_loc (0 ms)
56: [----------] 3 tests from std_algorithms_reducers (0 ms total)
56: 
56: [----------] 1 test from std_algorithms
56: [ RUN      ] std_algorithms.is_admissible_to_std_algorithms
56: [       OK ] std_algorithms.is_admissible_to_std_algorithms (0 ms)
56: [----------] 1 test from std_algorithms (0 ms total)
56: 
56: [----------] 9 tests from random_access_iterator_test
56: [ RUN      ] random_access_iterator_test.constructor
56: [       OK ] random_access_iterator_test.constructor (0 ms)
56: [ RUN      ] random_access_iterator_test.dereference
56: [       OK ] random_access_iterator_test.dereference (0 ms)
56: [ RUN      ] random_access_iterator_test.subscript_operator
56: [       OK ] random_access_iterator_test.subscript_operator (0 ms)
56: [ RUN      ] random_access_iterator_test.operatorsSet1
56: [       OK ] random_access_iterator_test.operatorsSet1 (0 ms)
56: [ RUN      ] random_access_iterator_test.operatorsSet2
56: [       OK ] random_access_iterator_test.operatorsSet2 (0 ms)
56: [ RUN      ] random_access_iterator_test.operatorsSet3
56: [       OK ] random_access_iterator_test.operatorsSet3 (0 ms)
56: [ RUN      ] random_access_iterator_test.operatorsSet4
56: [       OK ] random_access_iterator_test.operatorsSet4 (0 ms)
56: [ RUN      ] random_access_iterator_test.assignment_operator
56: [       OK ] random_access_iterator_test.assignment_operator (0 ms)
56: [ RUN      ] random_access_iterator_test.distance
56: [       OK ] random_access_iterator_test.distance (0 ms)
56: [----------] 9 tests from random_access_iterator_test (4 ms total)
56: 
56: [----------] Global test environment tear-down
56: [==========] 13 tests from 3 test suites ran. (5 ms total)
56: [  PASSED  ] 13 tests.
56/61 Test #56: KokkosAlgorithms_UnitTest_StdSet_A ...........   Passed    0.32 sec
test 57
      Start 57: KokkosAlgorithms_UnitTest_StdSet_B

57: Test command: /var/jenkins/workspace/Kokkos/build/algorithms/unit_tests/KokkosAlgorithms_UnitTest_StdSet_B
57: Test timeout computed to be: 1500
57: [==========] Running 7 tests from 1 test suite.
57: [----------] Global test environment set-up.
57: [----------] 7 tests from std_algorithms_min_max_element_test
57: [ RUN      ] std_algorithms_min_max_element_test.min_element_empty_range
57: [       OK ] std_algorithms_min_max_element_test.min_element_empty_range (0 ms)
57: [ RUN      ] std_algorithms_min_max_element_test.max_element_empty_range
57: [       OK ] std_algorithms_min_max_element_test.max_element_empty_range (0 ms)
57: [ RUN      ] std_algorithms_min_max_element_test.min_element_non_trivial_data
57: [       OK ] std_algorithms_min_max_element_test.min_element_non_trivial_data (8 ms)
57: [ RUN      ] std_algorithms_min_max_element_test.max_element_non_trivial_data
57: [       OK ] std_algorithms_min_max_element_test.max_element_non_trivial_data (8 ms)
57: [ RUN      ] std_algorithms_min_max_element_test.min_element_non_trivial_data_custom_comp
57: [       OK ] std_algorithms_min_max_element_test.min_element_non_trivial_data_custom_comp (8 ms)
57: [ RUN      ] std_algorithms_min_max_element_test.max_element_non_trivial_data_custom_comp
57: [       OK ] std_algorithms_min_max_element_test.max_element_non_trivial_data_custom_comp (8 ms)
57: [ RUN      ] std_algorithms_min_max_element_test.minmax_element_non_trivial_data_custom_comp
57: [       OK ] std_algorithms_min_max_element_test.minmax_element_non_trivial_data_custom_comp (13 ms)
57: [----------] 7 tests from std_algorithms_min_max_element_test (47 ms total)
57: 
57: [----------] Global test environment tear-down
57: [==========] 7 tests from 1 test suite ran. (48 ms total)
57: [  PASSED  ] 7 tests.
57/61 Test #57: KokkosAlgorithms_UnitTest_StdSet_B ...........   Passed    0.35 sec
test 58
      Start 58: KokkosAlgorithms_UnitTest_StdSet_C

58: Test command: /var/jenkins/workspace/Kokkos/build/algorithms/unit_tests/KokkosAlgorithms_UnitTest_StdSet_C
58: Test timeout computed to be: 1500
58: [==========] Running 13 tests from 10 test suites.
58: [----------] Global test environment set-up.
58: [----------] 1 test from std_algorithms_lexicographical_compare_test
58: [ RUN      ] std_algorithms_lexicographical_compare_test.test
58: [       OK ] std_algorithms_lexicographical_compare_test.test (280 ms)
58: [----------] 1 test from std_algorithms_lexicographical_compare_test (280 ms total)
58: 
58: [----------] 1 test from std_algorithms_for_each_test
58: [ RUN      ] std_algorithms_for_each_test.test
58: [       OK ] std_algorithms_for_each_test.test (195 ms)
58: [----------] 1 test from std_algorithms_for_each_test (195 ms total)
58: 
58: [----------] 1 test from std_algorithms_find_test
58: [ RUN      ] std_algorithms_find_test.test
58: [       OK ] std_algorithms_find_test.test (107 ms)
58: [----------] 1 test from std_algorithms_find_test (107 ms total)
58: 
58: [----------] 4 tests from std_algorithms_non_mod_seq_ops
58: [ RUN      ] std_algorithms_non_mod_seq_ops.find_first_of
58: [       OK ] std_algorithms_non_mod_seq_ops.find_first_of (854 ms)
58: [ RUN      ] std_algorithms_non_mod_seq_ops.find_end
58: [       OK ] std_algorithms_non_mod_seq_ops.find_end (1738 ms)
58: [ RUN      ] std_algorithms_non_mod_seq_ops.search
58: [       OK ] std_algorithms_non_mod_seq_ops.search (1064 ms)
58: [ RUN      ] std_algorithms_non_mod_seq_ops.search_n
58: [       OK ] std_algorithms_non_mod_seq_ops.search_n (836 ms)
58: [----------] 4 tests from std_algorithms_non_mod_seq_ops (4495 ms total)
58: 
58: [----------] 1 test from std_algorithms_count_test
58: [ RUN      ] std_algorithms_count_test.test
58: [       OK ] std_algorithms_count_test.test (143 ms)
58: [----------] 1 test from std_algorithms_count_test (143 ms total)
58: 
58: [----------] 1 test from std_algorithms_equal_test
58: [ RUN      ] std_algorithms_equal_test.test
58: [       OK ] std_algorithms_equal_test.test (17 ms)
58: [----------] 1 test from std_algorithms_equal_test (18 ms total)
58: 
58: [----------] 1 test from std_algorithms_all_any_none_of_test
58: [ RUN      ] std_algorithms_all_any_none_of_test.test
58: [       OK ] std_algorithms_all_any_none_of_test.test (117 ms)
58: [----------] 1 test from std_algorithms_all_any_none_of_test (117 ms total)
58: 
58: [----------] 1 test from std_algorithms_nonmod_seq_ops
58: [ RUN      ] std_algorithms_nonmod_seq_ops.adjacent_find
58: [       OK ] std_algorithms_nonmod_seq_ops.adjacent_find (166 ms)
58: [----------] 1 test from std_algorithms_nonmod_seq_ops (166 ms total)
58: 
58: [----------] 1 test from std_algorithms_mismatch_test
58: [ RUN      ] std_algorithms_mismatch_test.test
58: [       OK ] std_algorithms_mismatch_test.test (303 ms)
58: [----------] 1 test from std_algorithms_mismatch_test (303 ms total)
58: 
58: [----------] 1 test from std_algorithms_mod_seq_ops
58: [ RUN      ] std_algorithms_mod_seq_ops.move_backward
58: [       OK ] std_algorithms_mod_seq_ops.move_backward (95 ms)
58: [----------] 1 test from std_algorithms_mod_seq_ops (95 ms total)
58: 
58: [----------] Global test environment tear-down
58: [==========] 13 tests from 10 test suites ran. (5925 ms total)
58: [  PASSED  ] 13 tests.
58/61 Test #58: KokkosAlgorithms_UnitTest_StdSet_C ...........   Passed    6.27 sec
test 59
      Start 59: KokkosAlgorithms_UnitTest_StdSet_D

59: Test command: /var/jenkins/workspace/Kokkos/build/algorithms/unit_tests/KokkosAlgorithms_UnitTest_StdSet_D
59: Test timeout computed to be: 1500
59: [==========] Running 33 tests from 5 test suites.
59: [----------] Global test environment set-up.
59: [----------] 5 tests from std_algorithms_mod_ops_test
59: [ RUN      ] std_algorithms_mod_ops_test.move
59: [       OK ] std_algorithms_mod_ops_test.move (0 ms)
59: [ RUN      ] std_algorithms_mod_ops_test.move_within_parfor
59: [       OK ] std_algorithms_mod_ops_test.move_within_parfor (0 ms)
59: [ RUN      ] std_algorithms_mod_ops_test.swap
59: [       OK ] std_algorithms_mod_ops_test.swap (0 ms)
59: [ RUN      ] std_algorithms_mod_ops_test.swap_within_parfor
59: [       OK ] std_algorithms_mod_ops_test.swap_within_parfor (0 ms)
59: [ RUN      ] std_algorithms_mod_ops_test.iter_swap_static_view
59: [       OK ] std_algorithms_mod_ops_test.iter_swap_static_view (0 ms)
59: [----------] 5 tests from std_algorithms_mod_ops_test (1 ms total)
59: 
59: [----------] 12 tests from std_algorithms_mod_seq_ops_test
59: [ RUN      ] std_algorithms_mod_seq_ops_test.copy
59: [       OK ] std_algorithms_mod_seq_ops_test.copy (0 ms)
59: [ RUN      ] std_algorithms_mod_seq_ops_test.copy_view
59: [       OK ] std_algorithms_mod_seq_ops_test.copy_view (0 ms)
59: [ RUN      ] std_algorithms_mod_seq_ops_test.copy_n
59: [       OK ] std_algorithms_mod_seq_ops_test.copy_n (0 ms)
59: [ RUN      ] std_algorithms_mod_seq_ops_test.copy_backward
59: [       OK ] std_algorithms_mod_seq_ops_test.copy_backward (0 ms)
59: [ RUN      ] std_algorithms_mod_seq_ops_test.reverse_copy
59: [       OK ] std_algorithms_mod_seq_ops_test.reverse_copy (0 ms)
59: [ RUN      ] std_algorithms_mod_seq_ops_test.fill
59: [       OK ] std_algorithms_mod_seq_ops_test.fill (0 ms)
59: [ RUN      ] std_algorithms_mod_seq_ops_test.fill_n
59: [       OK ] std_algorithms_mod_seq_ops_test.fill_n (0 ms)
59: [ RUN      ] std_algorithms_mod_seq_ops_test.transform_from_fixture_unary_op
59: [       OK ] std_algorithms_mod_seq_ops_test.transform_from_fixture_unary_op (0 ms)
59: [ RUN      ] std_algorithms_mod_seq_ops_test.transform_from_fixture_binary_op
59: [       OK ] std_algorithms_mod_seq_ops_test.transform_from_fixture_binary_op (0 ms)
59: [ RUN      ] std_algorithms_mod_seq_ops_test.generate
59: [       OK ] std_algorithms_mod_seq_ops_test.generate (0 ms)
59: [ RUN      ] std_algorithms_mod_seq_ops_test.generate_n
59: [       OK ] std_algorithms_mod_seq_ops_test.generate_n (0 ms)
59: [ RUN      ] std_algorithms_mod_seq_ops_test.swap_ranges
59: [       OK ] std_algorithms_mod_seq_ops_test.swap_ranges (1 ms)
59: [----------] 12 tests from std_algorithms_mod_seq_ops_test (7 ms total)
59: 
59: [----------] 4 tests from std_algorithms_replace_ops_test
59: [ RUN      ] std_algorithms_replace_ops_test.replace
59: [       OK ] std_algorithms_replace_ops_test.replace (53 ms)
59: [ RUN      ] std_algorithms_replace_ops_test.replace_if
59: [       OK ] std_algorithms_replace_ops_test.replace_if (224 ms)
59: [ RUN      ] std_algorithms_replace_ops_test.replace_copy
59: [       OK ] std_algorithms_replace_ops_test.replace_copy (91 ms)
59: [ RUN      ] std_algorithms_replace_ops_test.replace_copy_if
59: [       OK ] std_algorithms_replace_ops_test.replace_copy_if (82 ms)
59: [----------] 4 tests from std_algorithms_replace_ops_test (452 ms total)
59: 
59: [----------] 11 tests from std_algorithms_mod_seq_ops
59: [ RUN      ] std_algorithms_mod_seq_ops.copy_if
59: [       OK ] std_algorithms_mod_seq_ops.copy_if (59 ms)
59: [ RUN      ] std_algorithms_mod_seq_ops.unique
59: [       OK ] std_algorithms_mod_seq_ops.unique (410 ms)
59: [ RUN      ] std_algorithms_mod_seq_ops.unique_copy
59: [       OK ] std_algorithms_mod_seq_ops.unique_copy (132 ms)
59: [ RUN      ] std_algorithms_mod_seq_ops.remove
59: [       OK ] std_algorithms_mod_seq_ops.remove (94 ms)
59: [ RUN      ] std_algorithms_mod_seq_ops.remove_if
59: [       OK ] std_algorithms_mod_seq_ops.remove_if (104 ms)
59: [ RUN      ] std_algorithms_mod_seq_ops.remove_copy
59: [       OK ] std_algorithms_mod_seq_ops.remove_copy (268 ms)
59: [ RUN      ] std_algorithms_mod_seq_ops.remove_copy_if
59: [       OK ] std_algorithms_mod_seq_ops.remove_copy_if (98 ms)
59: [ RUN      ] std_algorithms_mod_seq_ops.rotate
59: [       OK ] std_algorithms_mod_seq_ops.rotate (2007 ms)
59: [ RUN      ] std_algorithms_mod_seq_ops.rotate_copy
59: [       OK ] std_algorithms_mod_seq_ops.rotate_copy (715 ms)
59: [ RUN      ] std_algorithms_mod_seq_ops.shift_left
59: [       OK ] std_algorithms_mod_seq_ops.shift_left (1976 ms)
59: [ RUN      ] std_algorithms_mod_seq_ops.shift_right
59: [       OK ] std_algorithms_mod_seq_ops.shift_right (1970 ms)
59: [----------] 11 tests from std_algorithms_mod_seq_ops (7839 ms total)
59: 
59: [----------] 1 test from std_algorithms_modseq_test
59: [ RUN      ] std_algorithms_modseq_test.reverse
59: [       OK ] std_algorithms_modseq_test.reverse (94 ms)
59: [----------] 1 test from std_algorithms_modseq_test (94 ms total)
59: 
59: [----------] Global test environment tear-down
59: [==========] 33 tests from 5 test suites ran. (8395 ms total)
59: [  PASSED  ] 33 tests.
59/61 Test #59: KokkosAlgorithms_UnitTest_StdSet_D ...........   Passed    8.78 sec
test 60
      Start 60: KokkosAlgorithms_UnitTest_StdSet_E

60: Test command: /var/jenkins/workspace/Kokkos/build/algorithms/unit_tests/KokkosAlgorithms_UnitTest_StdSet_E
60: Test timeout computed to be: 1500
60: [==========] Running 25 tests from 7 test suites.
60: [----------] Global test environment set-up.
60: [----------] 2 tests from std_algorithms_sorting_ops_test
60: [ RUN      ] std_algorithms_sorting_ops_test.is_sorted
60: is_sorted: dynamic_view, all overloads 
60: is_sorted: stride2_view, all overloads 
60: is_sorted: stride3_view, all overloads 
60: [       OK ] std_algorithms_sorting_ops_test.is_sorted (17 ms)
60: [ RUN      ] std_algorithms_sorting_ops_test.is_sorted_until
60: is_sorted_until: dynamic_view, all overloads 
60: is_sorted_until: stride2_view, all overloads 
60: is_sorted_until: stride3_view, all overloads 
60: [       OK ] std_algorithms_sorting_ops_test.is_sorted_until (50 ms)
60: [----------] 2 tests from std_algorithms_sorting_ops_test (67 ms total)
60: 
60: [----------] 4 tests from std_algorithms_partitioning_test
60: [ RUN      ] std_algorithms_partitioning_test.is_partitioned_trivial
60: [       OK ] std_algorithms_partitioning_test.is_partitioned_trivial (1 ms)
60: [ RUN      ] std_algorithms_partitioning_test.is_partitioned_accepting_iterators
60: [       OK ] std_algorithms_partitioning_test.is_partitioned_accepting_iterators (1 ms)
60: [ RUN      ] std_algorithms_partitioning_test.is_partitioned_accepting_view
60: [       OK ] std_algorithms_partitioning_test.is_partitioned_accepting_view (1 ms)
60: [ RUN      ] std_algorithms_partitioning_test.partition_point
60: [       OK ] std_algorithms_partitioning_test.partition_point (1 ms)
60: [----------] 4 tests from std_algorithms_partitioning_test (6 ms total)
60: 
60: [----------] 1 test from std_algorithms_partitioning_ops
60: [ RUN      ] std_algorithms_partitioning_ops.partition_copy
60: [       OK ] std_algorithms_partitioning_ops.partition_copy (34 ms)
60: [----------] 1 test from std_algorithms_partitioning_ops (34 ms total)
60: 
60: [----------] 12 tests from std_algorithms_numerics_test
60: [ RUN      ] std_algorithms_numerics_test.transform_reduce_default_functors_using_pod_value_type
60: [       OK ] std_algorithms_numerics_test.transform_reduce_default_functors_using_pod_value_type (1 ms)
60: [ RUN      ] std_algorithms_numerics_test.transform_reduce_default_functors_using_custom_value_type
60: [       OK ] std_algorithms_numerics_test.transform_reduce_default_functors_using_custom_value_type (1 ms)
60: [ RUN      ] std_algorithms_numerics_test.transform_reduce_custom_functors_overloadA_using_pod_value_type
60: [       OK ] std_algorithms_numerics_test.transform_reduce_custom_functors_overloadA_using_pod_value_type (1 ms)
60: [ RUN      ] std_algorithms_numerics_test.transform_reduce_custom_functors_overloadA_using_custom_value_type
60: [       OK ] std_algorithms_numerics_test.transform_reduce_custom_functors_overloadA_using_custom_value_type (1 ms)
60: [ RUN      ] std_algorithms_numerics_test.transform_reduce_custom_functors_overloadB_using_pod_value_type
60: [       OK ] std_algorithms_numerics_test.transform_reduce_custom_functors_overloadB_using_pod_value_type (1 ms)
60: [ RUN      ] std_algorithms_numerics_test.transform_reduce_custom_functors_overloadB_using_custom_value_type
60: [       OK ] std_algorithms_numerics_test.transform_reduce_custom_functors_overloadB_using_custom_value_type (1 ms)
60: [ RUN      ] std_algorithms_numerics_test.reduce_default_functors_overloadA_using_pod_value_type
60: [       OK ] std_algorithms_numerics_test.reduce_default_functors_overloadA_using_pod_value_type (0 ms)
60: [ RUN      ] std_algorithms_numerics_test.reduce_default_functors_overloadA_using_custom_value_type
60: [       OK ] std_algorithms_numerics_test.reduce_default_functors_overloadA_using_custom_value_type (1 ms)
60: [ RUN      ] std_algorithms_numerics_test.reduce_default_functors_overloadB_using_pod_value_type
60: [       OK ] std_algorithms_numerics_test.reduce_default_functors_overloadB_using_pod_value_type (0 ms)
60: [ RUN      ] std_algorithms_numerics_test.reduce_default_functors_overloadB_using_custom_value_type
60: [       OK ] std_algorithms_numerics_test.reduce_default_functors_overloadB_using_custom_value_type (0 ms)
60: [ RUN      ] std_algorithms_numerics_test.reduce_custom_functors_using_pod_value_type
60: [       OK ] std_algorithms_numerics_test.reduce_custom_functors_using_pod_value_type (1 ms)
60: [ RUN      ] std_algorithms_numerics_test.reduce_custom_functors_using_custom_value_type
60: [       OK ] std_algorithms_numerics_test.reduce_custom_functors_using_custom_value_type (0 ms)
60: [----------] 12 tests from std_algorithms_numerics_test (15 ms total)
60: 
60: [----------] 1 test from std_algorithms_numerics_ops_test
60: [ RUN      ] std_algorithms_numerics_ops_test.adjecent_difference
60: [       OK ] std_algorithms_numerics_ops_test.adjecent_difference (160 ms)
60: [----------] 1 test from std_algorithms_numerics_ops_test (160 ms total)
60: 
60: [----------] 4 tests from std_algorithms_numeric_ops_test
60: [ RUN      ] std_algorithms_numeric_ops_test.exclusive_scan
60: [       OK ] std_algorithms_numeric_ops_test.exclusive_scan (780 ms)
60: [ RUN      ] std_algorithms_numeric_ops_test.inclusive_scan
60: [       OK ] std_algorithms_numeric_ops_test.inclusive_scan (561 ms)
60: [ RUN      ] std_algorithms_numeric_ops_test.transform_exclusive_scan
60: [       OK ] std_algorithms_numeric_ops_test.transform_exclusive_scan (229 ms)
60: [ RUN      ] std_algorithms_numeric_ops_test.transform_inclusive_scan
60: [       OK ] std_algorithms_numeric_ops_test.transform_inclusive_scan (73 ms)
60: [----------] 4 tests from std_algorithms_numeric_ops_test (1644 ms total)
60: 
60: [----------] 1 test from std_algorithms_transform_ops_test
60: [ RUN      ] std_algorithms_transform_ops_test.transform_unary_op
60: [       OK ] std_algorithms_transform_ops_test.transform_unary_op (61 ms)
60: [----------] 1 test from std_algorithms_transform_ops_test (61 ms total)
60: 
60: [----------] Global test environment tear-down
60: [==========] 25 tests from 7 test suites ran. (1990 ms total)
60: [  PASSED  ] 25 tests.
60/61 Test #60: KokkosAlgorithms_UnitTest_StdSet_E ...........   Passed    2.34 sec
test 61
      Start 61: KokkosSimd_UnitTest_SIMD

61: Test command: /var/jenkins/workspace/Kokkos/build/simd/unit_tests/KokkosSimd_UnitTest_SIMD
61: Test timeout computed to be: 1500
61: [==========] Running 2 tests from 1 test suite.
61: [----------] Global test environment set-up.
61: [----------] 2 tests from simd
61: [ RUN      ] simd.host
61: [       OK ] simd.host (0 ms)
61: [ RUN      ] simd.device
61: [       OK ] simd.device (0 ms)
61: [----------] 2 tests from simd (0 ms total)
61: 
61: [----------] Global test environment tear-down
61: [==========] 2 tests from 1 test suite ran. (0 ms total)
61: [  PASSED  ] 2 tests.
61/61 Test #61: KokkosSimd_UnitTest_SIMD .....................   Passed    0.30 sec

98% tests passed, 1 tests failed out of 61

Total Test time (real) = 476.17 sec

The following tests FAILED:
	 53 - KokkosContainers_UnitTest_Cuda (Failed)
Errors while running CTest
Post stage
[Pipeline] sh
+ ccache --show-stats
cache directory                     /tmp/ccache
primary config                      /tmp/ccache/ccache.conf
secondary config      (readonly)    /etc/ccache.conf
stats zero time                     Fri Aug  5 23:12:09 2022
cache hit (direct)                    39
cache hit (preprocessed)               0
cache miss                           554
cache hit rate                      6.58 %
cleanups performed                     3
files in cache                     18406
cache size                           9.2 GB
max cache size                      10.0 GB
[Pipeline] }
$ docker stop --time=1 cd57a5ac4ba0df7ead3e665c592a444b54315adfa995dbd4d151ecb141895628
$ docker rm -f cd57a5ac4ba0df7ead3e665c592a444b54315adfa995dbd4d151ecb141895628
[Pipeline] // withDockerContainer
[Pipeline] }
[Pipeline] // withEnv
[Pipeline] }
[Pipeline] // node
[Pipeline] }
[Pipeline] // stage
[Pipeline] }
Failed in branch CUDA-10.1-Clang-Tidy
[Pipeline] // parallel
[Pipeline] }
[Pipeline] // stage
[Pipeline] }
[Pipeline] // timeout
[Pipeline] }
[Pipeline] // withEnv
[Pipeline] End of Pipeline
ERROR: script returned exit code 2
Setting status of b9c4fc7afd858718c3a70ee11c45a1bf2fd43808 to FAILURE with url https://cloud.cees.ornl.gov/jenkins-ci/job/Kokkos/9884/ and message: 'Build finished. '
Using context: continuous-integration/jenkin-ci/pr
Finished: FAILURE