Console Output

Skipping 10,599 KB.. Full Log
Memory access fault by GPU node-2 (Agent handle: 0x2b4ab20) on address 0x600000000. Reason: Page not present or supervisor privilege.


98% tests passed, 1 tests failed out of 42

Total Test time (real) = 252.17 sec

The following tests FAILED:
	 42 - KokkosAlgorithms_UnitTest (Child aborted)
Errors while running CTest
Post stage
[Pipeline] sh
+ ccache --show-stats
cache directory                     /tmp/ccache
primary config                      /tmp/ccache/ccache.conf
secondary config      (readonly)    /etc/ccache.conf
stats updated                       Thu Aug  5 09:32:05 2021
stats zeroed                        Thu Aug  5 09:32:05 2021
cache hit (direct)                     0
cache hit (preprocessed)               0
cache miss                             0
cache hit rate                      0.00 %
cleanups performed                     0
files in cache                      4833
cache size                           5.4 GB
max cache size                      10.0 GB
[Pipeline] }
[Pipeline] // withEnv
[Pipeline] }
$ docker stop --time=1 29ef03b87c2d4de47e12d5d7c96bfeb687b7a740f9e4b16d40ac838c44d74810
$ docker rm -f 29ef03b87c2d4de47e12d5d7c96bfeb687b7a740f9e4b16d40ac838c44d74810
[Pipeline] // withDockerContainer
[Pipeline] }
[Pipeline] // withEnv
[Pipeline] }
[Pipeline] // node
[Pipeline] }
[Pipeline] // stage
[Pipeline] }
Failed in branch OPENMPTARGET-ROCm-4.2
[Pipeline] // parallel
[Pipeline] }
[Pipeline] // stage
[Pipeline] }
[Pipeline] // timeout
[Pipeline] }
[Pipeline] // withEnv
[Pipeline] End of Pipeline
ERROR: script returned exit code 2
Setting status of d649cbe8c9fb32f4a9d27ab95ff771e9d9682cbd to FAILURE with url https://cloud.cees.ornl.gov/jenkins-ci/job/Kokkos/5931/ and message: 'Build finished. '
Using context: continuous-integration/jenkin-ci/pr
Finished: FAILURE