Console Output

Skipping 5,393 KB.. Full Log
54: [ RUN      ] std_algorithms_non_mod_seq_ops.for_each_modifying_functor_static_view
54: [       OK ] std_algorithms_non_mod_seq_ops.for_each_modifying_functor_static_view (1 ms)
54: [ RUN      ] std_algorithms_non_mod_seq_ops.for_each_modifying_functor_dynamic_view
54: [       OK ] std_algorithms_non_mod_seq_ops.for_each_modifying_functor_dynamic_view (0 ms)
54: [ RUN      ] std_algorithms_non_mod_seq_ops.for_each_modifying_functor_strided_view
54: [       OK ] std_algorithms_non_mod_seq_ops.for_each_modifying_functor_strided_view (1 ms)
54: [ RUN      ] std_algorithms_non_mod_seq_ops.for_each_non_modifying_functor_static_view
54: [       OK ] std_algorithms_non_mod_seq_ops.for_each_non_modifying_functor_static_view (0 ms)
54: [ RUN      ] std_algorithms_non_mod_seq_ops.for_each_non_modifying_functor_dynamic_view
54: [       OK ] std_algorithms_non_mod_seq_ops.for_each_non_modifying_functor_dynamic_view (0 ms)
54: [ RUN      ] std_algorithms_non_mod_seq_ops.for_each_non_modifying_functor_strided_view
54: [       OK ] std_algorithms_non_mod_seq_ops.for_each_non_modifying_functor_strided_view (1 ms)
54: [ RUN      ] std_algorithms_non_mod_seq_ops.for_each_modifying_lambda_static_view
54: [       OK ] std_algorithms_non_mod_seq_ops.for_each_modifying_lambda_static_view (0 ms)
54: [ RUN      ] std_algorithms_non_mod_seq_ops.for_each_modifying_lambda_dynamic_view
54: [       OK ] std_algorithms_non_mod_seq_ops.for_each_modifying_lambda_dynamic_view (1 ms)
54: [ RUN      ] std_algorithms_non_mod_seq_ops.for_each_modifying_lambda_strided_view
54: [       OK ] std_algorithms_non_mod_seq_ops.for_each_modifying_lambda_strided_view (0 ms)
54: [ RUN      ] std_algorithms_non_mod_seq_ops.for_each_non_modifying_lambda_static_view
54: [       OK ] std_algorithms_non_mod_seq_ops.for_each_non_modifying_lambda_static_view (1 ms)
54: [ RUN      ] std_algorithms_non_mod_seq_ops.for_each_non_modifying_lambda_dynamic_view
54: [       OK ] std_algorithms_non_mod_seq_ops.for_each_non_modifying_lambda_dynamic_view (0 ms)
54: [ RUN      ] std_algorithms_non_mod_seq_ops.for_each_non_modifying_lambda_strided_view
54: [       OK ] std_algorithms_non_mod_seq_ops.for_each_non_modifying_lambda_strided_view (0 ms)
54: [ RUN      ] std_algorithms_non_mod_seq_ops.count_if
54: [       OK ] std_algorithms_non_mod_seq_ops.count_if (1 ms)
54: [ RUN      ] std_algorithms_non_mod_seq_ops.mismatch
54: [       OK ] std_algorithms_non_mod_seq_ops.mismatch (0 ms)
54: [ RUN      ] std_algorithms_non_mod_seq_ops.mismatch_view
54: [       OK ] std_algorithms_non_mod_seq_ops.mismatch_view (1 ms)
54: [ RUN      ] std_algorithms_non_mod_seq_ops.find_if_lambda
54: [       OK ] std_algorithms_non_mod_seq_ops.find_if_lambda (1 ms)
54: [ RUN      ] std_algorithms_non_mod_seq_ops.find_if_not_lambda
54: [       OK ] std_algorithms_non_mod_seq_ops.find_if_not_lambda (1 ms)
54: [ RUN      ] std_algorithms_non_mod_seq_ops.find
54: [       OK ] std_algorithms_non_mod_seq_ops.find (1 ms)
54: [ RUN      ] std_algorithms_non_mod_seq_ops.all_of_lambda
54: [       OK ] std_algorithms_non_mod_seq_ops.all_of_lambda (1 ms)
54: [ RUN      ] std_algorithms_non_mod_seq_ops.any_of_lambda
54: [       OK ] std_algorithms_non_mod_seq_ops.any_of_lambda (1 ms)
54: [ RUN      ] std_algorithms_non_mod_seq_ops.none_of_lambda
54: [       OK ] std_algorithms_non_mod_seq_ops.none_of_lambda (1 ms)
54: [----------] 21 tests from std_algorithms_non_mod_seq_ops (13 ms total)
54: 
54: [----------] 8 tests from std_algorithms_min_max
54: [ RUN      ] std_algorithms_min_max.max
54: [       OK ] std_algorithms_min_max.max (0 ms)
54: [ RUN      ] std_algorithms_min_max.max_within_parfor
54: [       OK ] std_algorithms_min_max.max_within_parfor (0 ms)
54: [ RUN      ] std_algorithms_min_max.min
54: [       OK ] std_algorithms_min_max.min (0 ms)
54: [ RUN      ] std_algorithms_min_max.min_within_parfor
54: [       OK ] std_algorithms_min_max.min_within_parfor (0 ms)
54: [ RUN      ] std_algorithms_min_max.minmax
54: [       OK ] std_algorithms_min_max.minmax (0 ms)
54: [ RUN      ] std_algorithms_min_max.minmax_within_parfor
54: [       OK ] std_algorithms_min_max.minmax_within_parfor (0 ms)
54: [ RUN      ] std_algorithms_min_max.clamp
54: [       OK ] std_algorithms_min_max.clamp (0 ms)
54: [ RUN      ] std_algorithms_min_max.clamp_within_parfor
54: [       OK ] std_algorithms_min_max.clamp_within_parfor (1 ms)
54: [----------] 8 tests from std_algorithms_min_max (1 ms total)
54: 
54: [----------] 46 tests from std_algorithms_min_max_element
54: [ RUN      ] std_algorithms_min_max_element.max_element_from_within_team_parfor
54: [       OK ] std_algorithms_min_max_element.max_element_from_within_team_parfor (0 ms)
54: [ RUN      ] std_algorithms_min_max_element.max_element_static_view_empty
54: [       OK ] std_algorithms_min_max_element.max_element_static_view_empty (0 ms)
54: [ RUN      ] std_algorithms_min_max_element.max_element_dynamic_view_empty
54: [       OK ] std_algorithms_min_max_element.max_element_dynamic_view_empty (1 ms)
54: [ RUN      ] std_algorithms_min_max_element.max_element_strided_view_empty
54: [       OK ] std_algorithms_min_max_element.max_element_strided_view_empty (0 ms)
54: [ RUN      ] std_algorithms_min_max_element.max_element_static_view_api_accepting_iterators
54: [       OK ] std_algorithms_min_max_element.max_element_static_view_api_accepting_iterators (4 ms)
54: [ RUN      ] std_algorithms_min_max_element.max_element_static_view_api_accepting_iterators_custom_comp
54: [       OK ] std_algorithms_min_max_element.max_element_static_view_api_accepting_iterators_custom_comp (3 ms)
54: [ RUN      ] std_algorithms_min_max_element.max_element_static_view_api_accepting_view
54: [       OK ] std_algorithms_min_max_element.max_element_static_view_api_accepting_view (4 ms)
54: [ RUN      ] std_algorithms_min_max_element.max_element_static_view_api_accepting_view_custom_comp
54: [       OK ] std_algorithms_min_max_element.max_element_static_view_api_accepting_view_custom_comp (3 ms)
54: [ RUN      ] std_algorithms_min_max_element.max_element_dynamic_view_api_accepting_iterators
54: [       OK ] std_algorithms_min_max_element.max_element_dynamic_view_api_accepting_iterators (4 ms)
54: [ RUN      ] std_algorithms_min_max_element.max_element_dynamic_view_api_accepting_iterators_custom_comp
54: [       OK ] std_algorithms_min_max_element.max_element_dynamic_view_api_accepting_iterators_custom_comp (4 ms)
54: [ RUN      ] std_algorithms_min_max_element.max_element_dynamic_view_api_accepting_view
54: [       OK ] std_algorithms_min_max_element.max_element_dynamic_view_api_accepting_view (3 ms)
54: [ RUN      ] std_algorithms_min_max_element.max_element_dynamic_view_api_accepting_view_custom_comp
54: [       OK ] std_algorithms_min_max_element.max_element_dynamic_view_api_accepting_view_custom_comp (3 ms)
54: [ RUN      ] std_algorithms_min_max_element.max_element_strided_view_api_accepting_iterators
54: [       OK ] std_algorithms_min_max_element.max_element_strided_view_api_accepting_iterators (4 ms)
54: [ RUN      ] std_algorithms_min_max_element.max_element_strided_view_api_accepting_iterators_custom_comp
54: [       OK ] std_algorithms_min_max_element.max_element_strided_view_api_accepting_iterators_custom_comp (4 ms)
54: [ RUN      ] std_algorithms_min_max_element.max_element_strided_view_api_accepting_view
54: [       OK ] std_algorithms_min_max_element.max_element_strided_view_api_accepting_view (3 ms)
54: [ RUN      ] std_algorithms_min_max_element.max_element_strided_view_api_accepting_view_custom_comp
54: [       OK ] std_algorithms_min_max_element.max_element_strided_view_api_accepting_view_custom_comp (4 ms)
54: [ RUN      ] std_algorithms_min_max_element.min_element_static_view_empty
54: [       OK ] std_algorithms_min_max_element.min_element_static_view_empty (0 ms)
54: [ RUN      ] std_algorithms_min_max_element.min_element_dynamic_view_empty
54: [       OK ] std_algorithms_min_max_element.min_element_dynamic_view_empty (0 ms)
54: [ RUN      ] std_algorithms_min_max_element.min_element_strided_view_empty
54: [       OK ] std_algorithms_min_max_element.min_element_strided_view_empty (0 ms)
54: [ RUN      ] std_algorithms_min_max_element.min_element_static_view_api_accepting_iterators
54: [       OK ] std_algorithms_min_max_element.min_element_static_view_api_accepting_iterators (4 ms)
54: [ RUN      ] std_algorithms_min_max_element.min_element_static_view_api_accepting_iterators_custom_comp
54: [       OK ] std_algorithms_min_max_element.min_element_static_view_api_accepting_iterators_custom_comp (3 ms)
54: [ RUN      ] std_algorithms_min_max_element.min_element_static_view_api_accepting_view
54: [       OK ] std_algorithms_min_max_element.min_element_static_view_api_accepting_view (4 ms)
54: [ RUN      ] std_algorithms_min_max_element.min_element_static_view_api_accepting_view_custom_comp
54: [       OK ] std_algorithms_min_max_element.min_element_static_view_api_accepting_view_custom_comp (3 ms)
54: [ RUN      ] std_algorithms_min_max_element.min_element_dynamic_view_api_accepting_iterators
54: [       OK ] std_algorithms_min_max_element.min_element_dynamic_view_api_accepting_iterators (4 ms)
54: [ RUN      ] std_algorithms_min_max_element.min_element_dynamic_view_api_accepting_iterators_custom_comp
54: [       OK ] std_algorithms_min_max_element.min_element_dynamic_view_api_accepting_iterators_custom_comp (3 ms)
54: [ RUN      ] std_algorithms_min_max_element.min_element_dynamic_view_api_accepting_view
54: [       OK ] std_algorithms_min_max_element.min_element_dynamic_view_api_accepting_view (4 ms)
54: [ RUN      ] std_algorithms_min_max_element.min_element_dynamic_view_api_accepting_view_custom_comp
54: [       OK ] std_algorithms_min_max_element.min_element_dynamic_view_api_accepting_view_custom_comp (3 ms)
54: [ RUN      ] std_algorithms_min_max_element.min_element_strided_view_api_accepting_iterators
54: [       OK ] std_algorithms_min_max_element.min_element_strided_view_api_accepting_iterators (4 ms)
54: [ RUN      ] std_algorithms_min_max_element.min_element_strided_view_api_accepting_iterators_custom_comp
54: [       OK ] std_algorithms_min_max_element.min_element_strided_view_api_accepting_iterators_custom_comp (3 ms)
54: [ RUN      ] std_algorithms_min_max_element.min_element_strided_view_api_accepting_view
54: [       OK ] std_algorithms_min_max_element.min_element_strided_view_api_accepting_view (4 ms)
54: [ RUN      ] std_algorithms_min_max_element.min_element_strided_view_api_accepting_view_custom_comp
54: [       OK ] std_algorithms_min_max_element.min_element_strided_view_api_accepting_view_custom_comp (3 ms)
54: [ RUN      ] std_algorithms_min_max_element.minmax_element_static_view_empty
54: [       OK ] std_algorithms_min_max_element.minmax_element_static_view_empty (0 ms)
54: [ RUN      ] std_algorithms_min_max_element.minmax_element_dynamic_view_empty
54: [       OK ] std_algorithms_min_max_element.minmax_element_dynamic_view_empty (0 ms)
54: [ RUN      ] std_algorithms_min_max_element.minmax_element_strided_view_empty
54: [       OK ] std_algorithms_min_max_element.minmax_element_strided_view_empty (1 ms)
54: [ RUN      ] std_algorithms_min_max_element.minmax_element_static_view_api_accepting_iterators
54: [       OK ] std_algorithms_min_max_element.minmax_element_static_view_api_accepting_iterators (4 ms)
54: [ RUN      ] std_algorithms_min_max_element.minmax_element_static_view_api_accepting_iterators_custom_comp
54: [       OK ] std_algorithms_min_max_element.minmax_element_static_view_api_accepting_iterators_custom_comp (5 ms)
54: [ RUN      ] std_algorithms_min_max_element.minmax_element_static_view_api_accepting_view
54: [       OK ] std_algorithms_min_max_element.minmax_element_static_view_api_accepting_view (4 ms)
54: [ RUN      ] std_algorithms_min_max_element.minmax_element_static_view_api_accepting_view_custom_comp
54: [       OK ] std_algorithms_min_max_element.minmax_element_static_view_api_accepting_view_custom_comp (5 ms)
54: [ RUN      ] std_algorithms_min_max_element.minmax_element_dynamic_view_api_accepting_iterators
54: [       OK ] std_algorithms_min_max_element.minmax_element_dynamic_view_api_accepting_iterators (5 ms)
54: [ RUN      ] std_algorithms_min_max_element.minmax_element_dynamic_view_api_accepting_iterators_custom_comp
54: [       OK ] std_algorithms_min_max_element.minmax_element_dynamic_view_api_accepting_iterators_custom_comp (4 ms)
54: [ RUN      ] std_algorithms_min_max_element.minmax_element_dynamic_view_api_accepting_view
54: [       OK ] std_algorithms_min_max_element.minmax_element_dynamic_view_api_accepting_view (4 ms)
54: [ RUN      ] std_algorithms_min_max_element.minmax_element_dynamic_view_api_accepting_view_custom_comp
54: [       OK ] std_algorithms_min_max_element.minmax_element_dynamic_view_api_accepting_view_custom_comp (5 ms)
54: [ RUN      ] std_algorithms_min_max_element.minmax_element_strided_view_api_accepting_iterators
54: [       OK ] std_algorithms_min_max_element.minmax_element_strided_view_api_accepting_iterators (5 ms)
54: [ RUN      ] std_algorithms_min_max_element.minmax_element_strided_view_api_accepting_iterators_custom_comp
54: [       OK ] std_algorithms_min_max_element.minmax_element_strided_view_api_accepting_iterators_custom_comp (4 ms)
54: [ RUN      ] std_algorithms_min_max_element.minmax_element_strided_view_api_accepting_view
54: [       OK ] std_algorithms_min_max_element.minmax_element_strided_view_api_accepting_view (5 ms)
54: [ RUN      ] std_algorithms_min_max_element.minmax_element_strided_view_api_accepting_view_custom_comp
54: [       OK ] std_algorithms_min_max_element.minmax_element_strided_view_api_accepting_view_custom_comp (4 ms)
54: [----------] 46 tests from std_algorithms_min_max_element (141 ms total)
54: 
54: [----------] 5 tests from std_algorithms_partitioning
54: [ RUN      ] std_algorithms_partitioning.is_partitioned_trivial
54: [       OK ] std_algorithms_partitioning.is_partitioned_trivial (1 ms)
54: [ RUN      ] std_algorithms_partitioning.is_partitioned_accepting_iterators
54: [       OK ] std_algorithms_partitioning.is_partitioned_accepting_iterators (3 ms)
54: [ RUN      ] std_algorithms_partitioning.is_partitioned_accepting_view
54: [       OK ] std_algorithms_partitioning.is_partitioned_accepting_view (3 ms)
54: [ RUN      ] std_algorithms_partitioning.partition_point
54: [       OK ] std_algorithms_partitioning.partition_point (4 ms)
54: [ RUN      ] std_algorithms_partitioning.partition_copy
54: [       OK ] std_algorithms_partitioning.partition_copy (10 ms)
54: [----------] 5 tests from std_algorithms_partitioning (22 ms total)
54: 
54: [----------] 3 tests from serial
54: [ RUN      ] serial.Random_XorShift64
54: Test Seed:1628153415509559179
54: Test Scalar=int
54:  -- Testing randomness properties
35: [==========] Running 28 tests from 1 test case.
35: [----------] Global test environment set-up.
35: [----------] 28 tests from OPENMP
35: [ RUN      ] OPENMP.IncrTest_01_execspace_typedef
35: [       OK ] OPENMP.IncrTest_01_execspace_typedef (0 ms)
35: [ RUN      ] OPENMP.IncrTest_01_execspace
35: Kokkos::OpenMP thread_pool_topology[ 1 x 8 x 1 ]
35: OpenMP
35: [       OK ] OPENMP.IncrTest_01_execspace (0 ms)
35: [ RUN      ] OPENMP.IncrTest_01_AtomicExchange
35: [       OK ] OPENMP.IncrTest_01_AtomicExchange (0 ms)
35: [ RUN      ] OPENMP.IncrTest_02_AtomicAdd
35: [       OK ] OPENMP.IncrTest_02_AtomicAdd (0 ms)
35: [ RUN      ] OPENMP.IncrTest_02_AtomicSub
35: [       OK ] OPENMP.IncrTest_02_AtomicSub (0 ms)
35: [ RUN      ] OPENMP.IncrTest_03a_memspace_malloc
35: [       OK ] OPENMP.IncrTest_03a_memspace_malloc (0 ms)
35: [ RUN      ] OPENMP.IncrTest_03b_memspace_free
35: [       OK ] OPENMP.IncrTest_03b_memspace_free (23 ms)
35: [ RUN      ] OPENMP.IncrTest_04_simple_parallelFor
35: [       OK ] OPENMP.IncrTest_04_simple_parallelFor (0 ms)
35: [ RUN      ] OPENMP.IncrTest_04_RangePolicy_parallelFor
35: [       OK ] OPENMP.IncrTest_04_RangePolicy_parallelFor (0 ms)
35: [ RUN      ] OPENMP.IncrTest_05_reduction
35: [       OK ] OPENMP.IncrTest_05_reduction (7 ms)
35: [ RUN      ] OPENMP.IncrTest_06_mdrange2D
35: [       OK ] OPENMP.IncrTest_06_mdrange2D (0 ms)
35: [ RUN      ] OPENMP.IncrTest_06_mdrange3D
35: [       OK ] OPENMP.IncrTest_06_mdrange3D (0 ms)
35: [ RUN      ] OPENMP.IncrTest_06_mdrange4D
35: [       OK ] OPENMP.IncrTest_06_mdrange4D (0 ms)
35: [ RUN      ] OPENMP.IncrTest_08_deep_copy_2D
35: [       OK ] OPENMP.IncrTest_08_deep_copy_2D (0 ms)
35: [ RUN      ] OPENMP.IncrTest_08_deep_copy_3D
35: [       OK ] OPENMP.IncrTest_08_deep_copy_3D (0 ms)
35: [ RUN      ] OPENMP.IncrTest_08_deep_copy_4D
35: [       OK ] OPENMP.IncrTest_08_deep_copy_4D (0 ms)
35: [ RUN      ] OPENMP.IncrTest_10_Hierarchical_Basics
35: [       OK ] OPENMP.IncrTest_10_Hierarchical_Basics (0 ms)
35: [ RUN      ] OPENMP.IncrTest_11a_Hierarchical_ForLoop
35: [       OK ] OPENMP.IncrTest_11a_Hierarchical_ForLoop (1 ms)
35: [ RUN      ] OPENMP.IncrTest_11b_Hierarchical_ForLoop
35: [       OK ] OPENMP.IncrTest_11b_Hierarchical_ForLoop (0 ms)
35: [ RUN      ] OPENMP.IncrTest_11c_Hierarchical_ForLoop
[ 32%] Building CXX object core/unit_test/CMakeFiles/KokkosCore_IncrementalTest_CUDA.dir/generated/Test10_HierarchicalBasics_CUDA.cpp.o
35: [       OK ] OPENMP.IncrTest_11c_Hierarchical_ForLoop (87 ms)
35: [ RUN      ] OPENMP.IncrTest_12a_ThreadScratch
35: [       OK ] OPENMP.IncrTest_12a_ThreadScratch (1 ms)
35: [ RUN      ] OPENMP.IncrTest_12b_TeamScratch
35: [       OK ] OPENMP.IncrTest_12b_TeamScratch (1 ms)
35: [ RUN      ] OPENMP.IncrTest_13a_Hierarchical_Red
35: [       OK ] OPENMP.IncrTest_13a_Hierarchical_Red (0 ms)
35: [ RUN      ] OPENMP.IncrTest_13b_Hierarchical_Red
35: [       OK ] OPENMP.IncrTest_13b_Hierarchical_Red (0 ms)
35: [ RUN      ] OPENMP.IncrTest_13c_Hierarchical_Red
35: [       OK ] OPENMP.IncrTest_13c_Hierarchical_Red (0 ms)
35: [ RUN      ] OPENMP.incr_14_MDrangeReduce
35: [       OK ] OPENMP.incr_14_MDrangeReduce (0 ms)
35: [ RUN      ] OPENMP.IncrTest_16_parallelscan
35: [       OK ] OPENMP.IncrTest_16_parallelscan (0 ms)
35: [ RUN      ] OPENMP.incr_17_atomicView
35: [       OK ] OPENMP.incr_17_atomicView (0 ms)
35: [----------] 28 tests from OPENMP (121 ms total)
35: 
35: [----------] Global test environment tear-down
35: [==========] 28 tests from 1 test case ran. (121 ms total)
35: [  PASSED  ] 28 tests.
35/48 Test #35: KokkosCore_IncrementalTest_OPENMP ............   Passed    0.46 sec
test 36
      Start 36: KokkosCore_IncrementalTest_HIP

36: Test command: /var/jenkins/workspace/Kokkos/build/core/unit_test/KokkosCore_IncrementalTest_HIP
36: Test timeout computed to be: 1500
[       OK ] serial_DeathTest.view_layoutstride_right_to_layoutleft_assignment (5703 ms)
[ RUN      ] serial_DeathTest.view_layoutstride_left_to_layoutright_assignment
view_layoutstride_left_to_layoutright_assignment: srand(1628153415)
36: [==========] Running 28 tests from 1 test case.
36: [----------] Global test environment set-up.
36: [----------] 28 tests from HIP
36: [ RUN      ] HIP.IncrTest_01_execspace_typedef
36: [       OK ] HIP.IncrTest_01_execspace_typedef (0 ms)
36: [ RUN      ] HIP.IncrTest_01_execspace
36: macro  KOKKOS_ENABLE_HIP : defined
36: macro  HIP_VERSION = 402 = version 4.2
36: Kokkos::Experimental::HIP[ 0 ] Device 66a1 version 9.0, Total Global Memory: 31.98 G, Shared Memory per Block: 64 K : Selected
36: HIP
36: [       OK ] HIP.IncrTest_01_execspace (0 ms)
36: [ RUN      ] HIP.IncrTest_01_AtomicExchange
36: [       OK ] HIP.IncrTest_01_AtomicExchange (0 ms)
36: [ RUN      ] HIP.IncrTest_02_AtomicAdd
36: [       OK ] HIP.IncrTest_02_AtomicAdd (0 ms)
36: [ RUN      ] HIP.IncrTest_02_AtomicSub
36: [       OK ] HIP.IncrTest_02_AtomicSub (0 ms)
36: [ RUN      ] HIP.IncrTest_03a_memspace_malloc
36: [       OK ] HIP.IncrTest_03a_memspace_malloc (1 ms)
36: [ RUN      ] HIP.IncrTest_03b_memspace_free
[ 32%] Building CXX object core/unit_test/CMakeFiles/KokkosCore_UnitTest_Cuda3.dir/cuda/TestCudaUVM_ViewMapping_subview.cpp.o
/var/jenkins/workspace/Kokkos/core/unit_test/TestPolicyConstruction.hpp(797): warning: variable "_assert1" was set but never used

/var/jenkins/workspace/Kokkos/core/unit_test/TestPolicyConstruction.hpp(807): warning: variable "_assert2" was set but never used

[ 32%] Building CXX object core/unit_test/CMakeFiles/KokkosCore_UnitTest_Serial1.dir/serial/TestSerial_LocalDeepCopy.cpp.o
[ 33%] Building CXX object core/unit_test/CMakeFiles/KokkosCore_UnitTest_Serial2.dir/serial/TestSerial_View_64bit.cpp.o
[       OK ] serial_DeathTest.view_layoutstride_left_to_layoutright_assignment (3021 ms)
[----------] 3 tests from serial_DeathTest (10208 ms total)

[----------] 157 tests from serial
[ RUN      ] serial.init
[       OK ] serial.init (0 ms)
[ RUN      ] serial.dispatch
[       OK ] serial.dispatch (13 ms)
[ RUN      ] serial.compiler_macros
[       OK ] serial.compiler_macros (4 ms)
[ RUN      ] serial.policy_construction
[       OK ] serial.policy_construction (0 ms)
[ RUN      ] serial.policy_converting_constructor_from_other_policy
[       OK ] serial.policy_converting_constructor_from_other_policy (0 ms)
[ RUN      ] serial.desired_occupancy_prefer
[       OK ] serial.desired_occupancy_prefer (0 ms)
[ RUN      ] serial.desired_occupancy_empty_base_optimization
[       OK ] serial.desired_occupancy_empty_base_optimization (0 ms)
[ RUN      ] serial.desired_occupancy_converting_constructors
[       OK ] serial.desired_occupancy_converting_constructors (0 ms)
[ RUN      ] serial.md_range_policy_construction_from_arrays
[       OK ] serial.md_range_policy_construction_from_arrays (0 ms)
[ RUN      ] serial.policy_set_worktag
[       OK ] serial.policy_set_worktag (0 ms)
[ RUN      ] serial.impl_shared_alloc
[       OK ] serial.impl_shared_alloc (10 ms)
[ RUN      ] serial.range_for
[       OK ] serial.range_for (0 ms)
[ RUN      ] serial.range_reduce
[       OK ] serial.range_reduce (0 ms)
[ RUN      ] serial.range_scan
[       OK ] serial.range_scan (1 ms)
[ RUN      ] serial.range_for_require
[       OK ] serial.range_for_require (0 ms)
[ RUN      ] serial.range_reduce_require
[       OK ] serial.range_reduce_require (0 ms)
[ RUN      ] serial.range_scan_require
[       OK ] serial.range_scan_require (0 ms)
[ RUN      ] serial.view_api_a
[       OK ] serial.view_api_a (51 ms)
[ RUN      ] serial.view_api_b
[       OK ] serial.view_api_b (1 ms)
[ RUN      ] serial.view_api_c
[       OK ] serial.view_api_c (2 ms)
[ RUN      ] serial.view_api_d
[       OK ] serial.view_api_d (7 ms)
[ RUN      ] serial.view_allocation_error
[       OK ] serial.view_allocation_error (0 ms)
[ RUN      ] serial.view_remap
[       OK ] serial.view_remap (1 ms)
[ RUN      ] serial.view_mirror_nonconst
[       OK ] serial.view_mirror_nonconst (0 ms)
[ RUN      ] serial.view_stride_method
[       OK ] serial.view_stride_method (2 ms)
[ RUN      ] serial.anonymous_space
[       OK ] serial.anonymous_space (0 ms)
[ RUN      ] serial.view_overload_resolution
[       OK ] serial.view_overload_resolution (0 ms)
[ RUN      ] serial.view_is_assignable
[       OK ] serial.view_is_assignable (0 ms)
[ RUN      ] serial.deep_copy_alignment
[       OK ] serial.deep_copy_alignment (85 ms)
[ RUN      ] serial.deep_copy_conversion
[       OK ] cuda_DeathTest.view_layoutstride_right_to_layoutleft_assignment (8277 ms)
[ RUN      ] cuda_DeathTest.view_layoutstride_left_to_layoutright_assignment
view_layoutstride_left_to_layoutright_assignment: srand(1628153419)
[ 33%] Building CXX object core/unit_test/CMakeFiles/KokkosCore_IncrementalTest_CUDA.dir/generated/Test11a_ParallelFor_TeamThreadRange_CUDA.cpp.o
36: [       OK ] HIP.IncrTest_03b_memspace_free (3249 ms)
36: [ RUN      ] HIP.IncrTest_04_simple_parallelFor
36: [       OK ] HIP.IncrTest_04_simple_parallelFor (1 ms)
36: [ RUN      ] HIP.IncrTest_04_RangePolicy_parallelFor
36: [       OK ] HIP.IncrTest_04_RangePolicy_parallelFor (1 ms)
36: [ RUN      ] HIP.IncrTest_05_reduction
36: [       OK ] HIP.IncrTest_05_reduction (8 ms)
36: [ RUN      ] HIP.IncrTest_06_mdrange2D
36: [       OK ] HIP.IncrTest_06_mdrange2D (1 ms)
36: [ RUN      ] HIP.IncrTest_06_mdrange3D
36: [       OK ] HIP.IncrTest_06_mdrange3D (0 ms)
36: [ RUN      ] HIP.IncrTest_06_mdrange4D
36: [       OK ] HIP.IncrTest_06_mdrange4D (0 ms)
36: [ RUN      ] HIP.IncrTest_08_deep_copy_2D
36: [       OK ] HIP.IncrTest_08_deep_copy_2D (3 ms)
36: [ RUN      ] HIP.IncrTest_08_deep_copy_3D
36: [       OK ] HIP.IncrTest_08_deep_copy_3D (0 ms)
36: [ RUN      ] HIP.IncrTest_08_deep_copy_4D
36: [       OK ] HIP.IncrTest_08_deep_copy_4D (1 ms)
36: [ RUN      ] HIP.IncrTest_10_Hierarchical_Basics
36: [       OK ] HIP.IncrTest_10_Hierarchical_Basics (1 ms)
36: [ RUN      ] HIP.IncrTest_11a_Hierarchical_ForLoop
36: [       OK ] HIP.IncrTest_11a_Hierarchical_ForLoop (1 ms)
36: [ RUN      ] HIP.IncrTest_11b_Hierarchical_ForLoop
36: [       OK ] HIP.IncrTest_11b_Hierarchical_ForLoop (2 ms)
36: [ RUN      ] HIP.IncrTest_11c_Hierarchical_ForLoop
36: [       OK ] HIP.IncrTest_11c_Hierarchical_ForLoop (222 ms)
36: [ RUN      ] HIP.IncrTest_12a_ThreadScratch
36: [       OK ] HIP.IncrTest_12a_ThreadScratch (20 ms)
36: [ RUN      ] HIP.IncrTest_12b_TeamScratch
36: [       OK ] HIP.IncrTest_12b_TeamScratch (2 ms)
36: [ RUN      ] HIP.IncrTest_13a_Hierarchical_Red
36: [       OK ] HIP.IncrTest_13a_Hierarchical_Red (1 ms)
36: [ RUN      ] HIP.IncrTest_13b_Hierarchical_Red
36: [       OK ] HIP.IncrTest_13b_Hierarchical_Red (1 ms)
36: [ RUN      ] HIP.IncrTest_13c_Hierarchical_Red
36: [       OK ] HIP.IncrTest_13c_Hierarchical_Red (2 ms)
36: [ RUN      ] HIP.incr_14_MDrangeReduce
36: [       OK ] HIP.incr_14_MDrangeReduce (1 ms)
36: [ RUN      ] HIP.IncrTest_16_parallelscan
36: [       OK ] HIP.IncrTest_16_parallelscan (2 ms)
36: [ RUN      ] HIP.incr_17_atomicView
36: [       OK ] HIP.incr_17_atomicView (2 ms)
36: [----------] 28 tests from HIP (3522 ms total)
36: 
36: [----------] Global test environment tear-down
36: [==========] 28 tests from 1 test case ran. (3522 ms total)
36: [  PASSED  ] 28 tests.
36/48 Test #36: KokkosCore_IncrementalTest_HIP ...............   Passed    3.87 sec
test 37
      Start 37: KokkosCore_UnitTest_CTestDevice

37: Test command: /var/jenkins/workspace/Kokkos/build/core/unit_test/KokkosCore_UnitTest_CTestDevice
37: Test timeout computed to be: 1500
37: [==========] Running 8 tests from 1 test case.
37: [----------] Global test environment set-up.
37: [----------] 8 tests from ctest_environment
37: [ RUN      ] ctest_environment.no_device_type
37: [       OK ] ctest_environment.no_device_type (0 ms)
37: [ RUN      ] ctest_environment.no_process_count
37: [       OK ] ctest_environment.no_process_count (0 ms)
37: [ RUN      ] ctest_environment.invalid_rank
37: [       OK ] ctest_environment.invalid_rank (0 ms)
37: [ RUN      ] ctest_environment.no_type_str
37: [       OK ] ctest_environment.no_type_str (0 ms)
37: [ RUN      ] ctest_environment.missing_type
37: [       OK ] ctest_environment.missing_type (0 ms)
37: [ RUN      ] ctest_environment.no_id_str
37: [       OK ] ctest_environment.no_id_str (1 ms)
37: [ RUN      ] ctest_environment.invalid_id_str
37: [       OK ] ctest_environment.invalid_id_str (0 ms)
37: [ RUN      ] ctest_environment.good
37: [       OK ] ctest_environment.good (0 ms)
37: [----------] 8 tests from ctest_environment (1 ms total)
37: 
37: [----------] Global test environment tear-down
37: [==========] 8 tests from 1 test case ran. (1 ms total)
37: [  PASSED  ] 8 tests.
37/48 Test #37: KokkosCore_UnitTest_CTestDevice ..............   Passed    0.02 sec
test 38
      Start 38: KokkosCore_UnitTest_CMakePassCmdLineArgs0

38: Test command: /var/jenkins/workspace/Kokkos/build/core/unit_test/KokkosCore_UnitTest_CMakePassCmdLineArgs "one" "2" "THREE"
38: Test timeout computed to be: 1500
38/48 Test #38: KokkosCore_UnitTest_CMakePassCmdLineArgs0 ....   Passed    0.02 sec
test 39
      Start 39: KokkosCore_PerfTestExec

39: Test command: /var/jenkins/workspace/Kokkos/build/core/perf_test/KokkosCore_PerfTestExec
39: Test timeout computed to be: 1500
[       OK ] serial.deep_copy_conversion (552 ms)
[ RUN      ] serial.view_copy_tests
[       OK ] serial.view_copy_tests (92 ms)
[ RUN      ] serial.view_copy_tests_rank_0
[       OK ] serial.view_copy_tests_rank_0 (0 ms)
[ RUN      ] serial.view_copy_degenerated
[       OK ] serial.view_copy_degenerated (1 ms)
[ RUN      ] serial.view_mapping
39: [==========] Running 37 tests from 1 test case.
39: [----------] Global test environment set-up.
39: [----------] 37 tests from default_exec
39: [ RUN      ] default_exec.gramschmidt
39: "GramSchmidt< double , HIP >" , 1024 , 0.0284108 , 2.7745e-05, 0.0288961
[       OK ] serial.view_mapping (468 ms)
[ RUN      ] serial.view_mapping_operator
[       OK ] serial.view_mapping_operator (44 ms)
[ RUN      ] serial.static_extent
[       OK ] serial.static_extent (0 ms)
[ RUN      ] serial.view_mapping_atomic
[       OK ] serial.view_mapping_atomic (7 ms)
[ RUN      ] serial.view_mapping_class_value
[       OK ] serial.view_mapping_class_value (0 ms)
[ RUN      ] serial.view_mapping_assignable
[       OK ] serial.view_mapping_assignable (0 ms)
[ RUN      ] serial.view_mapping_trivially_copyable
[       OK ] serial.view_mapping_trivially_copyable (0 ms)
[ RUN      ] serial.view_mapping_subview
[       OK ] serial.view_mapping_subview (10 ms)
[ RUN      ] serial.view_resize
[       OK ] serial.view_resize (118 ms)
[ RUN      ] serial.view_layoutstride_left_to_layoutleft_assignment
39: "GramSchmidt< double , HIP >" , 2048 , 0.0286451 , 1.39869e-05, 0.0287552
39: "GramSchmidt< double , HIP >" , 4096 , 0.0269684 , 6.58409e-06, 0.0277735
view_layoutstride_left_to_layoutleft_assignment: srand(1628153420)
[       OK ] serial.view_layoutstride_left_to_layoutleft_assignment (297 ms)
[ RUN      ] serial.view_layoutstride_right_to_layoutright_assignment
39: "GramSchmidt< double , HIP >" , 8192 , 0.0289795 , 3.53753e-06, 0.0309707
view_layoutstride_right_to_layoutright_assignment: srand(1628153420)
[       OK ] serial.view_layoutstride_right_to_layoutright_assignment (290 ms)
[ RUN      ] serial.view_irregular_layout
[       OK ] serial.view_irregular_layout (0 ms)
[ RUN      ] serial.view_nested_view
[       OK ] serial.view_nested_view (0 ms)
[ RUN      ] serial.view_subview_auto_1d_left
[       OK ] serial.view_subview_auto_1d_left (1 ms)
[ RUN      ] serial.view_subview_auto_1d_right
[       OK ] serial.view_subview_auto_1d_right (0 ms)
[ RUN      ] serial.view_subview_auto_1d_stride
[       OK ] serial.view_subview_auto_1d_stride (0 ms)
[ RUN      ] serial.view_subview_assign_strided
[       OK ] serial.view_subview_assign_strided (0 ms)
[ RUN      ] serial.view_subview_left_0
[       OK ] serial.view_subview_left_0 (1 ms)
[ RUN      ] serial.view_subview_left_1
[       OK ] serial.view_subview_left_1 (0 ms)
[ RUN      ] serial.view_subview_left_2
[       OK ] serial.view_subview_left_2 (1 ms)
[ RUN      ] serial.view_subview_left_3
[       OK ] serial.view_subview_left_3 (0 ms)
[ RUN      ] serial.view_subview_right_0
[       OK ] serial.view_subview_right_0 (0 ms)
[ RUN      ] serial.view_subview_right_1
[       OK ] serial.view_subview_right_1 (1 ms)
[ RUN      ] serial.view_subview_right_3
[       OK ] serial.view_subview_right_3 (0 ms)
[ RUN      ] serial.view_static_tests
[       OK ] serial.view_static_tests (0 ms)
[ RUN      ] serial.view_subview_layoutleft_to_layoutleft
[       OK ] serial.view_subview_layoutleft_to_layoutleft (2 ms)
[ RUN      ] serial.view_subview_layoutright_to_layoutright
[       OK ] serial.view_subview_layoutright_to_layoutright (1 ms)
[ RUN      ] serial.view_subview_1d_assign
[       OK ] serial.view_subview_1d_assign (1 ms)
[ RUN      ] serial.view_subview_1d_assign_atomic
[       OK ] serial.view_subview_1d_assign_atomic (0 ms)
[ RUN      ] serial.view_subview_1d_assign_randomaccess
[       OK ] serial.view_subview_1d_assign_randomaccess (1 ms)
[ RUN      ] serial.view_subview_2d_from_3d
[ 26%] Building CXX object core/unit_test/CMakeFiles/KokkosCore_UnitTest_SYCL1A.dir/sycl/TestSYCL_DeepCopyAlignment.cpp.o
[ 26%] Building CXX object core/unit_test/CMakeFiles/KokkosCore_UnitTest_Default.dir/default/TestDefaultDeviceType_b1.cpp.o
[ 26%] Building CXX object core/unit_test/CMakeFiles/KokkosCore_UnitTest_SYCL2C.dir/sycl/TestSYCL_SubView_c09.cpp.o
39: "GramSchmidt< double , HIP >" , 16384 , 0.0298171 , 1.81989e-06, 0.0326327
39: "GramSchmidt< double , HIP >" , 32768 , 0.0295649 , 9.0225e-07, 0.031577
[       OK ] serial.view_subview_2d_from_3d (112 ms)
[ RUN      ] serial.view_subview_2d_from_3d_atomic
[       OK ] serial.view_subview_2d_from_3d_atomic (112 ms)
[ RUN      ] serial.view_subview_2d_from_3d_randomaccess
39: "GramSchmidt< double , HIP >" , 65536 , 0.0380808 , 5.81067e-07, 0.0388759
[       OK ] serial.view_subview_2d_from_3d_randomaccess (112 ms)
[ RUN      ] serial.view_subview_3d_from_5d_left
[ 33%] Building CXX object core/unit_test/CMakeFiles/KokkosCore_IncrementalTest_CUDA.dir/generated/Test11b_ParallelFor_TeamVectorRange_CUDA.cpp.o
54: Pass: 1 1 -3.46207e-05 5.45891e-05 1.8318e-05 || 0.000139188
54:  -- Testing 1-D histogram
54: Density 1D: 6.43252e-07 0.00713955 -0.0101484 || 0.051031 27973 29368 || 28471.1 28674.4 || -140.292 -2.0744
54:  -- Testing 3-D histogram
54: Density 3D: 6.43252e-07 0.0109259 -0.0137317 || 0.051031 1e+64 -1e+64
54: Test Scalar=unsigned int
54:  -- Testing randomness properties
39: "GramSchmidt< double , HIP >" , 131072 , 0.111001 , 8.46871e-07, 0.113975
39: "GramSchmidt< double , HIP >" , 262144 , 0.168661 , 6.43392e-07, 0.173545
[ 33%] Building CXX object core/unit_test/CMakeFiles/KokkosCore_UnitTest_Serial1.dir/serial/TestSerial_MathematicalFunctions.cpp.o
[ 33%] Building CXX object core/unit_test/CMakeFiles/KokkosCore_UnitTest_Cuda2.dir/cuda/TestCuda_TeamVectorRange.cpp.o
[ 33%] Building CXX object core/unit_test/CMakeFiles/KokkosCore_UnitTest_Cuda3.dir/cuda/TestCuda_Spaces.cpp.o
[ 33%] Building CXX object core/unit_test/CMakeFiles/KokkosCore_UnitTest_Serial2.dir/serial/TestSerial_WorkGraph.cpp.o
[       OK ] cuda_DeathTest.view_layoutstride_left_to_layoutright_assignment (5196 ms)
[----------] 3 tests from cuda_DeathTest (15470 ms total)

[----------] 140 tests from cuda
[ RUN      ] cuda.init
[       OK ] cuda.init (0 ms)
[ RUN      ] cuda.dispatch
[       OK ] cuda.dispatch (112 ms)
[ RUN      ] cuda.compiler_macros
[       OK ] cuda.compiler_macros (1 ms)
[ RUN      ] cuda.policy_construction
[       OK ] cuda.policy_construction (0 ms)
[ RUN      ] cuda.policy_converting_constructor_from_other_policy
[       OK ] cuda.policy_converting_constructor_from_other_policy (0 ms)
[ RUN      ] cuda.desired_occupancy_prefer
[       OK ] cuda.desired_occupancy_prefer (0 ms)
[ RUN      ] cuda.desired_occupancy_empty_base_optimization
[       OK ] cuda.desired_occupancy_empty_base_optimization (0 ms)
[ RUN      ] cuda.desired_occupancy_converting_constructors
[       OK ] cuda.desired_occupancy_converting_constructors (0 ms)
[ RUN      ] cuda.md_range_policy_construction_from_arrays
[       OK ] cuda.md_range_policy_construction_from_arrays (0 ms)
[ RUN      ] cuda.policy_set_worktag
[       OK ] cuda.policy_set_worktag (0 ms)
[ RUN      ] cuda.impl_shared_alloc
[       OK ] cuda.impl_shared_alloc (125 ms)
[ RUN      ] cuda.range_for
[       OK ] cuda.range_for (3 ms)
[ RUN      ] cuda.range_reduce
[       OK ] cuda.range_reduce (1 ms)
[ RUN      ] cuda.range_scan
[       OK ] cuda.range_scan (2 ms)
[ RUN      ] cuda.range_for_require
[       OK ] cuda.range_for_require (2 ms)
[ RUN      ] cuda.range_reduce_require
[       OK ] cuda.range_reduce_require (1 ms)
[ RUN      ] cuda.range_scan_require
[       OK ] cuda.range_scan_require (1 ms)
[ RUN      ] cuda.view_api_a
[       OK ] cuda.view_api_a (54 ms)
[ RUN      ] cuda.view_api_b
[       OK ] cuda.view_api_b (7 ms)
[ RUN      ] cuda.view_api_c
[       OK ] cuda.view_api_c (1 ms)
[ RUN      ] cuda.view_api_d
[       OK ] cuda.view_api_d (8 ms)
[ RUN      ] cuda.view_allocation_error
[       OK ] cuda.view_allocation_error (0 ms)
[ RUN      ] cuda.view_remap
[       OK ] cuda.view_remap (1 ms)
[ RUN      ] cuda.view_mirror_nonconst
[       OK ] cuda.view_mirror_nonconst (0 ms)
[ RUN      ] cuda.view_stride_method
[       OK ] cuda.view_stride_method (2 ms)
[ RUN      ] cuda.anonymous_space
[       OK ] cuda.anonymous_space (1 ms)
[ RUN      ] cuda.view_overload_resolution
[       OK ] cuda.view_overload_resolution (0 ms)
[ RUN      ] cuda.view_is_assignable
[       OK ] cuda.view_is_assignable (1 ms)
[ RUN      ] cuda.view_copy_tests
[       OK ] cuda.view_copy_tests (47 ms)
[ RUN      ] cuda.view_copy_tests_rank_0
[       OK ] cuda.view_copy_tests_rank_0 (2 ms)
[ RUN      ] cuda.view_copy_degenerated
[       OK ] cuda.view_copy_degenerated (0 ms)
[ RUN      ] cuda.deep_copy_alignment
[       OK ] cuda.deep_copy_alignment (34 ms)
[ RUN      ] cuda.deep_copy_conversion
[       OK ] serial.view_subview_3d_from_5d_left (3641 ms)
[ RUN      ] serial.view_subview_3d_from_5d_left_atomic
39: "GramSchmidt< double , HIP >" , 524288 , 0.308622 , 5.88649e-07, 0.311235
39: [       OK ] default_exec.gramschmidt (4887 ms)
39: [ RUN      ] default_exec.hexgrad
39: "HexGrad< double , HIP >" , 1024 , 5.3911e-05 , 5.26475e-080.000130709
39: "HexGrad< double , HIP >" , 2048 , 5.262e-05 , 2.56934e-085.29404e-05
39: "HexGrad< double , HIP >" , 4096 , 5.308e-05 , 1.2959e-085.36384e-05
39: "HexGrad< double , HIP >" , 8192 , 5.5381e-05 , 6.76038e-095.59646e-05
39: "HexGrad< double , HIP >" , 16384 , 6.325e-05 , 3.86047e-096.46984e-05
39: "HexGrad< double , HIP >" , 32768 , 7.997e-05 , 2.44049e-098.06268e-05
39: "HexGrad< double , HIP >" , 65536 , 0.000118212 , 1.80377e-090.000119353
39: "HexGrad< double , HIP >" , 131072 , 0.000170812 , 1.30319e-090.000172038
39: "HexGrad< double , HIP >" , 262144 , 0.000319503 , 1.21881e-090.000321853
39: "HexGrad< double , HIP >" , 524288 , 0.000586706 , 1.11905e-090.000588333
39: [       OK ] default_exec.hexgrad (84 ms)
39: [ RUN      ] default_exec.custom_reduction
39: 6.232657e-03 1.195410e+02 1.150000e+01
39: [       OK ] default_exec.custom_reduction (22 ms)
39: [ RUN      ] default_exec.overlap_range_policy
[       OK ] cuda.deep_copy_conversion (427 ms)
[ RUN      ] cuda.view_mapping
39: Time RangePolicy: NonOverlap: 0.082183 Time Overlap: 0.081876
39: Time RangePolicy Reduce: NonOverlap: 0.078662 Time Overlap: 0.078784
39: [       OK ] default_exec.overlap_range_policy (607 ms)
39: [ RUN      ] default_exec.overlap_mdrange_policy
[       OK ] cuda.view_mapping (478 ms)
[ RUN      ] cuda.view_mapping_operator
[       OK ] cuda.view_mapping_operator (15 ms)
[ RUN      ] cuda.static_extent
[       OK ] cuda.static_extent (0 ms)
[ RUN      ] cuda.view_mapping_atomic
[       OK ] cuda.view_mapping_atomic (3 ms)
[ RUN      ] cuda.view_mapping_class_value
[       OK ] cuda.view_mapping_class_value (0 ms)
[ RUN      ] cuda.view_mapping_assignable
[       OK ] cuda.view_mapping_assignable (0 ms)
[ RUN      ] cuda.view_mapping_trivially_copyable
[       OK ] cuda.view_mapping_trivially_copyable (0 ms)
[ RUN      ] cuda.view_mapping_subview
[       OK ] cuda.view_mapping_subview (2 ms)
[ RUN      ] cuda.view_resize
[       OK ] cuda.view_resize (104 ms)
[ RUN      ] cuda.view_layoutstride_left_to_layoutleft_assignment
view_layoutstride_left_to_layoutleft_assignment: srand(1628153425)
39: Time MDRangePolicy: NonOverlap: 0.008022 Time Overlap: 0.008029
39: Time MDRangePolicy Reduce: NonOverlap: 0.007799 Time Overlap: 0.007809
39: [       OK ] default_exec.overlap_mdrange_policy (66 ms)
39: [ RUN      ] default_exec.overlap_team_policy
39: Time TeamPolicy: NonOverlap: 0.018887 Time Overlap: 0.018885
39: Time TeamPolicy Reduce: NonOverlap: 0.008355 Time Overlap: 0.008354
39: [       OK ] default_exec.overlap_team_policy (112 ms)
39: [ RUN      ] default_exec.ViewDeepCopy_LeftLeft_Rank123
39: DeepCopy Performance for LayoutLeft to LayoutLeft:
39:    Raw:   0.003929 s   762.939453 MB   379.257436 GB/s
39:    Rank1: 0.002768 s   762.939453 MB   538.392182 GB/s
39:    Rank2: 0.003088 s   762.939453 MB   482.550713 GB/s
39:    Rank3: 0.003042 s   762.939453 MB   489.920304 GB/s
39: [       OK ] default_exec.ViewDeepCopy_LeftLeft_Rank123 (204 ms)
39: [ RUN      ] default_exec.ViewDeepCopy_RightRight_Rank123
[       OK ] cuda.view_layoutstride_left_to_layoutleft_assignment (370 ms)
[ RUN      ] cuda.view_layoutstride_right_to_layoutright_assignment
view_layoutstride_right_to_layoutright_assignment: srand(1628153426)
39: DeepCopy Performance for LayoutRight to LayoutRight:
39:    Raw:   0.004004 s   762.939453 MB   372.178531 GB/s
39:    Rank1: 0.003080 s   762.939453 MB   483.827655 GB/s
39:    Rank2: 0.003036 s   762.939453 MB   490.748019 GB/s
39:    Rank3: 0.003087 s   762.939453 MB   482.667941 GB/s
39: [       OK ] default_exec.ViewDeepCopy_RightRight_Rank123 (258 ms)
39: [ RUN      ] default_exec.ViewDeepCopy_LeftRight_Rank123
[       OK ] cuda.view_layoutstride_right_to_layoutright_assignment (360 ms)
[ RUN      ] cuda.view_irregular_layout
[       OK ] cuda.view_irregular_layout (1 ms)
[ RUN      ] cuda.view_nested_view
[       OK ] cuda.view_nested_view (1 ms)
[ RUN      ] cuda.int64_t_reduce
[       OK ] cuda.int64_t_reduce (22 ms)
[ RUN      ] cuda.double_reduce
[       OK ] cuda.double_reduce (22 ms)
[ RUN      ] cuda.int64_t_reduce_dynamic
[       OK ] cuda.int64_t_reduce_dynamic (27 ms)
[ RUN      ] cuda.double_reduce_dynamic
[       OK ] cuda.double_reduce_dynamic (25 ms)
[ RUN      ] cuda.int64_t_reduce_dynamic_view
[       OK ] cuda.int64_t_reduce_dynamic_view (10 ms)
[ RUN      ] cuda.int_combined_reduce
[       OK ] cuda.int_combined_reduce (0 ms)
[ RUN      ] cuda.mdrange_combined_reduce
[       OK ] cuda.mdrange_combined_reduce (1 ms)
[ RUN      ] cuda.int_combined_reduce_mixed
[       OK ] cuda.int_combined_reduce_mixed (0 ms)
[ RUN      ] cuda.reduction_deduction
[       OK ] cuda.reduction_deduction (0 ms)
[ RUN      ] cuda.scan
39: DeepCopy Performance for LayoutLeft to LayoutRight:
39:    Raw:   0.002002 s   762.939453 MB   744.381045 GB/s
39:    Rank1: 0.003042 s   762.939453 MB   489.780208 GB/s
39:    Rank2: 0.007727 s   762.939453 MB   192.844315 GB/s
39:    Rank3: 0.007006 s   762.939453 MB   212.696464 GB/s
39: [       OK ] default_exec.ViewDeepCopy_LeftRight_Rank123 (265 ms)
39: [ RUN      ] default_exec.ViewDeepCopy_RightLeft_Rank123
[       OK ] cuda.scan (188 ms)
[ RUN      ] cuda.reduce_device_view_range_policy
[       OK ] cuda.reduce_device_view_range_policy (6 ms)
[ RUN      ] cuda.reduce_device_view_mdrange_policy
39: DeepCopy Performance for LayoutRight to LayoutLeft:
39:    Raw:   0.001996 s   762.939453 MB   746.705292 GB/s
39:    Rank1: 0.003041 s   762.939453 MB   490.004077 GB/s
39:    Rank2: 0.006324 s   762.939453 MB   235.622103 GB/s
39:    Rank3: 0.006969 s   762.939453 MB   213.834306 GB/s
39: [       OK ] default_exec.ViewDeepCopy_RightLeft_Rank123 (264 ms)
39: [ RUN      ] default_exec.ViewDeepCopy_LeftLeft_Rank45
[ 33%] Building CXX object core/unit_test/CMakeFiles/KokkosCore_UnitTest_Cuda1.dir/cuda/TestCuda_MDRange_b.cpp.o
[       OK ] cuda.reduce_device_view_mdrange_policy (239 ms)
[ RUN      ] cuda.reduce_device_view_team_policy
[       OK ] cuda.reduce_device_view_team_policy (6 ms)
[ RUN      ] cuda.reducers_int
[       OK ] cuda.reducers_int (7 ms)
[ RUN      ] cuda.reducers_size_t
[       OK ] cuda.reducers_size_t (8 ms)
[ RUN      ] cuda.reducers_double
[       OK ] cuda.reducers_double (6 ms)
[ RUN      ] cuda.reducers_complex_double
[       OK ] cuda.reducers_complex_double (4 ms)
[ RUN      ] cuda.reducers_struct
[       OK ] cuda.reducers_struct (5 ms)
[ RUN      ] cuda.complex_construction
[       OK ] cuda.complex_construction (0 ms)
[ RUN      ] cuda.complex_basic_math
[       OK ] cuda.complex_basic_math (1 ms)
[ RUN      ] cuda.complex_special_funtions
[       OK ] cuda.complex_special_funtions (0 ms)
[ RUN      ] cuda.complex_io
[       OK ] cuda.complex_io (0 ms)
[ RUN      ] cuda.complex_trivially_copyable
[       OK ] cuda.complex_trivially_copyable (0 ms)
[ RUN      ] cuda.complex_issue_3865
[       OK ] cuda.complex_issue_3865 (1 ms)
[ RUN      ] cuda.complex_issue_3867
[       OK ] cuda.complex_issue_3867 (0 ms)
[ RUN      ] cuda.complex_operations_arithmetic_types_overloads
[       OK ] cuda.complex_operations_arithmetic_types_overloads (0 ms)
[ RUN      ] cuda.atomic_operations_int
[       OK ] cuda.atomic_operations_int (23 ms)
[ RUN      ] cuda.atomic_operations_unsigned
[       OK ] cuda.atomic_operations_unsigned (21 ms)
[ RUN      ] cuda.atomic_operations_long
[       OK ] cuda.atomic_operations_long (21 ms)
[ RUN      ] cuda.atomic_operations_unsignedlong
[       OK ] cuda.atomic_operations_unsignedlong (20 ms)
[ RUN      ] cuda.atomic_operations_longlong
39: DeepCopy Performance for LayoutLeft to LayoutLeft:
39:    Raw:   0.003632 s   762.939453 MB   410.307701 GB/s
39:    Rank4: 0.003084 s   762.939453 MB   483.167190 GB/s
39:    Rank5: 0.003046 s   762.939453 MB   489.151569 GB/s
39: [       OK ] default_exec.ViewDeepCopy_LeftLeft_Rank45 (194 ms)
39: [ RUN      ] default_exec.ViewDeepCopy_RightRight_Rank45
39: DeepCopy Performance for LayoutRight to LayoutRight:
39:    Raw:   0.003736 s   762.939453 MB   398.840007 GB/s
39:    Rank4: 0.003038 s   762.939453 MB   490.557381 GB/s
39:    Rank5: 0.003082 s   762.939453 MB   483.563880 GB/s
39: [       OK ] default_exec.ViewDeepCopy_RightRight_Rank45 (194 ms)
39: [ RUN      ] default_exec.ViewDeepCopy_LeftRight_Rank45
54: Pass: 1 1 -2.71853e-05 4.71974e-06 -0.000105451 || 0.000139188
54:  -- Testing 1-D histogram
54: Density 1D: 6.45775e-07 -0.0110052 -0.0138761 || 0.051031 27974 29309 || 28993.5 28674.4 || -191.823 -2.0744
54:  -- Testing 3-D histogram
54: Density 3D: 6.5082e-07 0.00966907 -0.0117139 || 0.051031 1e+64 -1e+64
54: Test Scalar=int64_t
54:  -- Testing randomness properties
[       OK ] cuda.atomic_operations_longlong (21 ms)
[ RUN      ] cuda.atomic_operations_double
[       OK ] cuda.atomic_operations_double (9 ms)
[ RUN      ] cuda.atomic_operations_float
[       OK ] cuda.atomic_operations_float (9 ms)
[ RUN      ] cuda.atomic_operations_complexfloat
[       OK ] cuda.atomic_operations_complexfloat (4 ms)
[ RUN      ] cuda.atomic_operations_complexdouble
[       OK ] cuda.atomic_operations_complexdouble (5 ms)
[ RUN      ] cuda.atomic_views_integral
39: DeepCopy Performance for LayoutLeft to LayoutRight:
39:    Raw:   0.002058 s   762.939453 MB   724.095847 GB/s
39:    Rank4: 0.020278 s   762.939453 MB   73.483079 GB/s
39:    Rank5: 0.018618 s   762.939453 MB   80.036178 GB/s
39: [       OK ] default_exec.ViewDeepCopy_LeftRight_Rank45 (224 ms)
39: [ RUN      ] default_exec.ViewDeepCopy_RightLeft_Rank45
39: DeepCopy Performance for LayoutRight to LayoutLeft:
39:    Raw:   0.002078 s   762.939453 MB   716.950034 GB/s
39:    Rank4: 0.011651 s   762.939453 MB   127.892384 GB/s
39:    Rank5: 0.018723 s   762.939453 MB   79.588388 GB/s
39: [       OK ] default_exec.ViewDeepCopy_RightLeft_Rank45 (218 ms)
39: [ RUN      ] default_exec.ViewDeepCopy_LeftLeft_Rank6
39: DeepCopy Performance for LayoutLeft to LayoutLeft:
39:    Raw:   0.003215 s   762.939453 MB   463.490126 GB/s
39:    Rank6: 0.003036 s   762.939453 MB   490.749636 GB/s
39: [       OK ] default_exec.ViewDeepCopy_LeftLeft_Rank6 (129 ms)
39: [ RUN      ] default_exec.ViewDeepCopy_RightRight_Rank6
39: DeepCopy Performance for LayoutRight to LayoutRight:
39:    Raw:   0.003411 s   762.939453 MB   436.873892 GB/s
39:    Rank6: 0.003079 s   762.939453 MB   484.033536 GB/s
39: [       OK ] default_exec.ViewDeepCopy_RightRight_Rank6 (132 ms)
39: [ RUN      ] default_exec.ViewDeepCopy_LeftRight_Rank6
39: DeepCopy Performance for LayoutLeft to LayoutRight:
39:    Raw:   0.002130 s   762.939453 MB   699.565327 GB/s
39:    Rank6: 0.020550 s   762.939453 MB   72.513074 GB/s
39: [       OK ] default_exec.ViewDeepCopy_LeftRight_Rank6 (145 ms)
39: [ RUN      ] default_exec.ViewDeepCopy_RightLeft_Rank6
39: DeepCopy Performance for LayoutRight to LayoutLeft:
39:    Raw:   0.002039 s   762.939453 MB   730.851046 GB/s
39:    Rank6: 0.023945 s   762.939453 MB   62.229768 GB/s
39: [       OK ] default_exec.ViewDeepCopy_RightLeft_Rank6 (150 ms)
39: [ RUN      ] default_exec.ViewDeepCopy_LeftLeft_Rank7
39: DeepCopy Performance for LayoutLeft to LayoutLeft:
39:    Raw:   0.003286 s   762.939453 MB   453.515435 GB/s
39:    Rank7: 0.003159 s   762.939453 MB   471.661709 GB/s
39: [       OK ] default_exec.ViewDeepCopy_LeftLeft_Rank7 (129 ms)
39: [ RUN      ] default_exec.ViewDeepCopy_RightRight_Rank7
39: DeepCopy Performance for LayoutRight to LayoutRight:
39:    Raw:   0.003432 s   762.939453 MB   434.241094 GB/s
39:    Rank7: 0.003089 s   762.939453 MB   482.399338 GB/s
39: [       OK ] default_exec.ViewDeepCopy_RightRight_Rank7 (129 ms)
39: [ RUN      ] default_exec.ViewDeepCopy_LeftRight_Rank7
39: DeepCopy Performance for LayoutLeft to LayoutRight:
39:    Raw:   0.001993 s   762.939453 MB   747.799493 GB/s
39:    Rank7: 0.017669 s   762.939453 MB   84.335515 GB/s
39: [       OK ] default_exec.ViewDeepCopy_LeftRight_Rank7 (141 ms)
39: [ RUN      ] default_exec.ViewDeepCopy_RightLeft_Rank7
39: DeepCopy Performance for LayoutRight to LayoutLeft:
39:    Raw:   0.002103 s   762.939453 MB   708.671330 GB/s
39:    Rank7: 0.020089 s   762.939453 MB   74.174118 GB/s
39: [       OK ] default_exec.ViewDeepCopy_RightLeft_Rank7 (146 ms)
39: [ RUN      ] default_exec.ViewDeepCopy_LeftLeft_Rank8
[       OK ] serial.view_subview_3d_from_5d_left_atomic (3651 ms)
[ RUN      ] serial.view_subview_3d_from_5d_left_randomaccess
39: DeepCopy Performance for LayoutLeft to LayoutLeft:
39:    Raw:   0.003526 s   762.939453 MB   422.649802 GB/s
39:    Rank8: 0.003043 s   762.939453 MB   489.660948 GB/s
39: [       OK ] default_exec.ViewDeepCopy_LeftLeft_Rank8 (129 ms)
39: [ RUN      ] default_exec.ViewDeepCopy_RightRight_Rank8
39: DeepCopy Performance for LayoutRight to LayoutRight:
39:    Raw:   0.003261 s   762.939453 MB   456.943659 GB/s
39:    Rank8: 0.003081 s   762.939453 MB   483.647064 GB/s
39: [       OK ] default_exec.ViewDeepCopy_RightRight_Rank8 (130 ms)
39: [ RUN      ] default_exec.ViewDeepCopy_LeftRight_Rank8
39: DeepCopy Performance for LayoutLeft to LayoutRight:
39:    Raw:   0.002041 s   762.939453 MB   730.252554 GB/s
39:    Rank8: 0.018834 s   762.939453 MB   79.117342 GB/s
39: [       OK ] default_exec.ViewDeepCopy_LeftRight_Rank8 (143 ms)
39: [ RUN      ] default_exec.ViewDeepCopy_RightLeft_Rank8
39: DeepCopy Performance for LayoutRight to LayoutLeft:
39:    Raw:   0.002083 s   762.939453 MB   715.332764 GB/s
39:    Rank8: 0.019839 s   762.939453 MB   75.111456 GB/s
39: [       OK ] default_exec.ViewDeepCopy_RightLeft_Rank8 (144 ms)
39: [ RUN      ] default_exec.ViewCreate
[ 33%] Building CXX object core/unit_test/CMakeFiles/KokkosCore_IncrementalTest_CUDA.dir/generated/Test11c_ParallelFor_ThreadVectorRange_CUDA.cpp.o
39: Create View Performance for LayoutLeft:
39:    Raw:   0.029591 s   762.939453 MB   25.178516 GB/s
39:    Rank1: 0.059473 s   762.939453 MB   12.527673 GB/s
39:    Rank2: 0.029583 s   762.939453 MB   25.185589 GB/s
39:    Rank3: 0.029435 s   762.939453 MB   25.311959 GB/s
39:    Rank4: 0.029431 s   762.939453 MB   25.315760 GB/s
39:    Rank5: 0.029435 s   762.939453 MB   25.311812 GB/s
39:    Rank6: 0.029422 s   762.939453 MB   25.323358 GB/s
39:    Rank7: 0.029585 s   762.939453 MB   25.183367 GB/s
39:    Rank8: 0.029423 s   762.939453 MB   25.321964 GB/s
39: Create View Performance for LayoutRight:
39:    Raw:   0.029426 s   762.939453 MB   25.319313 GB/s
39:    Rank1: 0.029421 s   762.939453 MB   25.324262 GB/s
39:    Rank2: 0.029604 s   762.939453 MB   25.167416 GB/s
39:    Rank3: 0.029430 s   762.939453 MB   25.316388 GB/s
39:    Rank4: 0.029437 s   762.939453 MB   25.310308 GB/s
39:    Rank5: 0.029428 s   762.939453 MB   25.318272 GB/s
39:    Rank6: 0.029580 s   762.939453 MB   25.187632 GB/s
39:    Rank7: 0.029433 s   762.939453 MB   25.314005 GB/s
39:    Rank8: 0.029576 s   762.939453 MB   25.191039 GB/s
39: [       OK ] default_exec.ViewCreate (561 ms)
39: [ RUN      ] default_exec.ViewFill_Rank123
39: ViewFill Performance for LayoutLeft:
39:    Raw:   0.001629 s   762.939453 MB   457.389681 GB/s
39:    Rank1: 0.005070 s   762.939453 MB   146.967384 GB/s
39:    Rank2: 0.001617 s   762.939453 MB   460.818374 GB/s
39:    Rank3: 0.001619 s   762.939453 MB   460.198160 GB/s
39: ViewFill Performance for LayoutRight:
39:    Raw:   0.001614 s   762.939453 MB   461.732235 GB/s
39:    Rank1: 0.001625 s   762.939453 MB   458.535361 GB/s
39:    Rank2: 0.001642 s   762.939453 MB   453.668835 GB/s
39:    Rank3: 0.001642 s   762.939453 MB   453.859521 GB/s
39: [       OK ] default_exec.ViewFill_Rank123 (246 ms)
39: [ RUN      ] default_exec.ViewFill_Rank45
39: ViewFill Performance for LayoutLeft:
39:    Raw:   0.005001 s   762.939453 MB   148.986106 GB/s
39:    Rank4: 0.001613 s   762.939453 MB   461.901123 GB/s
39:    Rank5: 0.001617 s   762.939453 MB   460.784175 GB/s
39: ViewFill Performance for LayoutRight:
39:    Raw:   0.001638 s   762.939453 MB   454.782048 GB/s
39:    Rank4: 0.001623 s   762.939453 MB   459.171190 GB/s
39:    Rank5: 0.001630 s   762.939453 MB   457.142718 GB/s
39: [       OK ] default_exec.ViewFill_Rank45 (184 ms)
39: [ RUN      ] default_exec.ViewFill_Rank6
39: ViewFill Performance for LayoutLeft:
39:    Raw:   0.003487 s   762.939453 MB   213.640824 GB/s
39:    Rank6: 0.001647 s   762.939453 MB   452.256133 GB/s
39: ViewFill Performance for LayoutRight:
39:    Raw:   0.001614 s   762.939453 MB   461.486279 GB/s
39:    Rank6: 0.001620 s   762.939453 MB   459.950712 GB/s
39: [       OK ] default_exec.ViewFill_Rank6 (123 ms)
39: [ RUN      ] default_exec.ViewFill_Rank7
39: ViewFill Performance for LayoutLeft:
39:    Raw:   0.003647 s   762.939453 MB   204.276380 GB/s
39:    Rank7: 0.001631 s   762.939453 MB   456.848396 GB/s
39: ViewFill Performance for LayoutRight:
39:    Raw:   0.001616 s   762.939453 MB   461.154939 GB/s
39:    Rank7: 0.001646 s   762.939453 MB   452.783832 GB/s
39: [       OK ] default_exec.ViewFill_Rank7 (123 ms)
39: [ RUN      ] default_exec.ViewFill_Rank8
39: ViewFill Performance for LayoutLeft:
39:    Raw:   0.003868 s   762.939453 MB   192.612244 GB/s
39:    Rank8: 0.001618 s   762.939453 MB   460.621797 GB/s
39: ViewFill Performance for LayoutRight:
39:    Raw:   0.001617 s   762.939453 MB   460.907031 GB/s
39:    Rank8: 0.001669 s   762.939453 MB   446.437681 GB/s
39: [       OK ] default_exec.ViewFill_Rank8 (123 ms)
39: [ RUN      ] default_exec.ViewResize_Rank123
39: Resize View Performance for LayoutLeft:
39:    Raw:   0.002676 s   762.939453 MB   556.756165 GB/s
39:    Rank1: 0.007297 s   762.939453 MB   204.196601 GB/s
39:    Rank2: 0.006054 s   762.939453 MB   246.148590 GB/s
39:    Rank3: 0.009016 s   762.939453 MB   165.267781 GB/s
39:    Rank1 (WithoutInitializing): 0.002601 s   762.939453 MB   572.922384 GB/s
39:    Rank2 (WithoutInitializing): 0.004372 s   762.939453 MB   340.817574 GB/s
39:    Rank3 (WithoutInitializing): 0.007313 s   762.939453 MB   203.757671 GB/s
39: Resize View Performance for LayoutRight:
39:    Raw:   0.002728 s   762.939453 MB   546.227246 GB/s
39:    Rank1: 0.003988 s   762.939453 MB   373.663378 GB/s
39:    Rank2: 0.006690 s   762.939453 MB   222.740765 GB/s
39:    Rank3: 0.010145 s   762.939453 MB   146.881044 GB/s
39:    Rank1 (WithoutInitializing): 0.002553 s   762.939453 MB   583.701397 GB/s
39:    Rank2 (WithoutInitializing): 0.005167 s   762.939453 MB   288.389459 GB/s
39:    Rank3 (WithoutInitializing): 0.008647 s   762.939453 MB   172.336296 GB/s
39: [       OK ] default_exec.ViewResize_Rank123 (925 ms)
39: [ RUN      ] default_exec.ViewResize_Rank_45
[ 33%] Building CXX object core/unit_test/CMakeFiles/KokkosCore_UnitTest_Serial2.dir/serial/TestSerial_SubView_a.cpp.o
[ 33%] Linking CXX executable KokkosCore_UnitTest_Cuda3
39: Resize View Performance for LayoutLeft:
39:    Raw:   0.002622 s   762.939453 MB   568.272905 GB/s
39:    Rank4: 0.012495 s   762.939453 MB   119.259140 GB/s
39:    Rank5: 0.014079 s   762.939453 MB   105.842785 GB/s
39:    Rank4 (WithoutInitializing): 0.008648 s   762.939453 MB   172.306802 GB/s
39:    Rank5 (WithoutInitializing): 0.012565 s   762.939453 MB   118.588399 GB/s
39: Resize View Performance for LayoutRight:
39:    Raw:   0.002657 s   762.939453 MB   560.736848 GB/s
39:    Rank4: 0.011331 s   762.939453 MB   131.511449 GB/s
39:    Rank5: 0.017675 s   762.939453 MB   84.307463 GB/s
39:    Rank4 (WithoutInitializing): 0.009887 s   762.939453 MB   150.710389 GB/s
39:    Rank5 (WithoutInitializing): 0.016197 s   762.939453 MB   91.998548 GB/s
39: [       OK ] default_exec.ViewResize_Rank_45 (740 ms)
39: [ RUN      ] default_exec.ViewResize_Rank6
39: Resize View Performance for LayoutLeft:
39:    Raw:   0.002630 s   762.939453 MB   566.522900 GB/s
39:    Rank6: 0.019239 s   762.939453 MB   77.451447 GB/s
39:    Rank6 (WithoutInitializing): 0.016186 s   762.939453 MB   92.064829 GB/s
39: Resize View Performance for LayoutRight:
39:    Raw:   0.002539 s   762.939453 MB   586.901813 GB/s
39:    Rank6: 0.018308 s   762.939453 MB   81.391000 GB/s
39:    Rank6 (WithoutInitializing): 0.016621 s   762.939453 MB   89.651946 GB/s
39: [       OK ] default_exec.ViewResize_Rank6 (455 ms)
39: [ RUN      ] default_exec.ViewResize_Rank7
[ 33%] Building CXX object core/unit_test/CMakeFiles/KokkosCore_UnitTest_Cuda2.dir/cuda/TestCuda_UniqueToken.cpp.o
[       OK ] serial.view_subview_3d_from_5d_left_randomaccess (3732 ms)
[ RUN      ] serial.view_subview_3d_from_5d_right
39: Resize View Performance for LayoutLeft:
39:    Raw:   0.002619 s   762.939453 MB   568.856474 GB/s
39:    Rank7: 0.008160 s   762.939453 MB   182.614597 GB/s
39:    Rank7 (WithoutInitializing): 0.005462 s   762.939453 MB   272.790586 GB/s
39: Resize View Performance for LayoutRight:
39:    Raw:   0.002609 s   762.939453 MB   571.165562 GB/s
39:    Rank7: 0.009754 s   762.939453 MB   152.766459 GB/s
39:    Rank7 (WithoutInitializing): 0.008347 s   762.939453 MB   178.521865 GB/s
39: [       OK ] default_exec.ViewResize_Rank7 (415 ms)
39: [ RUN      ] default_exec.ViewResize_Rank8
39: Resize View Performance for LayoutLeft:
39:    Raw:   0.002623 s   762.939453 MB   568.149403 GB/s
39:    Rank8: 0.008778 s   762.939453 MB   169.757101 GB/s
39:    Rank8 (WithoutInitializing): 0.005820 s   762.939453 MB   256.048524 GB/s
39: Resize View Performance for LayoutRight:
39:    Raw:   0.002657 s   762.939453 MB   560.789816 GB/s
39:    Rank8: 0.007533 s   762.939453 MB   197.799699 GB/s
39:    Rank8 (WithoutInitializing): 0.006040 s   762.939453 MB   246.720425 GB/s
39: [       OK ] default_exec.ViewResize_Rank8 (411 ms)
39: [----------] 37 tests from default_exec (13552 ms total)
39: 
39: [----------] Global test environment tear-down
39: [==========] 37 tests from 1 test case ran. (13552 ms total)
39: [  PASSED  ] 37 tests.
39/48 Test #39: KokkosCore_PerfTestExec ......................   Passed   14.07 sec
test 40
      Start 40: KokkosCore_PerformanceTest_Atomic

40: Test command: /var/jenkins/workspace/Kokkos/build/core/perf_test/KokkosCore_PerformanceTest_Atomic
40: Test timeout computed to be: 1500
54: Pass: 1 1 -4.81278e-05 1.18753e-05 8.07329e-05 || 0.000139188
54:  -- Testing 1-D histogram
54: Density 1D: 6.43252e-07 -0.0042775 -0.000116051 || 0.051031 28065 29328 || 28797.6 28674.4 || -1.60428 -2.0744
54:  -- Testing 3-D histogram
54: Density 3D: 6.43252e-07 -0.0148017 -0.00328346 || 0.051031 1e+64 -1e+64
54: Test Scalar=uint64_t
54:  -- Testing randomness properties
[ 33%] Built target KokkosCore_UnitTest_Cuda3
[ 33%] Building CXX object core/unit_test/CMakeFiles/KokkosCore_UnitTest_Serial2.dir/serial/TestSerial_SubView_b.cpp.o
Scanning dependencies of target KokkosCore_UnitTest_DefaultInit_4
[       OK ] serial.view_subview_3d_from_5d_right (4085 ms)
[ RUN      ] serial.view_subview_3d_from_5d_right_atomic
[ 33%] Building CXX object core/unit_test/CMakeFiles/KokkosCore_UnitTest_DefaultInit_4.dir/UnitTestMain.cpp.o
[ 34%] Building CXX object core/unit_test/CMakeFiles/KokkosCore_IncrementalTest_CUDA.dir/generated/Test12a_ThreadScratch_CUDA.cpp.o
[ 35%] Building CXX object core/unit_test/CMakeFiles/KokkosCore_UnitTest_DefaultInit_4.dir/default/TestDefaultDeviceTypeInit_4.cpp.o
Scanning dependencies of target KokkosCore_UnitTest_DefaultInit_5
[ 35%] Building CXX object core/unit_test/CMakeFiles/KokkosCore_UnitTest_DefaultInit_5.dir/UnitTestMain.cpp.o
[ 35%] Building CXX object core/unit_test/CMakeFiles/KokkosCore_UnitTest_DefaultInit_5.dir/default/TestDefaultDeviceTypeInit_5.cpp.o
54: Pass: 1 1 6.65422e-06 1.66638e-05 -1.16517e-05 || 0.000139188
54:  -- Testing 1-D histogram
54: Density 1D: 6.43252e-07 0.0291653 0.0030865 || 0.051031 28005 29335 || 27861.8 28674.4 || 42.6678 -2.0744
54:  -- Testing 3-D histogram
54: Density 3D: 6.43252e-07 0.00087242 0.00390957 || 0.051031 1e+64 -1e+64
54: Test Scalar=half
54:  -- Testing randomness properties
[       OK ] serial.view_subview_3d_from_5d_right_atomic (4071 ms)
[ RUN      ] serial.view_subview_3d_from_5d_right_randomaccess
[ 35%] Building CXX object core/unit_test/CMakeFiles/KokkosCore_UnitTest_Cuda1.dir/cuda/TestCuda_MDRange_c.cpp.o
[ 35%] Building CXX object core/unit_test/CMakeFiles/KokkosCore_UnitTest_Cuda2.dir/cuda/TestCuda_ViewAPI_a.cpp.o
[ 35%] Linking CXX executable KokkosCore_UnitTest_DefaultInit_4
[ 35%] Built target KokkosCore_UnitTest_DefaultInit_4
[ 35%] Building CXX object core/unit_test/CMakeFiles/KokkosCore_UnitTest_Serial2.dir/serial/TestSerial_SubView_c01.cpp.o
[ 35%] Linking CXX executable KokkosCore_UnitTest_DefaultInit_5
[ 35%] Building CXX object core/unit_test/CMakeFiles/KokkosCore_IncrementalTest_CUDA.dir/generated/Test12b_TeamScratch_CUDA.cpp.o
[ 35%] Built target KokkosCore_UnitTest_DefaultInit_5
[ 35%] Building CXX object core/unit_test/CMakeFiles/KokkosCore_UnitTest_Serial2.dir/serial/TestSerial_SubView_c02.cpp.o
Scanning dependencies of target KokkosCore_UnitTest_DefaultInit_6
[ 35%] Building CXX object core/unit_test/CMakeFiles/KokkosCore_UnitTest_DefaultInit_6.dir/UnitTestMain.cpp.o
[ 36%] Building CXX object core/unit_test/CMakeFiles/KokkosCore_UnitTest_DefaultInit_6.dir/default/TestDefaultDeviceTypeInit_6.cpp.o
[       OK ] serial.view_subview_3d_from_5d_right_randomaccess (4043 ms)
[ RUN      ] serial.view_test_unmanaged_subview_reset
[       OK ] serial.view_test_unmanaged_subview_reset (0 ms)
[ RUN      ] serial.int64_t_reduce
[ 36%] Building CXX object core/unit_test/CMakeFiles/KokkosCore_UnitTest_Serial1.dir/serial/TestSerial_MDRange_a.cpp.o
[ 26%] Building CXX object core/unit_test/CMakeFiles/KokkosCore_UnitTest_SYCL1A.dir/sycl/TestSYCL_ExecutionSpace.cpp.o
[       OK ] serial.int64_t_reduce (4002 ms)
[ RUN      ] serial.double_reduce
[ 26%] Building CXX object core/unit_test/CMakeFiles/KokkosCore_UnitTest_Serial1.dir/serial/TestSerial_LocalDeepCopy.cpp.o
[ 36%] Linking CXX executable KokkosCore_UnitTest_DefaultInit_6
[ 36%] Building CXX object core/unit_test/CMakeFiles/KokkosCore_IncrementalTest_CUDA.dir/generated/Test13a_ParallelRed_TeamThreadRange_CUDA.cpp.o
[ 36%] Built target KokkosCore_UnitTest_DefaultInit_6
[ 37%] Building CXX object core/unit_test/CMakeFiles/KokkosCore_UnitTest_Serial2.dir/serial/TestSerial_SubView_c03.cpp.o
[ 37%] Building CXX object core/unit_test/CMakeFiles/KokkosCore_UnitTest_Cuda2.dir/cuda/TestCuda_ViewAPI_b.cpp.o
[ 37%] Building CXX object core/unit_test/CMakeFiles/KokkosCore_IncrementalTest_CUDA.dir/generated/Test13b_ParallelRed_TeamVectorRange_CUDA.cpp.o
[ 37%] Building CXX object core/unit_test/CMakeFiles/KokkosCore_UnitTest_Cuda1.dir/cuda/TestCuda_HostSharedPtr.cpp.o
[ 37%] Building CXX object core/unit_test/CMakeFiles/KokkosCore_UnitTest_Cuda1.dir/cuda/TestCuda_HostSharedPtrAccessOnDevice.cpp.o
[ 37%] Building CXX object core/unit_test/CMakeFiles/KokkosCore_IncrementalTest_CUDA.dir/generated/Test14_MDRangeReduce_CUDA.cpp.o
[ 37%] Building CXX object core/unit_test/CMakeFiles/KokkosCore_IncrementalTest_CUDA.dir/generated/Test13c_ParallelRed_ThreadVectorRange_CUDA.cpp.o
[       OK ] cuda.atomic_views_integral (24413 ms)
[ RUN      ] cuda.atomic_views_nonintegral
[       OK ] cuda.atomic_views_nonintegral (85 ms)
[ RUN      ] cuda.atomic_view_api
[       OK ] cuda.atomic_view_api (1 ms)
[ RUN      ] cuda.atomics
[       OK ] cuda.atomics (397 ms)
[ RUN      ] cuda.team_for
[       OK ] cuda.team_for (2 ms)
[ RUN      ] cuda.team_reduce
[       OK ] cuda.team_reduce (3 ms)
[ RUN      ] cuda.team_broadcast_long
[       OK ] cuda.team_broadcast_long (1 ms)
[ RUN      ] cuda.team_broadcast_char
[       OK ] cuda.team_broadcast_char (1 ms)
[ RUN      ] cuda.team_broadcast_float
[       OK ] cuda.team_broadcast_float (0 ms)
[ RUN      ] cuda.team_broadcast_double
[       OK ] cuda.team_broadcast_double (1 ms)
[ RUN      ] cuda.team_handle_by_value
[       OK ] cuda.team_handle_by_value (0 ms)
[ RUN      ] cuda.team_vector
[       OK ] cuda.team_vector (20 ms)
[ RUN      ] cuda.triple_nested_parallelism
[       OK ] cuda.triple_nested_parallelism (16 ms)
[ RUN      ] cuda.parallel_scan_with_reducers
[       OK ] serial.double_reduce (3888 ms)
[ RUN      ] serial.int64_t_reduce_dynamic
[       OK ] cuda.parallel_scan_with_reducers (588 ms)
[ RUN      ] cuda.team_shared_request
[       OK ] cuda.team_shared_request (0 ms)
[ RUN      ] cuda.team_scratch_request
[       OK ] cuda.team_scratch_request (1 ms)
[ RUN      ] cuda.team_lambda_shared_request
[       OK ] cuda.team_lambda_shared_request (1 ms)
[ RUN      ] cuda.scratch_align
[       OK ] cuda.scratch_align (0 ms)
[ RUN      ] cuda.shmem_size
[       OK ] cuda.shmem_size (0 ms)
[ RUN      ] cuda.multi_level_scratch
[       OK ] cuda.multi_level_scratch (15 ms)
[ RUN      ] cuda.team_reduction_scan
54: Pass: 1 1 4.83018e-05 4.72627e-05 -3.48856e-05 || 0.000139188
54:  -- Testing 1-D histogram
54: Density 1D: 0.000244786 -0.99999 -48244.1 || 0.051031 0 195041 || 2.92841e+09 28674.4 || -6.66926e+08 -2.0744
54:  -- Testing 3-D histogram
54: Density 3D: 0.000733239 -0.309483 0.151606 || 0.051031 1e+64 -1e+64
54: Test Scalar=float
54:  -- Testing randomness properties
[ 37%] Building CXX object core/unit_test/CMakeFiles/KokkosCore_UnitTest_Serial1.dir/serial/TestSerial_MDRange_b.cpp.o
[       OK ] cuda.team_reduction_scan (2213 ms)
[ RUN      ] cuda.team_long_reduce
[       OK ] cuda.team_long_reduce (27 ms)
[ RUN      ] cuda.team_double_reduce
[       OK ] cuda.team_double_reduce (26 ms)
[ RUN      ] cuda.team_policy_max_recommended
[       OK ] cuda.team_policy_max_recommended (333 ms)
[ RUN      ] cuda.team_policy_max_scalar_without_plus_equal_k
Max TeamSize: 1024 Recommended TeamSize: 64
Test 14 0
Test 14 1
Test 14 2
Test 14 3
Test 14 4
Test 14 5
Test 14 6
Test 14 7
Test 14 8
Test 14 9
Test 14 10
Test 14 11
Test 14 12
Test 14 13
Test 14 14
Test 14 15
Test 14 16
Test 14 17
Test 14 18
Test 14 19
Test 14 20
Test 14 21
Test 14 22
Test 14 23
Test 14 24
Test 14 25
Test 14 26
Test 14 27
Test 14 28
Test 14 29
Test 14 30
Test 14 31
Test 2 32
Test 2 33
Test 2 34
Test 2 35
Test 2 36
Test 2 37
Test 2 38
Test 2 39
Test 2 40
Test 2 41
Test 2 42
Test 2 43
Test 2 44
Test 2 45
Test 2 46
Test 2 47
Test 2 48
Test 2 49
Test 2 50
Test 2 51
Test 2 52
Test 2 53
Test 2 54
Test 2 55
Test 2 56
Test 2 57
Test 2 58
Test 2 59
Test 2 60
Test 2 61
Test 2 62
Test 2 63
Test 8 0
Test 8 1
Test 8 2
Test 8 3
Test 8 4
Test 8 5
Test 8 6
Test 8 7
Test 8 8
Test 8 9
Test 8 10
Test 8 11
Test 8 12
Test 8 13
Test 8 14
Test 8 15
Test 8 16
Test 8 17
Test 8 18
Test 8 19
Test 8 20
Test 8 21
Test 8 22
Test 8 23
Test 8 24
Test 8 25
Test 8 26
Test 8 27
Test 8 28
Test 8 29
Test 8 30
Test 8 31
Test 14 32
Test 14 33
Test 14 34
Test 14 35
Test 14 36
Test 14 37
Test 14 38
Test 14 39
Test 14 40
Test 14 41
Test 14 42
Test 14 43
Test 14 44
Test 14 45
Test 14 46
Test 14 47
Test 14 48
Test 14 49
Test 14 50
Test 14 51
Test 14 52
Test 14 53
Test 14 54
Test 14 55
Test 14 56
Test 14 57
Test 14 58
Test 14 59
Test 14 60
Test 14 61
Test 14 62
Test 14 63
Test 2 0
Test 2 1
Test 2 2
Test 2 3
Test 2 4
Test 2 5
Test 2 6
Test 2 7
Test 2 8
Test 2 9
Test 2 10
Test 2 11
Test 2 12
Test 2 13
Test 2 14
Test 2 15
Test 2 16
Test 2 17
Test 2 18
Test 2 19
Test 2 20
Test 2 21
Test 2 22
Test 2 23
Test 2 24
Test 2 25
Test 2 26
Test 2 27
Test 2 28
Test 2 29
Test 2 30
Test 2 31
Test 8 32
Test 8 33
Test 8 34
Test 8 35
Test 8 36
Test 8 37
Test 8 38
Test 8 39
Test 8 40
Test 8 41
Test 8 42
Test 8 43
Test 8 44
Test 8 45
Test 8 46
Test 8 47
Test 8 48
Test 8 49
Test 8 50
Test 8 51
Test 8 52
Test 8 53
Test 8 54
Test 8 55
Test 8 56
Test 8 57
Test 8 58
Test 8 59
Test 8 60
Test 8 61
Test 8 62
Test 8 63
Test 12 0
Test 12 1
Test 12 2
Test 12 3
Test 12 4
Test 12 5
Test 12 6
Test 12 7
Test 12 8
Test 12 9
Test 12 10
Test 12 11
Test 12 12
Test 12 13
Test 12 14
Test 12 15
Test 12 16
Test 12 17
Test 12 18
Test 12 19
Test 12 20
Test 12 21
Test 12 22
Test 12 23
Test 12 24
Test 12 25
Test 12 26
Test 12 27
Test 12 28
Test 12 29
Test 12 30
Test 12 31
Test 1 0
Test 1 1
Test 1 2
Test 1 3
Test 1 4
Test 1 5
Test 1 6
Test 1 7
Test 1 8
Test 1 9
Test 1 10
Test 1 11
Test 1 12
Test 1 13
Test 1 14
Test 1 15
Test 1 16
Test 1 17
Test 1 18
Test 1 19
Test 1 20
Test 1 21
Test 1 22
Test 1 23
Test 1 24
Test 1 25
Test 1 26
Test 1 27
Test 1 28
Test 1 29
Test 1 30
Test 1 31
Test 0 32
Test 0 33
Test 0 34
Test 0 35
Test 0 36
Test 0 37
Test 0 38
Test 0 39
Test 0 40
Test 0 41
Test 0 42
Test 0 43
Test 0 44
Test 0 45
Test 0 46
Test 0 47
Test 0 48
Test 0 49
Test 0 50
Test 0 51
Test 0 52
Test 0 53
Test 0 54
Test 0 55
Test 0 56
Test 0 57
Test 0 58
Test 0 59
Test 0 60
Test 0 61
Test 0 62
Test 0 63
Test 5 0
Test 5 1
Test 5 2
Test 5 3
Test 5 4
Test 5 5
Test 5 6
Test 5 7
Test 5 8
Test 5 9
Test 5 10
Test 5 11
Test 5 12
Test 5 13
Test 5 14
Test 5 15
Test 5 16
Test 5 17
Test 5 18
Test 5 19
Test 5 20
Test 5 21
Test 5 22
Test 5 23
Test 5 24
Test 5 25
Test 5 26
Test 5 27
Test 5 28
Test 5 29
Test 5 30
Test 5 31
Test 7 32
Test 7 33
Test 7 34
Test 7 35
Test 7 36
Test 7 37
Test 7 38
Test 7 39
Test 7 40
Test 7 41
Test 7 42
Test 7 43
Test 7 44
Test 7 45
Test 7 46
Test 7 47
Test 7 48
Test 7 49
Test 7 50
Test 7 51
Test 7 52
Test 7 53
Test 7 54
Test 7 55
Test 7 56
Test 7 57
Test 7 58
Test 7 59
Test 7 60
Test 7 61
Test 7 62
Test 7 63
Test 6 0
Test 6 1
Test 6 2
Test 6 3
Test 6 4
Test 6 5
Test 6 6
Test 6 7
Test 6 8
Test 6 9
Test 6 10
Test 6 11
Test 6 12
Test 6 13
Test 6 14
Test 6 15
Test 6 16
Test 6 17
Test 6 18
Test 6 19
Test 6 20
Test 6 21
Test 6 22
Test 6 23
Test 6 24
Test 6 25
Test 6 26
Test 6 27
Test 6 28
Test 6 29
Test 6 30
Test 6 31
Test 11 0
Test 11 1
Test 11 2
Test 11 3
Test 11 4
Test 11 5
Test 11 6
Test 11 7
Test 11 8
Test 11 9
Test 11 10
Test 11 11
Test 11 12
Test 11 13
Test 11 14
Test 11 15
Test 11 16
Test 11 17
Test 11 18
Test 11 19
Test 11 20
Test 11 21
Test 11 22
Test 11 23
Test 11 24
Test 11 25
Test 11 26
Test 11 27
Test 11 28
Test 11 29
Test 11 30
Test 11 31
Test 13 0
Test 13 1
Test 13 2
Test 13 3
Test 13 4
Test 13 5
Test 13 6
Test 13 7
Test 13 8
Test 13 9
Test 13 10
Test 13 11
Test 13 12
Test 13 13
Test 13 14
Test 13 15
Test 13 16
Test 13 17
Test 13 18
Test 13 19
Test 13 20
Test 13 21
Test 13 22
Test 13 23
Test 13 24
Test 13 25
Test 13 26
Test 13 27
Test 13 28
Test 13 29
Test 13 30
Test 13 31
Test 12 32
Test 12 33
Test 12 34
Test 12 35
Test 12 36
Test 12 37
Test 12 38
Test 12 39
Test 12 40
Test 12 41
Test 12 42
Test 12 43
Test 12 44
Test 12 45
Test 12 46
Test 12 47
Test 12 48
Test 12 49
Test 12 50
Test 12 51
Test 12 52
Test 12 53
Test 12 54
Test 12 55
Test 12 56
Test 12 57
Test 12 58
Test 12 59
Test 12 60
Test 12 61
Test 12 62
Test 12 63
Test 5 32
Test 5 33
Test 5 34
Test 5 35
Test 5 36
Test 5 37
Test 5 38
Test 5 39
Test 5 40
Test 5 41
Test 5 42
Test 5 43
Test 5 44
Test 5 45
Test 5 46
Test 5 47
Test 5 48
Test 5 49
Test 5 50
Test 5 51
Test 5 52
Test 5 53
Test 5 54
Test 5 55
Test 5 56
Test 5 57
Test 5 58
Test 5 59
Test 5 60
Test 5 61
Test 5 62
Test 5 63
Test 1 32
Test 1 33
Test 1 34
Test 1 35
Test 1 36
Test 1 37
Test 1 38
Test 1 39
Test 1 40
Test 1 41
Test 1 42
Test 1 43
Test 1 44
Test 1 45
Test 1 46
Test 1 47
Test 1 48
Test 1 49
Test 1 50
Test 1 51
Test 1 52
Test 1 53
Test 1 54
Test 1 55
Test 1 56
Test 1 57
Test 1 58
Test 1 59
Test 1 60
Test 1 61
Test 1 62
Test 1 63
Test 0 0
Test 0 1
Test 0 2
Test 0 3
Test 0 4
Test 0 5
Test 0 6
Test 0 7
Test 0 8
Test 0 9
Test 0 10
Test 0 11
Test 0 12
Test 0 13
Test 0 14
Test 0 15
Test 0 16
Test 0 17
Test 0 18
Test 0 19
Test 0 20
Test 0 21
Test 0 22
Test 0 23
Test 0 24
Test 0 25
Test 0 26
Test 0 27
Test 0 28
Test 0 29
Test 0 30
Test 0 31
Test 16 0
Test 16 1
Test 16 2
Test 16 3
Test 16 4
Test 16 5
Test 16 6
Test 16 7
Test 16 8
Test 16 9
Test 16 10
Test 16 11
Test 16 12
Test 16 13
Test 16 14
Test 16 15
Test 16 16
Test 16 17
Test 16 18
Test 16 19
Test 16 20
Test 16 21
Test 16 22
Test 16 23
Test 16 24
Test 16 25
Test 16 26
Test 16 27
Test 16 28
Test 16 29
Test 16 30
Test 16 31
Test 11 32
Test 11 33
Test 11 34
Test 11 35
Test 11 36
Test 11 37
Test 11 38
Test 11 39
Test 11 40
Test 11 41
Test 11 42
Test 11 43
Test 11 44
Test 11 45
Test 11 46
Test 11 47
Test 11 48
Test 11 49
Test 11 50
Test 11 51
Test 11 52
Test 11 53
Test 11 54
Test 11 55
Test 11 56
Test 11 57
Test 11 58
Test 11 59
Test 11 60
Test 11 61
Test 11 62
Test 11 63
Test 7 0
Test 7 1
Test 7 2
Test 7 3
Test 7 4
Test 7 5
Test 7 6
Test 7 7
Test 7 8
Test 7 9
Test 7 10
Test 7 11
Test 7 12
Test 7 13
Test 7 14
Test 7 15
Test 7 16
Test 7 17
Test 7 18
Test 7 19
Test 7 20
Test 7 21
Test 7 22
Test 7 23
Test 7 24
Test 7 25
Test 7 26
Test 7 27
Test 7 28
Test 7 29
Test 7 30
Test 7 31
Test 6 32
Test 6 33
Test 6 34
Test 6 35
Test 6 36
Test 6 37
Test 6 38
Test 6 39
Test 6 40
Test 6 41
Test 6 42
Test 6 43
Test 6 44
Test 6 45
Test 6 46
Test 6 47
Test 6 48
Test 6 49
Test 6 50
Test 6 51
Test 6 52
Test 6 53
Test 6 54
Test 6 55
Test 6 56
Test 6 57
Test 6 58
Test 6 59
Test 6 60
Test 6 61
Test 6 62
Test 6 63
Test 4 32
Test 4 33
Test 4 34
Test 4 35
Test 4 36
Test 4 37
Test 4 38
Test 4 39
Test 4 40
Test 4 41
Test 4 42
Test 4 43
Test 4 44
Test 4 45
Test 4 46
Test 4 47
Test 4 48
Test 4 49
Test 4 50
Test 4 51
Test 4 52
Test 4 53
Test 4 54
Test 4 55
Test 4 56
Test 4 57
Test 4 58
Test 4 59
Test 4 60
Test 4 61
Test 4 62
Test 4 63
Test 13 32
Test 13 33
Test 13 34
Test 13 35
Test 13 36
Test 13 37
Test 13 38
Test 13 39
Test 13 40
Test 13 41
Test 13 42
Test 13 43
Test 13 44
Test 13 45
Test 13 46
Test 13 47
Test 13 48
Test 13 49
Test 13 50
Test 13 51
Test 13 52
Test 13 53
Test 13 54
Test 13 55
Test 13 56
Test 13 57
Test 13 58
Test 13 59
Test 13 60
Test 13 61
Test 13 62
Test 13 63
Test 10 0
Test 10 1
Test 10 2
Test 10 3
Test 10 4
Test 10 5
Test 10 6
Test 10 7
Test 10 8
Test 10 9
Test 10 10
Test 10 11
Test 10 12
Test 10 13
Test 10 14
Test 10 15
Test 10 16
Test 10 17
Test 10 18
Test 10 19
Test 10 20
Test 10 21
Test 10 22
Test 10 23
Test 10 24
Test 10 25
Test 10 26
Test 10 27
Test 10 28
Test 10 29
Test 10 30
Test 10 31
Test 16 32
Test 16 33
Test 16 34
Test 16 35
Test 16 36
Test 16 37
Test 16 38
Test 16 39
Test 16 40
Test 16 41
Test 16 42
Test 16 43
Test 16 44
Test 16 45
Test 16 46
Test 16 47
Test 16 48
Test 16 49
Test 16 50
Test 16 51
Test 16 52
Test 16 53
Test 16 54
Test 16 55
Test 16 56
Test 16 57
Test 16 58
Test 16 59
Test 16 60
Test 16 61
Test 16 62
Test 16 63
Test 4 0
Test 4 1
Test 4 2
Test 4 3
Test 4 4
Test 4 5
Test 4 6
Test 4 7
Test 4 8
Test 4 9
Test 4 10
Test 4 11
Test 4 12
Test 4 13
Test 4 14
Test 4 15
Test 4 16
Test 4 17
Test 4 18
Test 4 19
Test 4 20
Test 4 21
Test 4 22
Test 4 23
Test 4 24
Test 4 25
Test 4 26
Test 4 27
Test 4 28
Test 4 29
Test 4 30
Test 4 31
Test 10 32
Test 10 33
Test 10 34
Test 10 35
Test 10 36
Test 10 37
Test 10 38
Test 10 39
Test 10 40
Test 10 41
Test 10 42
Test 10 43
Test 10 44
Test 10 45
Test 10 46
Test 10 47
Test 10 48
Test 10 49
Test 10 50
Test 10 51
Test 10 52
Test 10 53
Test 10 54
Test 10 55
Test 10 56
Test 10 57
Test 10 58
Test 10 59
Test 10 60
Test 10 61
Test 10 62
Test 10 63
Test 3 0
Test 3 1
Test 3 2
Test 3 3
Test 3 4
Test 3 5
Test 3 6
Test 3 7
Test 3 8
Test 3 9
Test 3 10
Test 3 11
Test 3 12
Test 3 13
Test 3 14
Test 3 15
Test 3 16
Test 3 17
Test 3 18
Test 3 19
Test 3 20
Test 3 21
Test 3 22
Test 3 23
Test 3 24
Test 3 25
Test 3 26
Test 3 27
Test 3 28
Test 3 29
Test 3 30
Test 3 31
Test 9 0
Test 9 1
Test 9 2
Test 9 3
Test 9 4
Test 9 5
Test 9 6
Test 9 7
Test 9 8
Test 9 9
Test 9 10
Test 9 11
Test 9 12
Test 9 13
Test 9 14
Test 9 15
Test 9 16
Test 9 17
Test 9 18
Test 9 19
Test 9 20
Test 9 21
Test 9 22
Test 9 23
Test 9 24
Test 9 25
Test 9 26
Test 9 27
Test 9 28
Test 9 29
Test 9 30
Test 9 31
Test 15 0
Test 15 1
Test 15 2
Test 15 3
Test 15 4
Test 15 5
Test 15 6
Test 15 7
Test 15 8
Test 15 9
Test 15 10
Test 15 11
Test 15 12
Test 15 13
Test 15 14
Test 15 15
Test 15 16
Test 15 17
Test 15 18
Test 15 19
Test 15 20
Test 15 21
Test 15 22
Test 15 23
Test 15 24
Test 15 25
Test 15 26
Test 15 27
Test 15 28
Test 15 29
Test 15 30
Test 15 31
Test 3 32
Test 3 33
Test 3 34
Test 3 35
Test 3 36
Test 3 37
Test 3 38
Test 3 39
Test 3 40
Test 3 41
Test 3 42
Test 3 43
Test 3 44
Test 3 45
Test 3 46
Test 3 47
Test 3 48
Test 3 49
Test 3 50
Test 3 51
Test 3 52
Test 3 53
Test 3 54
Test 3 55
Test 3 56
Test 3 57
Test 3 58
Test 3 59
Test 3 60
Test 3 61
Test 3 62
Test 3 63
Test 9 32
Test 9 33
Test 9 34
Test 9 35
Test 9 36
Test 9 37
Test 9 38
Test 9 39
Test 9 40
Test 9 41
Test 9 42
Test 9 43
Test 9 44
Test 9 45
Test 9 46
Test 9 47
Test 9 48
Test 9 49
Test 9 50
Test 9 51
Test 9 52
Test 9 53
Test 9 54
Test 9 55
Test 9 56
Test 9 57
Test 9 58
Test 9 59
Test 9 60
Test 9 61
Test 9 62
Test 9 63
Test 15 32
Test 15 33
Test 15 34
Test 15 35
Test 15 36
Test 15 37
Test 15 38
Test 15 39
Test 15 40
Test 15 41
Test 15 42
Test 15 43
Test 15 44
Test 15 45
Test 15 46
Test 15 47
Test 15 48
Test 15 49
Test 15 50
Test 15 51
Test 15 52
Test 15 53
Test 15 54
Test 15 55
Test 15 56
Test 15 57
Test 15 58
Test 15 59
Test 15 60
Test 15 61
Test 15 62
Test 15 63
Test 14 0
Test 14 1
Test 14 2
Test 14 3
Test 14 4
Test 14 5
Test 14 6
Test 14 7
Test 14 8
Test 14 9
Test 14 10
Test 14 11
Test 14 12
Test 14 13
Test 14 14
Test 14 15
Test 14 16
Test 14 17
Test 14 18
Test 14 19
Test 14 20
Test 14 21
Test 14 22
Test 14 23
Test 14 24
Test 14 25
Test 14 26
Test 14 27
Test 14 28
Test 14 29
Test 14 30
Test 14 31
Test 14 32
Test 14 33
Test 14 34
Test 14 35
Test 14 36
Test 14 37
Test 14 38
Test 14 39
Test 14 40
Test 14 41
Test 14 42
Test 14 43
Test 14 44
Test 14 45
Test 14 46
Test 14 47
Test 14 48
Test 14 49
Test 14 50
Test 14 51
Test 14 52
Test 14 53
Test 14 54
Test 14 55
Test 14 56
Test 14 57
Test 14 58
Test 14 59
Test 14 60
Test 14 61
Test 14 62
Test 14 63
Test 16 0
Test 16 1
Test 16 2
Test 16 3
Test 16 4
Test 16 5
Test 16 6
Test 16 7
Test 16 8
Test 16 9
Test 16 10
Test 16 11
Test 16 12
Test 16 13
Test 16 14
Test 16 15
Test 16 16
Test 16 17
Test 16 18
Test 16 19
Test 16 20
Test 16 21
Test 16 22
Test 16 23
Test 16 24
Test 16 25
Test 16 26
Test 16 27
Test 16 28
Test 16 29
Test 16 30
Test 16 31
Test 16 32
Test 16 33
Test 16 34
Test 16 35
Test 16 36
Test 16 37
Test 16 38
Test 16 39
Test 16 40
Test 16 41
Test 16 42
Test 16 43
Test 16 44
Test 16 45
Test 16 46
Test 16 47
Test 16 48
Test 16 49
Test 16 50
Test 16 51
Test 16 52
Test 16 53
Test 16 54
Test 16 55
Test 16 56
Test 16 57
Test 16 58
Test 16 59
Test 16 60
Test 16 61
Test 16 62
Test 16 63
Test 1 0
Test 1 1
Test 1 2
Test 1 3
Test 1 4
Test 1 5
Test 1 6
Test 1 7
Test 1 8
Test 1 9
Test 1 10
Test 1 11
Test 1 12
Test 1 13
Test 1 14
Test 1 15
Test 1 16
Test 1 17
Test 1 18
Test 1 19
Test 1 20
Test 1 21
Test 1 22
Test 1 23
Test 1 24
Test 1 25
Test 1 26
Test 1 27
Test 1 28
Test 1 29
Test 1 30
Test 1 31
Test 7 0
Test 7 1
Test 7 2
Test 7 3
Test 7 4
Test 7 5
Test 7 6
Test 7 7
Test 7 8
Test 7 9
Test 7 10
Test 7 11
Test 7 12
Test 7 13
Test 7 14
Test 7 15
Test 7 16
Test 7 17
Test 7 18
Test 7 19
Test 7 20
Test 7 21
Test 7 22
Test 7 23
Test 7 24
Test 7 25
Test 7 26
Test 7 27
Test 7 28
Test 7 29
Test 7 30
Test 7 31
Test 7 32
Test 7 33
Test 7 34
Test 7 35
Test 7 36
Test 7 37
Test 7 38
Test 7 39
Test 7 40
Test 7 41
Test 7 42
Test 7 43
Test 7 44
Test 7 45
Test 7 46
Test 7 47
Test 7 48
Test 7 49
Test 7 50
Test 7 51
Test 7 52
Test 7 53
Test 7 54
Test 7 55
Test 7 56
Test 7 57
Test 7 58
Test 7 59
Test 7 60
Test 7 61
Test 7 62
Test 7 63
Test 8 0
Test 8 1
Test 8 2
Test 8 3
Test 8 4
Test 8 5
Test 8 6
Test 8 7
Test 8 8
Test 8 9
Test 8 10
Test 8 11
Test 8 12
Test 8 13
Test 8 14
Test 8 15
Test 8 16
Test 8 17
Test 8 18
Test 8 19
Test 8 20
Test 8 21
Test 8 22
Test 8 23
Test 8 24
Test 8 25
Test 8 26
Test 8 27
Test 8 28
Test 8 29
Test 8 30
Test 8 31
Test 8 32
Test 8 33
Test 8 34
Test 8 35
Test 8 36
Test 8 37
Test 8 38
Test 8 39
Test 8 40
Test 8 41
Test 8 42
Test 8 43
Test 8 44
Test 8 45
Test 8 46
Test 8 47
Test 8 48
Test 8 49
Test 8 50
Test 8 51
Test 8 52
Test 8 53
Test 8 54
Test 8 55
Test 8 56
Test 8 57
Test 8 58
Test 8 59
Test 8 60
Test 8 61
Test 8 62
Test 8 63
Test 3 0
Test 3 1
Test 3 2
Test 3 3
Test 3 4
Test 3 5
Test 3 6
Test 3 7
Test 3 8
Test 3 9
Test 3 10
Test 3 11
Test 3 12
Test 3 13
Test 3 14
Test 3 15
Test 3 16
Test 3 17
Test 3 18
Test 3 19
Test 3 20
Test 3 21
Test 3 22
Test 3 23
Test 3 24
Test 3 25
Test 3 26
Test 3 27
Test 3 28
Test 3 29
Test 3 30
Test 3 31
Test 3 32
Test 3 33
Test 3 34
Test 3 35
Test 3 36
Test 3 37
Test 3 38
Test 3 39
Test 3 40
Test 3 41
Test 3 42
Test 3 43
Test 3 44
Test 3 45
Test 3 46
Test 3 47
Test 3 48
Test 3 49
Test 3 50
Test 3 51
Test 3 52
Test 3 53
Test 3 54
Test 3 55
Test 3 56
Test 3 57
Test 3 58
Test 3 59
Test 3 60
Test 3 61
Test 3 62
Test 3 63
Test 9 0
Test 9 1
Test 9 2
Test 9 3
Test 9 4
Test 9 5
Test 9 6
Test 9 7
Test 9 8
Test 9 9
Test 9 10
Test 9 11
Test 9 12
Test 9 13
Test 9 14
Test 9 15
Test 9 16
Test 9 17
Test 9 18
Test 9 19
Test 9 20
Test 9 21
Test 9 22
Test 9 23
Test 9 24
Test 9 25
Test 9 26
Test 9 27
Test 9 28
Test 9 29
Test 9 30
Test 9 31
Test 13 0
Test 13 1
Test 13 2
Test 13 3
Test 13 4
Test 13 5
Test 13 6
Test 13 7
Test 13 8
Test 13 9
Test 13 10
Test 13 11
Test 13 12
Test 13 13
Test 13 14
Test 13 15
Test 13 16
Test 13 17
Test 13 18
Test 13 19
Test 13 20
Test 13 21
Test 13 22
Test 13 23
Test 13 24
Test 13 25
Test 13 26
Test 13 27
Test 13 28
Test 13 29
Test 13 30
Test 13 31
Test 1 32
Test 1 33
Test 1 34
Test 1 35
Test 1 36
Test 1 37
Test 1 38
Test 1 39
Test 1 40
Test 1 41
Test 1 42
Test 1 43
Test 1 44
Test 1 45
Test 1 46
Test 1 47
Test 1 48
Test 1 49
Test 1 50
Test 1 51
Test 1 52
Test 1 53
Test 1 54
Test 1 55
Test 1 56
Test 1 57
Test 1 58
Test 1 59
Test 1 60
Test 1 61
Test 1 62
Test 1 63
Test 9 32
Test 9 33
Test 9 34
Test 9 35
Test 9 36
Test 9 37
Test 9 38
Test 9 39
Test 9 40
Test 9 41
Test 9 42
Test 9 43
Test 9 44
Test 9 45
Test 9 46
Test 9 47
Test 9 48
Test 9 49
Test 9 50
Test 9 51
Test 9 52
Test 9 53
Test 9 54
Test 9 55
Test 9 56
Test 9 57
Test 9 58
Test 9 59
Test 9 60
Test 9 61
Test 9 62
Test 9 63
Test 13 32
Test 13 33
Test 13 34
Test 13 35
Test 13 36
Test 13 37
Test 13 38
Test 13 39
Test 13 40
Test 13 41
Test 13 42
Test 13 43
Test 13 44
Test 13 45
Test 13 46
Test 13 47
Test 13 48
Test 13 49
Test 13 50
Test 13 51
Test 13 52
Test 13 53
Test 13 54
Test 13 55
Test 13 56
Test 13 57
Test 13 58
Test 13 59
Test 13 60
Test 13 61
Test 13 62
Test 13 63
Test 10 32
Test 10 33
Test 10 34
Test 10 35
Test 10 36
Test 10 37
Test 10 38
Test 10 39
Test 10 40
Test 10 41
Test 10 42
Test 10 43
Test 10 44
Test 10 45
Test 10 46
Test 10 47
Test 10 48
Test 10 49
Test 10 50
Test 10 51
Test 10 52
Test 10 53
Test 10 54
Test 10 55
Test 10 56
Test 10 57
Test 10 58
Test 10 59
Test 10 60
Test 10 61
Test 10 62
Test 10 63
Test 10 0
Test 10 1
Test 10 2
Test 10 3
Test 10 4
Test 10 5
Test 10 6
Test 10 7
Test 10 8
Test 10 9
Test 10 10
Test 10 11
Test 10 12
Test 10 13
Test 10 14
Test 10 15
Test 10 16
Test 10 17
Test 10 18
Test 10 19
Test 10 20
Test 10 21
Test 10 22
Test 10 23
Test 10 24
Test 10 25
Test 10 26
Test 10 27
Test 10 28
Test 10 29
Test 10 30
Test 10 31
Test 15 0
Test 15 1
Test 15 2
Test 15 3
Test 15 4
Test 15 5
Test 15 6
Test 15 7
Test 15 8
Test 15 9
Test 15 10
Test 15 11
Test 15 12
Test 15 13
Test 15 14
Test 15 15
Test 15 16
Test 15 17
Test 15 18
Test 15 19
Test 15 20
Test 15 21
Test 15 22
Test 15 23
Test 15 24
Test 15 25
Test 15 26
Test 15 27
Test 15 28
Test 15 29
Test 15 30
Test 15 31
Test 2 32
Test 2 33
Test 2 34
Test 2 35
Test 2 36
Test 2 37
Test 2 38
Test 2 39
Test 2 40
Test 2 41
Test 2 42
Test 2 43
Test 2 44
Test 2 45
Test 2 46
Test 2 47
Test 2 48
Test 2 49
Test 2 50
Test 2 51
Test 2 52
Test 2 53
Test 2 54
Test 2 55
Test 2 56
Test 2 57
Test 2 58
Test 2 59
Test 2 60
Test 2 61
Test 2 62
Test 2 63
Test 15 32
Test 15 33
Test 15 34
Test 15 35
Test 15 36
Test 15 37
Test 15 38
Test 15 39
Test 15 40
Test 15 41
Test 15 42
Test 15 43
Test 15 44
Test 15 45
Test 15 46
Test 15 47
Test 15 48
Test 15 49
Test 15 50
Test 15 51
Test 15 52
Test 15 53
Test 15 54
Test 15 55
Test 15 56
Test 15 57
Test 15 58
Test 15 59
Test 15 60
Test 15 61
Test 15 62
Test 15 63
Test 2 0
Test 2 1
Test 2 2
Test 2 3
Test 2 4
Test 2 5
Test 2 6
Test 2 7
Test 2 8
Test 2 9
Test 2 10
Test 2 11
Test 2 12
Test 2 13
Test 2 14
Test 2 15
Test 2 16
Test 2 17
Test 2 18
Test 2 19
Test 2 20
Test 2 21
Test 2 22
Test 2 23
Test 2 24
Test 2 25
Test 2 26
Test 2 27
Test 2 28
Test 2 29
Test 2 30
Test 2 31
Test 4 0
Test 4 1
Test 4 2
Test 4 3
Test 4 4
Test 4 5
Test 4 6
Test 4 7
Test 4 8
Test 4 9
Test 4 10
Test 4 11
Test 4 12
Test 4 13
Test 4 14
Test 4 15
Test 4 16
Test 4 17
Test 4 18
Test 4 19
Test 4 20
Test 4 21
Test 4 22
Test 4 23
Test 4 24
Test 4 25
Test 4 26
Test 4 27
Test 4 28
Test 4 29
Test 4 30
Test 4 31
Test 12 0
Test 12 1
Test 12 2
Test 12 3
Test 12 4
Test 12 5
Test 12 6
Test 12 7
Test 12 8
Test 12 9
Test 12 10
Test 12 11
Test 12 12
Test 12 13
Test 12 14
Test 12 15
Test 12 16
Test 12 17
Test 12 18
Test 12 19
Test 12 20
Test 12 21
Test 12 22
Test 12 23
Test 12 24
Test 12 25
Test 12 26
Test 12 27
Test 12 28
Test 12 29
Test 12 30
Test 12 31
Test 4 32
Test 4 33
Test 4 34
Test 4 35
Test 4 36
Test 4 37
Test 4 38
Test 4 39
Test 4 40
Test 4 41
Test 4 42
Test 4 43
Test 4 44
Test 4 45
Test 4 46
Test 4 47
Test 4 48
Test 4 49
Test 4 50
Test 4 51
Test 4 52
Test 4 53
Test 4 54
Test 4 55
Test 4 56
Test 4 57
Test 4 58
Test 4 59
Test 4 60
Test 4 61
Test 4 62
Test 4 63
Test 12 32
Test 12 33
Test 12 34
Test 12 35
Test 12 36
Test 12 37
Test 12 38
Test 12 39
Test 12 40
Test 12 41
Test 12 42
Test 12 43
Test 12 44
Test 12 45
Test 12 46
Test 12 47
Test 12 48
Test 12 49
Test 12 50
Test 12 51
Test 12 52
Test 12 53
Test 12 54
Test 12 55
Test 12 56
Test 12 57
Test 12 58
Test 12 59
Test 12 60
Test 12 61
Test 12 62
Test 12 63
Test 5 0
Test 5 1
Test 5 2
Test 5 3
Test 5 4
Test 5 5
Test 5 6
Test 5 7
Test 5 8
Test 5 9
Test 5 10
Test 5 11
Test 5 12
Test 5 13
Test 5 14
Test 5 15
Test 5 16
Test 5 17
Test 5 18
Test 5 19
Test 5 20
Test 5 21
Test 5 22
Test 5 23
Test 5 24
Test 5 25
Test 5 26
Test 5 27
Test 5 28
Test 5 29
Test 5 30
Test 5 31
Test 5 32
Test 5 33
Test 5 34
Test 5 35
Test 5 36
Test 5 37
Test 5 38
Test 5 39
Test 5 40
Test 5 41
Test 5 42
Test 5 43
Test 5 44
Test 5 45
Test 5 46
Test 5 47
Test 5 48
Test 5 49
Test 5 50
Test 5 51
Test 5 52
Test 5 53
Test 5 54
Test 5 55
Test 5 56
Test 5 57
Test 5 58
Test 5 59
Test 5 60
Test 5 61
Test 5 62
Test 5 63
Test 6 32
Test 6 33
Test 6 34
Test 6 35
Test 6 36
Test 6 37
Test 6 38
Test 6 39
Test 6 40
Test 6 41
Test 6 42
Test 6 43
Test 6 44
Test 6 45
Test 6 46
Test 6 47
Test 6 48
Test 6 49
Test 6 50
Test 6 51
Test 6 52
Test 6 53
Test 6 54
Test 6 55
Test 6 56
Test 6 57
Test 6 58
Test 6 59
Test 6 60
Test 6 61
Test 6 62
Test 6 63
Test 6 0
Test 6 1
Test 6 2
Test 6 3
Test 6 4
Test 6 5
Test 6 6
Test 6 7
Test 6 8
Test 6 9
Test 6 10
Test 6 11
Test 6 12
Test 6 13
Test 6 14
Test 6 15
Test 6 16
Test 6 17
Test 6 18
Test 6 19
Test 6 20
Test 6 21
Test 6 22
Test 6 23
Test 6 24
Test 6 25
Test 6 26
Test 6 27
Test 6 28
Test 6 29
Test 6 30
Test 6 31
Test 11 0
Test 11 1
Test 11 2
Test 11 3
Test 11 4
Test 11 5
Test 11 6
Test 11 7
Test 11 8
Test 11 9
Test 11 10
Test 11 11
Test 11 12
Test 11 13
Test 11 14
Test 11 15
Test 11 16
Test 11 17
Test 11 18
Test 11 19
Test 11 20
Test 11 21
Test 11 22
Test 11 23
Test 11 24
Test 11 25
Test 11 26
Test 11 27
Test 11 28
Test 11 29
Test 11 30
Test 11 31
Test 11 32
Test 11 33
Test 11 34
Test 11 35
Test 11 36
Test 11 37
Test 11 38
Test 11 39
Test 11 40
Test 11 41
Test 11 42
Test 11 43
Test 11 44
Test 11 45
Test 11 46
Test 11 47
Test 11 48
Test 11 49
Test 11 50
Test 11 51
Test 11 52
Test 11 53
Test 11 54
Test 11 55
Test 11 56
Test 11 57
Test 11 58
Test 11 59
Test 11 60
Test 11 61
Test 11 62
Test 11 63
Test 0 32
Test 0 33
Test 0 34
Test 0 35
Test 0 36
Test 0 37
Test 0 38
Test 0 39
Test 0 40
Test 0 41
Test 0 42
Test 0 43
Test 0 44
Test 0 45
Test 0 46
Test 0 47
Test 0 48
Test 0 49
Test 0 50
Test 0 51
Test 0 52
Test 0 53
Test 0 54
Test 0 55
Test 0 56
Test 0 57
Test 0 58
Test 0 59
Test 0 60
Test 0 61
Test 0 62
Test 0 63
Test 0 0
Test 0 1
Test 0 2
Test 0 3
Test 0 4
Test 0 5
Test 0 6
Test 0 7
Test 0 8
Test 0 9
Test 0 10
Test 0 11
Test 0 12
Test 0 13
Test 0 14
Test 0 15
Test 0 16
Test 0 17
Test 0 18
Test 0 19
Test 0 20
Test 0 21
Test 0 22
Test 0 23
Test 0 24
Test 0 25
Test 0 26
Test 0 27
Test 0 28
Test 0 29
Test 0 30
Test 0 31
Sum: 1088.000000
[       OK ] cuda.team_policy_max_scalar_without_plus_equal_k (4 ms)
[ RUN      ] cuda.team_teamvector_range
[       OK ] cuda.team_teamvector_range (4 ms)
[ RUN      ] cuda.template_meta_functions
[       OK ] cuda.template_meta_functions (0 ms)
[ RUN      ] cuda.view_aggregate
[       OK ] cuda.view_aggregate (0 ms)
[ RUN      ] cuda.memory_pool
[       OK ] cuda.memory_pool (14 ms)
[ RUN      ] cuda.cxx11
[       OK ] cuda.cxx11 (2 ms)
[ RUN      ] cuda.viewctorprop_embedded_dim
[       OK ] cuda.viewctorprop_embedded_dim (1 ms)
[ RUN      ] cuda.viewctorpop_view_allocate_without_initializing_backward_compatility
[       OK ] cuda.viewctorpop_view_allocate_without_initializing_backward_compatility (0 ms)
[ RUN      ] cuda.view_layouttiled
[       OK ] cuda.view_layouttiled (8 ms)
[ RUN      ] cuda.view_layouttiled_subtile
[       OK ] cuda.view_layouttiled_subtile (3 ms)
[ RUN      ] cuda.mdrange_5d
[       OK ] cuda.mdrange_5d (154 ms)
[ RUN      ] cuda.mdrange_6d
[       OK ] cuda.mdrange_6d (216 ms)
[ RUN      ] cuda.mdrange_2d
[       OK ] cuda.mdrange_2d (7 ms)
[ RUN      ] cuda.mdrange_array_reduce
[       OK ] cuda.mdrange_array_reduce (0 ms)
[ RUN      ] cuda.mdrange_3d
[       OK ] cuda.mdrange_3d (29 ms)
[ RUN      ] cuda.mdrange_neg_idx
[       OK ] cuda.mdrange_neg_idx (3 ms)
[ RUN      ] cuda.mdrange_4d
[       OK ] cuda.mdrange_4d (26 ms)
[ RUN      ] cuda.crs_count_fill
[       OK ] cuda.crs_count_fill (7 ms)
[ RUN      ] cuda.crs_copy_constructor
[       OK ] cuda.crs_copy_constructor (26 ms)
[ RUN      ] cuda.workgraph_fib
Scanning dependencies of target KokkosCore_UnitTest_Default
[ 37%] Building CXX object core/unit_test/CMakeFiles/KokkosCore_UnitTest_Default.dir/UnitTestMainInit.cpp.o
[ 38%] Building CXX object core/unit_test/CMakeFiles/KokkosCore_UnitTest_Default.dir/default/TestDefaultDeviceType.cpp.o
[       OK ] cuda.workgraph_fib (850 ms)
[ RUN      ] cuda.space_access
[       OK ] cuda.space_access (0 ms)
[ RUN      ] cuda.uvm
[       OK ] cuda.uvm (1 ms)
[ RUN      ] cuda.impl_view_accessible
[       OK ] cuda.impl_view_accessible (3 ms)
[ RUN      ] cuda.impl_view_texture
[       OK ] cuda.impl_view_texture (1 ms)
[ RUN      ] cuda.unique_token_global
TestUniqueToken max reuse = 4107
[       OK ] cuda.unique_token_global (194 ms)
[ RUN      ] cuda.unique_token_instance
TestUniqueToken max reuse = 4057
[       OK ] cuda.unique_token_instance (198 ms)
[ RUN      ] cuda.acquire_team_unique_token
TestAcquireTeamUniqueToken max reuse = 225
[       OK ] cuda.acquire_team_unique_token (51 ms)
[ RUN      ] cuda.local_deepcopy_teampolicy_layoutleft
[ 39%] Building CXX object core/unit_test/CMakeFiles/KokkosCore_UnitTest_Cuda1.dir/cuda/TestCuda_QuadPrecisionMath.cpp.o
[ 39%] Building CXX object core/unit_test/CMakeFiles/KokkosCore_UnitTest_Cuda1.dir/cuda/TestCuda_ExecSpacePartitioning.cpp.o
40: Using KOKKOS_DESUL_ATOMICS
40: int                     Test 1 PASSED  --- Loop: 100000 Value (S,A,NA): 1.000000e+05 1.000000e+05 1.600000e+01 Time: 2.5000e-06 2.8248e-03 2.2114e-03 Size of Type 4)
40: int                     Test 2 PASSED  --- Loop: 100000 Value (S,A,NA): 1.000000e+05 1.000000e+05 5.000000e+00 Time: 2.7000e-06 1.0379e+01 6.5774e-03 Size of Type 4)
40: int                     Test 3 PASSED  --- Loop: 100000 Value (S,A,NA): 7.049827e+08 7.049827e+08 5.457480e+05 Time: 1.1230e-04 3.9613e-03 3.2775e-03 Size of Type 4)
40: long int                Test 1 PASSED  --- Loop: 100000 Value (S,A,NA): 1.000000e+05 1.000000e+05 1.300000e+01 Time: 2.7000e-06 1.5050e+01 3.2954e-03 Size of Type 8)
40: long int                Test 2 PASSED  --- Loop: 100000 Value (S,A,NA): 1.000000e+05 1.000000e+05 6.000000e+00 Time: 3.0000e-07 1.0981e+01 7.3992e-03 Size of Type 8)
40: long int                Test 3 PASSED  --- Loop: 100000 Value (S,A,NA): 4.999950e+09 4.999950e+09 2.376270e+05 Time: 7.5300e-05 1.4656e+01 5.7186e-03 Size of Type 8)
40: long long int           Test 1 PASSED  --- Loop: 100000 Value (S,A,NA): 1.000000e+05 1.000000e+05 1.300000e+01 Time: 1.4000e-06 1.3387e+01 3.4180e-03 Size of Type 8)
40: long long int           Test 2 PASSED  --- Loop: 100000 Value (S,A,NA): 1.000000e+05 1.000000e+05 6.000000e+00 Time: 2.4000e-06 1.1361e+01 3.4745e-03 Size of Type 8)
40: long long int           Test 3 PASSED  --- Loop: 100000 Value (S,A,NA): 4.999950e+09 4.999950e+09 3.581370e+05 Time: 7.5200e-05 1.5796e+01 4.8597e-03 Size of Type 8)
40: unsigned int            Test 1 PASSED  --- Loop: 100000 Value (S,A,NA): 1.000000e+05 1.000000e+05 1.600000e+01 Time: 2.0000e-07 2.4404e-03 2.0474e-03 Size of Type 4)
40: unsigned int            Test 2 PASSED  --- Loop: 100000 Value (S,A,NA): 1.000000e+05 1.000000e+05 4.000000e+00 Time: 4.0000e-07 1.2135e+01 2.5574e-03 Size of Type 4)
40: unsigned int            Test 3 PASSED  --- Loop: 100000 Value (S,A,NA): 7.049827e+08 7.049827e+08 4.234520e+05 Time: 1.1260e-04 5.1519e-03 3.4643e-03 Size of Type 4)
40: unsigned long int       Test 1 PASSED  --- Loop: 100000 Value (S,A,NA): 1.000000e+05 1.000000e+05 1.200000e+01 Time: 4.0000e-07 1.4566e+01 2.6038e-03 Size of Type 8)
40: unsigned long int       Test 2 PASSED  --- Loop: 100000 Value (S,A,NA): 1.000000e+05 1.000000e+05 9.000000e+00 Time: 3.0000e-07 1.1925e+01 2.5269e-03 Size of Type 8)
40: unsigned long int       Test 3 PASSED  --- Loop: 100000 Value (S,A,NA): 4.999950e+09 4.999950e+09 4.122800e+05 Time: 7.5300e-05 1.5768e+01 4.1865e-03 Size of Type 8)
40: unsigned long long int  Test 1 PASSED  --- Loop: 100000 Value (S,A,NA): 1.000000e+05 1.000000e+05 1.200000e+01 Time: 2.0000e-07 2.4288e-03 2.0428e-03 Size of Type 8)
40: unsigned long long int  Test 2 PASSED  --- Loop: 100000 Value (S,A,NA): 1.000000e+05 1.000000e+05 9.000000e+00 Time: 2.9000e-06 1.1420e+01 3.1769e-03 Size of Type 8)
40: unsigned long long int  Test 3 PASSED  --- Loop: 100000 Value (S,A,NA): 4.999950e+09 4.999950e+09 5.970460e+05 Time: 7.5400e-05 4.9904e-03 3.3073e-03 Size of Type 8)
40: double                  Test 1 PASSED  --- Loop: 100000 Value (S,A,NA): 1.000000e+05 1.000000e+05 1.400000e+01 Time: 9.2881e-04 1.3790e+01 2.4032e-03 Size of Type 8)
40: double                  Test 2 PASSED  --- Loop: 100000 Value (S,A,NA): 1.000000e+05 1.000000e+05 7.000000e+00 Time: 8.9571e-04 1.3221e+01 2.8170e-03 Size of Type 8)
40: double                  Test 3 PASSED  --- Loop: 100000 Value (S,A,NA): 4.999950e+09 4.999950e+09 2.875470e+05 Time: 8.9610e-04 1.4779e+01 4.9967e-03 Size of Type 8)
40/47 Test #40: KokkosCore_PerformanceTest_Atomic ............   Passed   40.63 sec
test 41
      Start 41: KokkosCore_PerformanceTest_Atomic_MinMax

41: Test command: /var/jenkins/workspace/Kokkos/build/core/perf_test/KokkosCore_PerformanceTest_Atomic_MinMax
41: Test timeout computed to be: 1500
41: ================ int
41: Time for 100% min replacements: 4.607e-05
41: Time for 100% max replacements: 4.377e-05
41: Time for 100% max early exits: 3.434e-05
41: Time for 100% min early exits: 3.7361e-05
41: Time for contentious max 200000 replacements: 0.000193531
41: Time for contentious min 200000 replacements: 0.000195552
41: ================ long
41: Time for 100% min replacements: 5.244e-05
41: Time for 100% max replacements: 5.0221e-05
41: Time for 100% max early exits: 3.466e-05
41: Time for 100% min early exits: 3.826e-05
41: Time for contentious max 200000 replacements: 0.000193262
41: Time for contentious min 200000 replacements: 0.000192142
41: ================ long long
41: Time for 100% min replacements: 5.1871e-05
41: Time for 100% max replacements: 5.183e-05
41: Time for 100% max early exits: 3.4281e-05
41: Time for 100% min early exits: 3.915e-05
41: Time for contentious max 200000 replacements: 0.000197172
41: Time for contentious min 200000 replacements: 0.000195332
41: ================ unsigned int
41: Time for 100% min replacements: 4.151e-05
41: Time for 100% max replacements: 4.3671e-05
41: Time for 100% max early exits: 3.996e-05
41: Time for 100% min early exits: 3.7381e-05
41: Time for contentious max 200000 replacements: 0.000197501
41: Time for contentious min 200000 replacements: 0.000187321
41: ================ unsigned long
41: Time for 100% min replacements: 5.1991e-05
41: Time for 100% max replacements: 5.1671e-05
41: Time for 100% max early exits: 3.443e-05
41: Time for 100% min early exits: 3.8251e-05
41: Time for contentious max 200000 replacements: 0.000197392
41: Time for contentious min 200000 replacements: 0.000195181
41: ================ unsigned long long
41: Time for 100% min replacements: 6.2161e-05
41: Time for 100% max replacements: 5.0601e-05
41: Time for 100% max early exits: 3.422e-05
41: Time for 100% min early exits: 3.5051e-05
41: Time for contentious max 200000 replacements: 0.000194661
41: Time for contentious min 200000 replacements: 0.000192801
41: ================ float
41: Time for 100% min replacements: 4.339e-05
41: Time for 100% max replacements: 4.2091e-05
41: Time for 100% max early exits: 3.841e-05
41: Time for 100% min early exits: 3.892e-05
41: Time for contentious max 200000 replacements: 0.000181771
41: Time for contentious min 200000 replacements: 0.000180941
41: ================ double
41: Time for 100% min replacements: 5.1641e-05
41: Time for 100% max replacements: 4.7521e-05
41: Time for 100% max early exits: 3.443e-05
41: Time for 100% min early exits: 3.8221e-05
41: Time for contentious max 200000 replacements: 0.000180871
41: Time for contentious min 200000 replacements: 0.000180851
41/47 Test #41: KokkosCore_PerformanceTest_Atomic_MinMax .....   Passed    0.38 sec
test 42
      Start 42: KokkosCore_PerformanceTest_Mempool

42: Test command: /var/jenkins/workspace/Kokkos/build/core/perf_test/KokkosCore_PerformanceTest_Mempool
42: Test timeout computed to be: 1500
42: "mempool: alloc super stride level span inner outer number" 1000000 10000 1 70 5 1 1 5555
42: "mempool: fill time (min, avg)" 0.00068483 0.00068483
42: "mempool: cycle time (min, avg)" 0.00015109 0.00015109
42: "mempool: test time (min, avg)" 0.00083593 0.00083593
42: "mempool: fill ops per second (max, avg)" 8.11144e+06 8.11144e+06
42: "mempool: cycle ops per second (max, avg)" 7.35314e+07 7.35314e+07
42/47 Test #42: KokkosCore_PerformanceTest_Mempool ...........   Passed    0.42 sec
test 43
      Start 43: KokkosCore_PerformanceTest_TaskDag

43: Test command: /var/jenkins/workspace/Kokkos/build/core/perf_test/KokkosCore_PerformanceTest_TaskDag
43: Test timeout computed to be: 1500
43/47 Test #43: KokkosCore_PerformanceTest_TaskDag ...........   Passed    0.02 sec
test 44
      Start 44: KokkosContainers_UnitTest_Serial

44: Test command: /var/jenkins/workspace/Kokkos/build/containers/unit_tests/KokkosContainers_UnitTest_Serial
44: Test timeout computed to be: 1500
44: [==========] Running 37 tests from 1 test case.
44: [----------] Global test environment set-up.
44: [----------] 37 tests from serial
44: [ RUN      ] serial.bitset
44: [       OK ] serial.bitset (1239 ms)
44: [ RUN      ] serial.dualview_combination
44: [       OK ] serial.dualview_combination (0 ms)
44: [ RUN      ] serial.dualview_alloc
44: [       OK ] serial.dualview_alloc (0 ms)
44: [ RUN      ] serial.dualview_combinations_without_init
44: [       OK ] serial.dualview_combinations_without_init (0 ms)
44: [ RUN      ] serial.dualview_deep_copy
44: [       OK ] serial.dualview_deep_copy (0 ms)
44: [ RUN      ] serial.dualview_realloc
44: [       OK ] serial.dualview_realloc (0 ms)
44: [ RUN      ] serial.dualview_resize
44: [       OK ] serial.dualview_resize (0 ms)
44: [ RUN      ] serial.dualview_device_correct_kokkos_device
44: [       OK ] serial.dualview_device_correct_kokkos_device (4 ms)
44: [ RUN      ] serial.dualview_host_correct_kokkos_device
44: [       OK ] serial.dualview_host_correct_kokkos_device (0 ms)
44: [ RUN      ] serial.dualview_host_modify_template_device_sync
44: [       OK ] serial.dualview_host_modify_template_device_sync (0 ms)
44: [ RUN      ] serial.dualview_host_modify_template_device_execspace_sync
44: [       OK ] serial.dualview_host_modify_template_device_execspace_sync (0 ms)
44: [ RUN      ] serial.dualview_device_modify_template_host_sync
44: [       OK ] serial.dualview_device_modify_template_host_sync (0 ms)
44: [ RUN      ] serial.dualview_device_modify_template_host_execspace_sync
44: [       OK ] serial.dualview_device_modify_template_host_execspace_sync (0 ms)
44: [ RUN      ] serial.dualview_template_views_return_correct_executionspace_views
44: [       OK ] serial.dualview_template_views_return_correct_executionspace_views (1 ms)
44: [ RUN      ] serial.dynamic_view
44: [       OK ] serial.dynamic_view (3 ms)
44: [ RUN      ] serial.dyn_rank_view_api_generic
44: [       OK ] serial.dyn_rank_view_api_generic (5 ms)
44: [ RUN      ] serial.dyn_rank_view_api_operator_rank12345
44: [       OK ] serial.dyn_rank_view_api_operator_rank12345 (0 ms)
44: [ RUN      ] serial.dyn_rank_view_api_operator_rank67
44: [       OK ] serial.dyn_rank_view_api_operator_rank67 (0 ms)
44: [ RUN      ] serial.ErrorReporterViaLambda
44: [       OK ] serial.ErrorReporterViaLambda (0 ms)
44: [ RUN      ] serial.ErrorReporter
44: [       OK ] serial.ErrorReporter (0 ms)
44: [ RUN      ] serial.offsetview_construction
44: [       OK ] serial.offsetview_construction (21 ms)
44: [ RUN      ] serial.offsetview_unmanaged_construction
44: [       OK ] serial.offsetview_unmanaged_construction (0 ms)
44: [ RUN      ] serial.offsetview_subview
44: [       OK ] serial.offsetview_subview (13 ms)
44: [ RUN      ] serial.offsetview_offsets_rank1
44: [       OK ] serial.offsetview_offsets_rank1 (0 ms)
44: [ RUN      ] serial.offsetview_offsets_rank2
44: [       OK ] serial.offsetview_offsets_rank2 (0 ms)
44: [ RUN      ] serial.offsetview_offsets_rank3
44: [       OK ] serial.offsetview_offsets_rank3 (1 ms)
44: [ RUN      ] serial.scatterview
44: [       OK ] serial.scatterview (1481 ms)
44: [ RUN      ] serial.scatterview_devicetype
44: [       OK ] serial.scatterview_devicetype (1 ms)
44: [ RUN      ] serial.staticcrsgraph
44: [       OK ] serial.staticcrsgraph (4 ms)
44: [ RUN      ] serial.UnorderedMap_insert
[ 39%] Building CXX object core/unit_test/CMakeFiles/KokkosCore_UnitTest_Cuda1.dir/cuda/TestCuda_MathematicalSpecialFunctions.cpp.o
[ 40%] Building CXX object core/unit_test/CMakeFiles/KokkosCore_UnitTest_Serial1.dir/serial/TestSerial_MDRange_c.cpp.o
[ 41%] Building CXX object core/unit_test/CMakeFiles/KokkosCore_IncrementalTest_CUDA.dir/generated/Test16_ParallelScan_CUDA.cpp.o
[ 41%] Building CXX object core/unit_test/CMakeFiles/KokkosCore_UnitTest_Serial2.dir/serial/TestSerial_SubView_c04.cpp.o
45: [       OK ] openmp.scatterview (58836 ms)
45: [ RUN      ] openmp.scatterview_devicetype
45: [       OK ] openmp.scatterview_devicetype (5 ms)
45: [ RUN      ] openmp.staticcrsgraph
45: [       OK ] openmp.staticcrsgraph (6 ms)
45: [ RUN      ] openmp.UnorderedMap_insert
45: [       OK ] openmp.UnorderedMap_insert (2518 ms)
45: [ RUN      ] openmp.UnorderedMap_failed_insert
45: [       OK ] openmp.UnorderedMap_failed_insert (2963 ms)
45: [ RUN      ] openmp.UnorderedMap_deep_copy
45: [       OK ] openmp.UnorderedMap_deep_copy (2 ms)
45: [ RUN      ] openmp.UnorderedMap_valid_empty
45: [       OK ] openmp.UnorderedMap_valid_empty (1 ms)
45: [ RUN      ] openmp.UnorderedMap_clear_zero_size
45: [       OK ] openmp.UnorderedMap_clear_zero_size (0 ms)
45: [ RUN      ] openmp.vector_combination
45: [       OK ] openmp.vector_combination (0 ms)
45: [ RUN      ] openmp.vector_insert
45: [       OK ] openmp.vector_insert (1 ms)
45: [ RUN      ] openmp.viewctorprop_embedded_dim
45: [       OK ] openmp.viewctorprop_embedded_dim (0 ms)
45: [----------] 33 tests from openmp (64737 ms total)
45: 
45: [----------] Global test environment tear-down
45: [==========] 33 tests from 1 test case ran. (64737 ms total)
45: [  PASSED  ] 33 tests.
45/49 Test #45: KokkosContainers_UnitTest_OpenMP .............   Passed   66.28 sec
test 46
      Start 46: KokkosContainers_UnitTest_Cuda

46: Test command: /var/jenkins/workspace/Kokkos/build-tests/containers/unit_tests/KokkosContainers_UnitTest_Cuda
46: Test timeout computed to be: 1500
46: 
46: Kokkos::Cuda::initialize WARNING: Cuda is allocating into UVMSpace by default
46:                                   without setting CUDA_LAUNCH_BLOCKING=1.
46:                                   The code must call Cuda().fence() after each kernel
46:                                   or will likely crash when accessing data on the host.
46: 
46: Kokkos::Cuda::initialize WARNING: Cuda is allocating into UVMSpace by default
46:                                   without setting CUDA_MANAGED_FORCE_DEVICE_ALLOC=1 or
46:                                   setting CUDA_VISIBLE_DEVICES.
46:                                   This could on multi GPU systems lead to severe performance"
46:                                   penalties.
46: [==========] Running 33 tests from 1 test case.
46: [----------] Global test environment set-up.
46: [----------] 33 tests from cuda
46: [ RUN      ] cuda.bitset
46: [       OK ] cuda.bitset (16 ms)
46: [ RUN      ] cuda.dualview_combination
46: [       OK ] cuda.dualview_combination (1 ms)
46: [ RUN      ] cuda.dualview_alloc
46: [       OK ] cuda.dualview_alloc (0 ms)
46: [ RUN      ] cuda.dualview_combinations_without_init
46: [       OK ] cuda.dualview_combinations_without_init (1 ms)
46: [ RUN      ] cuda.dualview_deep_copy
46: 
46: Kokkos::Cuda::initialize WARNING: Cuda is allocating into UVMSpace by default
46:                                   without setting CUDA_LAUNCH_BLOCKING=1.
46:                                   The code must call Cuda().fence() after each kernel
46:                                   or will likely crash when accessing data on the host.
46: 
46: Kokkos::Cuda::initialize WARNING: Cuda is allocating into UVMSpace by default
46:                                   without setting CUDA_MANAGED_FORCE_DEVICE_ALLOC=1 or
46:                                   setting CUDA_VISIBLE_DEVICES.
46:                                   This could on multi GPU systems lead to severe performance"
46:                                   penalties.
46: [       OK ] cuda.dualview_deep_copy (3 ms)
46: [ RUN      ] cuda.dualview_realloc
46: [       OK ] cuda.dualview_realloc (0 ms)
46: [ RUN      ] cuda.dualview_resize
46: [       OK ] cuda.dualview_resize (1 ms)
46: [ RUN      ] cuda.dualview_device_correct_kokkos_device
46: [       OK ] cuda.dualview_device_correct_kokkos_device (1 ms)
46: [ RUN      ] cuda.dualview_host_correct_kokkos_device
46: [       OK ] cuda.dualview_host_correct_kokkos_device (0 ms)
46: [ RUN      ] cuda.dualview_host_modify_template_device_sync
46: [       OK ] cuda.dualview_host_modify_template_device_sync (0 ms)
46: [ RUN      ] cuda.dualview_host_modify_template_device_execspace_sync
46: [       OK ] cuda.dualview_host_modify_template_device_execspace_sync (0 ms)
46: [ RUN      ] cuda.dualview_device_modify_template_host_sync
46: [       OK ] cuda.dualview_device_modify_template_host_sync (0 ms)
46: [ RUN      ] cuda.dualview_device_modify_template_host_execspace_sync
46: [       OK ] cuda.dualview_device_modify_template_host_execspace_sync (1 ms)
46: [ RUN      ] cuda.dualview_template_views_return_correct_executionspace_views
46: [       OK ] cuda.dualview_template_views_return_correct_executionspace_views (0 ms)
46: [ RUN      ] cuda.dynamic_view
46: [       OK ] cuda.dynamic_view (31 ms)
46: [ RUN      ] cuda.dyn_rank_view_api_generic
46: [       OK ] cuda.dyn_rank_view_api_generic (14 ms)
46: [ RUN      ] cuda.dyn_rank_view_api_operator_rank12345
46: [       OK ] cuda.dyn_rank_view_api_operator_rank12345 (2 ms)
46: [ RUN      ] cuda.dyn_rank_view_api_operator_rank67
46: [       OK ] cuda.dyn_rank_view_api_operator_rank67 (1 ms)
46: [ RUN      ] cuda.ErrorReporter
46: [       OK ] cuda.ErrorReporter (26 ms)
46: [ RUN      ] cuda.offsetview_construction
46: [       OK ] cuda.offsetview_construction (4 ms)
46: [ RUN      ] cuda.offsetview_unmanaged_construction
46: [       OK ] cuda.offsetview_unmanaged_construction (0 ms)
46: [ RUN      ] cuda.offsetview_subview
46: [       OK ] cuda.offsetview_subview (2 ms)
46: [ RUN      ] cuda.scatterview
[       OK ] serial.int64_t_reduce_dynamic (6360 ms)
[ RUN      ] serial.double_reduce_dynamic
54: Pass: 1 1 5.18976e-06 1.22329e-05 -4.20897e-05 || 0.000139188
54:  -- Testing 1-D histogram
54: Density 1D: 6.58387e-07 0.00798575 0.0307645 || 0.051031 28040 29314 || 28447.2 28674.4 || 425.288 -2.0744
54:  -- Testing 3-D histogram
54: Density 3D: 6.88658e-07 -0.00192016 -0.00529034 || 0.051031 1e+64 -1e+64
54: Test Scalar=double
54:  -- Testing randomness properties
44: [       OK ] serial.UnorderedMap_insert (4045 ms)
44: [ RUN      ] serial.UnorderedMap_failed_insert
[ 41%] Building CXX object core/unit_test/CMakeFiles/KokkosCore_IncrementalTest_CUDA.dir/generated/Test17_CompleteAtomic_CUDA.cpp.o
Aborted by unknown
Sending interrupt signal to process
44: [       OK ] serial.UnorderedMap_failed_insert (2683 ms)
44: [ RUN      ] serial.UnorderedMap_deep_copy
44: [       OK ] serial.UnorderedMap_deep_copy (3 ms)
44: [ RUN      ] serial.UnorderedMap_valid_empty
44: [       OK ] serial.UnorderedMap_valid_empty (0 ms)
44: [ RUN      ] serial.UnorderedMap_clear_zero_size
44: [       OK ] serial.UnorderedMap_clear_zero_size (0 ms)
44: [ RUN      ] serial.vector_combination
44: [       OK ] serial.vector_combination (0 ms)
44: [ RUN      ] serial.vector_insert
44: [       OK ] serial.vector_insert (0 ms)
44: [ RUN      ] serial.viewctorprop_embedded_dim
44: [       OK ] serial.viewctorprop_embedded_dim (0 ms)
44: [----------] 37 tests from serial (9504 ms total)
44: 
44: [----------] Global test environment tear-down
44: [==========] 37 tests from 1 test case ran. (9504 ms total)
44: [  PASSED  ] 37 tests.
44/47 Test #44: KokkosContainers_UnitTest_Serial .............   Passed    9.98 sec
test 45
      Start 45: KokkosContainers_UnitTest_HIP

45: Test command: /var/jenkins/workspace/Kokkos/build/containers/unit_tests/KokkosContainers_UnitTest_HIP
45: Test timeout computed to be: 1500
45: [==========] Running 37 tests from 1 test case.
45: [----------] Global test environment set-up.
45: [----------] 37 tests from hip
45: [ RUN      ] hip.bitset
Scanning dependencies of target KokkosCore_UnitTest_DefaultInit_8
[ 41%] Building CXX object core/unit_test/CMakeFiles/KokkosCore_UnitTest_DefaultInit_8.dir/UnitTestMain.cpp.o
[ 41%] Building CXX object core/unit_test/CMakeFiles/KokkosCore_UnitTest_DefaultInit_8.dir/default/TestDefaultDeviceTypeInit_8.cpp.o
45: [       OK ] hip.bitset (49 ms)
45: [ RUN      ] hip.dualview_combination
45: [       OK ] hip.dualview_combination (12 ms)
45: [ RUN      ] hip.dualview_alloc
45: [       OK ] hip.dualview_alloc (0 ms)
45: [ RUN      ] hip.dualview_combinations_without_init
45: [       OK ] hip.dualview_combinations_without_init (0 ms)
45: [ RUN      ] hip.dualview_deep_copy
45: [       OK ] hip.dualview_deep_copy (3 ms)
45: [ RUN      ] hip.dualview_realloc
45: [       OK ] hip.dualview_realloc (0 ms)
45: [ RUN      ] hip.dualview_resize
45: [       OK ] hip.dualview_resize (1 ms)
45: [ RUN      ] hip.dualview_device_correct_kokkos_device
45: [       OK ] hip.dualview_device_correct_kokkos_device (0 ms)
45: [ RUN      ] hip.dualview_host_correct_kokkos_device
45: [       OK ] hip.dualview_host_correct_kokkos_device (0 ms)
45: [ RUN      ] hip.dualview_host_modify_template_device_sync
45: [       OK ] hip.dualview_host_modify_template_device_sync (0 ms)
45: [ RUN      ] hip.dualview_host_modify_template_device_execspace_sync
45: [       OK ] hip.dualview_host_modify_template_device_execspace_sync (0 ms)
45: [ RUN      ] hip.dualview_device_modify_template_host_sync
45: [       OK ] hip.dualview_device_modify_template_host_sync (0 ms)
45: [ RUN      ] hip.dualview_device_modify_template_host_execspace_sync
45: [       OK ] hip.dualview_device_modify_template_host_execspace_sync (0 ms)
45: [ RUN      ] hip.dualview_template_views_return_correct_executionspace_views
45: [       OK ] hip.dualview_template_views_return_correct_executionspace_views (1 ms)
45: [ RUN      ] hip.dynamic_view
45: [       OK ] hip.dynamic_view (20 ms)
45: [ RUN      ] hip.dyn_rank_view_api_generic
45: [       OK ] hip.dyn_rank_view_api_generic (13 ms)
45: [ RUN      ] hip.dyn_rank_view_api_operator_rank12345
45: [       OK ] hip.dyn_rank_view_api_operator_rank12345 (3 ms)
45: [ RUN      ] hip.dyn_rank_view_api_operator_rank67
45: [       OK ] hip.dyn_rank_view_api_operator_rank67 (2 ms)
45: [ RUN      ] hip.ErrorReporterViaLambda
45: [       OK ] hip.ErrorReporterViaLambda (5 ms)
45: [ RUN      ] hip.ErrorReporter
45: [       OK ] hip.ErrorReporter (2 ms)
45: [ RUN      ] hip.offsetview_construction
45: [       OK ] hip.offsetview_construction (9 ms)
45: [ RUN      ] hip.offsetview_unmanaged_construction
45: [       OK ] hip.offsetview_unmanaged_construction (1 ms)
45: [ RUN      ] hip.offsetview_subview
45: [       OK ] hip.offsetview_subview (0 ms)
45: [ RUN      ] hip.offsetview_offsets_rank1
45: [       OK ] hip.offsetview_offsets_rank1 (2 ms)
45: [ RUN      ] hip.offsetview_offsets_rank2
45: [       OK ] hip.offsetview_offsets_rank2 (0 ms)
45: [ RUN      ] hip.offsetview_offsets_rank3
45: [       OK ] hip.offsetview_offsets_rank3 (1 ms)
45: [ RUN      ] hip.scatterview
Sending interrupt signal to process
core/unit_test/CMakeFiles/KokkosCore_UnitTest_Cuda1.dir/build.make:442: recipe for target 'core/unit_test/CMakeFiles/KokkosCore_UnitTest_Cuda1.dir/cuda/TestCuda_MathematicalSpecialFunctions.cpp.o' failed
Terminated
make[2]: *** [core/unit_test/CMakeFiles/KokkosCore_UnitTest_Cuda1.dir/cuda/TestCuda_MathematicalSpecialFunctions.cpp.o] Terminated
core/unit_test/CMakeFiles/KokkosCore_UnitTest_Default.dir/build.make:78: recipe for target 'core/unit_test/CMakeFiles/KokkosCore_UnitTest_Default.dir/default/TestDefaultDeviceType.cpp.o' failed
make[2]: *** [core/unit_test/CMakeFiles/KokkosCore_UnitTest_Default.dir/default/TestDefaultDeviceType.cpp.o] Terminated
core/unit_test/CMakeFiles/KokkosCore_UnitTest_Serial2.dir/build.make:416: recipe for target 'core/unit_test/CMakeFiles/KokkosCore_UnitTest_Serial2.dir/serial/TestSerial_SubView_c04.cpp.o' failed
make[2]: *** [core/unit_test/CMakeFiles/KokkosCore_UnitTest_Serial2.dir/serial/TestSerial_SubView_c04.cpp.o] Terminated
core/unit_test/CMakeFiles/KokkosCore_UnitTest_Serial1.dir/build.make:377: recipe for target 'core/unit_test/CMakeFiles/KokkosCore_UnitTest_Serial1.dir/serial/TestSerial_MDRange_c.cpp.o' failed
make[2]: *** [core/unit_test/CMakeFiles/KokkosCore_UnitTest_Serial1.dir/serial/TestSerial_MDRange_c.cpp.o] Terminated
core/unit_test/CMakeFiles/KokkosCore_UnitTest_Cuda2.dir/build.make:182: recipe for target 'core/unit_test/CMakeFiles/KokkosCore_UnitTest_Cuda2.dir/cuda/TestCuda_ViewAPI_b.cpp.o' failed
make[2]: *** [core/unit_test/CMakeFiles/KokkosCore_UnitTest_Cuda2.dir/cuda/TestCuda_ViewAPI_b.cpp.o] Terminated
core/unit_test/CMakeFiles/KokkosCore_IncrementalTest_CUDA.dir/build.make:312: recipe for target 'core/unit_test/CMakeFiles/KokkosCore_IncrementalTest_CUDA.dir/generated/Test16_ParallelScan_CUDA.cpp.o' failed
make[2]: *** [core/unit_test/CMakeFiles/KokkosCore_IncrementalTest_CUDA.dir/generated/Test16_ParallelScan_CUDA.cpp.o] Terminated
core/unit_test/CMakeFiles/KokkosCore_UnitTest_DefaultInit_8.dir/build.make:78: recipe for target 'core/unit_test/CMakeFiles/KokkosCore_UnitTest_DefaultInit_8.dir/default/TestDefaultDeviceTypeInit_8.cpp.o' failed
make[2]: *** [core/unit_test/CMakeFiles/KokkosCore_UnitTest_DefaultInit_8.dir/default/TestDefaultDeviceTypeInit_8.cpp.o] Terminated
core/unit_test/CMakeFiles/KokkosCore_IncrementalTest_CUDA.dir/build.make:325: recipe for target 'core/unit_test/CMakeFiles/KokkosCore_IncrementalTest_CUDA.dir/generated/Test17_CompleteAtomic_CUDA.cpp.o' failed
make[2]: *** [core/unit_test/CMakeFiles/KokkosCore_IncrementalTest_CUDA.dir/generated/Test17_CompleteAtomic_CUDA.cpp.o] Terminated
CMakeFiles/Makefile2:2231: recipe for target 'core/unit_test/CMakeFiles/KokkosCore_UnitTest_Default.dir/all' failed
make[1]: *** [core/unit_test/CMakeFiles/KokkosCore_UnitTest_Default.dir/all] Terminated
Makefile:143: recipe for target 'all' failed
make: *** [all] Terminated
script returned exit code 143
Sending interrupt signal to process
Terminated
Sending interrupt signal to process
script returned exit code 143
Makefile:7: recipe for target 'test' failed
make[1]: *** [test] Terminated
Terminated
Makefile:11: recipe for target 'test' failed
make: *** [test] Terminated
/var/jenkins/workspace/Kokkos/core/unit_test/Makefile:466: recipe for target 'test-serial' failed
make[2]: *** [test-serial] Terminated
/var/jenkins/workspace/Kokkos/core/unit_test/Makefile:451: recipe for target 'test-cuda' failed
make[2]: *** [test-cuda] Terminated
script returned exit code 143
Sending interrupt signal to process
Sending interrupt signal to process
Terminated
script returned exit code 143
Sending interrupt signal to process
Terminated
script returned exit code 143
[Pipeline] // node
[Pipeline] }
Post stage
Post stage
Post stage
Post stage
Post stage
[Pipeline] // stage
[Pipeline] }
Failed in branch OPENMPTARGET-ROCm-4.2
[Pipeline] sh
[Pipeline] sh
[Pipeline] sh
[Pipeline] sh
[Pipeline] sh
Terminated
script returned exit code 143
+ ccache --show-stats
cache directory                     /tmp/ccache
primary config                      /tmp/ccache/ccache.conf
secondary config      (readonly)    /etc/ccache.conf
stats zero time                     Thu Aug  5 08:37:14 2021
cache hit (direct)                     0
cache hit (preprocessed)               0
cache miss                             0
cache hit rate                      0.00 %
cleanups performed                     0
files in cache                      7872
cache size                           8.7 GB
max cache size                      10.0 GB
+ ccache --show-stats
cache directory                     /tmp/ccache
primary config                      /tmp/ccache/ccache.conf
secondary config      (readonly)    /etc/ccache.conf
stats updated                       Thu Aug  5 08:37:25 2021
stats zeroed                        Thu Aug  5 08:37:24 2021
cache hit (direct)                     0
cache hit (preprocessed)               0
cache miss                             0
cache hit rate                      0.00 %
cleanups performed                     0
files in cache                      4833
cache size                           5.4 GB
max cache size                      10.0 GB
+ ccache --show-stats
cache directory                     /tmp/ccache
primary config                      /tmp/ccache/ccache.conf
secondary config      (readonly)    /etc/ccache.conf
stats zero time                     Thu Aug  5 08:37:24 2021
cache hit (direct)                   205
cache hit (preprocessed)             265
cache miss                            32
cache hit rate                     93.63 %
cleanups performed                     0
files in cache                      5774
cache size                           9.0 GB
max cache size                      10.0 GB
Post stage
+ ccache --show-stats
cache directory                     /tmp/ccache
primary config                      /tmp/ccache/ccache.conf
secondary config      (readonly)    /etc/ccache.conf
stats updated                       Thu Aug  5 08:51:03 2021
stats zeroed                        Thu Aug  5 08:47:27 2021
cache hit (direct)                    39
cache hit (preprocessed)               2
cache miss                           188
cache hit rate                     17.90 %
cleanups performed                     5
files in cache                      6206
cache size                           8.8 GB
max cache size                      10.0 GB
+ ccache --show-stats
cache directory                     /tmp/ccache
primary config                      /tmp/ccache/ccache.conf
secondary config      (readonly)    /etc/ccache.conf
stats zero time                     Thu Aug  5 08:47:27 2021
cache hit (direct)                    39
cache hit (preprocessed)               2
cache miss                           188
cache hit rate                     17.90 %
cleanups performed                     5
files in cache                      6206
cache size                           8.8 GB
max cache size                      10.0 GB
[Pipeline] sh
[Pipeline] }
$ docker stop --time=1 b797ad3d20ae9470456263b2603e301eb2585859ee9f397655e5755bef5a7d33
+ ccache --show-stats
cache directory                     /tmp/ccache
primary config                      /tmp/ccache/ccache.conf
secondary config      (readonly)    /etc/ccache.conf
stats updated                       Thu Aug  5 08:37:25 2021
stats zeroed                        Thu Aug  5 08:37:24 2021
cache hit (direct)                     0
cache hit (preprocessed)               0
cache miss                             0
cache hit rate                      0.00 %
cleanups performed                     0
files in cache                      4833
cache size                           5.4 GB
max cache size                      10.0 GB
[ 26%] Building CXX object core/unit_test/CMakeFiles/KokkosCore_UnitTest_SYCL1A.dir/sycl/TestSYCL_FunctorAnalysis.cpp.o
Terminated
core/unit_test/CMakeFiles/KokkosCore_UnitTest_Default.dir/build.make:120: recipe for target 'core/unit_test/CMakeFiles/KokkosCore_UnitTest_Default.dir/default/TestDefaultDeviceType_b1.cpp.o' failed
make[2]: *** [core/unit_test/CMakeFiles/KokkosCore_UnitTest_Default.dir/default/TestDefaultDeviceType_b1.cpp.o] Terminated
core/unit_test/CMakeFiles/KokkosCore_UnitTest_Serial1.dir/build.make:341: recipe for target 'core/unit_test/CMakeFiles/KokkosCore_UnitTest_Serial1.dir/serial/TestSerial_LocalDeepCopy.cpp.o' failed
make[2]: *** [core/unit_test/CMakeFiles/KokkosCore_UnitTest_Serial1.dir/serial/TestSerial_LocalDeepCopy.cpp.o] Terminated
core/unit_test/CMakeFiles/KokkosCore_UnitTest_SYCL2C.dir/build.make:107: recipe for target 'core/unit_test/CMakeFiles/KokkosCore_UnitTest_SYCL2C.dir/sycl/TestSYCL_SubView_c07.cpp.o' failed
make[2]: *** [core/unit_test/CMakeFiles/KokkosCore_UnitTest_SYCL2C.dir/sycl/TestSYCL_SubView_c07.cpp.o] Terminated
core/unit_test/CMakeFiles/KokkosCore_UnitTest_SYCL1A.dir/build.make:276: recipe for target 'core/unit_test/CMakeFiles/KokkosCore_UnitTest_SYCL1A.dir/sycl/TestSYCL_DeepCopyAlignment.cpp.o' failed
make[2]: *** [core/unit_test/CMakeFiles/KokkosCore_UnitTest_SYCL1A.dir/sycl/TestSYCL_DeepCopyAlignment.cpp.o] Terminated
CMakeFiles/Makefile2:2174: recipe for target 'core/unit_test/CMakeFiles/KokkosCore_UnitTest_Serial1.dir/all' failed
make[1]: *** [core/unit_test/CMakeFiles/KokkosCore_UnitTest_Serial1.dir/all] Terminated
CMakeFiles/Makefile2:2320: recipe for target 'core/unit_test/CMakeFiles/KokkosCore_UnitTest_SYCL1A.dir/all' failed
make[1]: *** [core/unit_test/CMakeFiles/KokkosCore_UnitTest_SYCL1A.dir/all] Terminated
CMakeFiles/Makefile2:2463: recipe for target 'core/unit_test/CMakeFiles/KokkosCore_UnitTest_SYCL2C.dir/all' failed
make[1]: *** [core/unit_test/CMakeFiles/KokkosCore_UnitTest_SYCL2C.dir/all] Terminated
CMakeFiles/Makefile2:2492: recipe for target 'core/unit_test/CMakeFiles/KokkosCore_UnitTest_Default.dir/all' failed
make[1]: *** [core/unit_test/CMakeFiles/KokkosCore_UnitTest_Default.dir/all] Terminated
Makefile:159: recipe for target 'all' failed
make: *** [all] Terminated
script returned exit code 143
$ docker rm -f b797ad3d20ae9470456263b2603e301eb2585859ee9f397655e5755bef5a7d33
[Pipeline] }
$ docker stop --time=1 a1461795e81ff0f9d10f80e3965cda30ff1a8514a2b6600fea1e7f1d9c422ced
$ docker rm -f a1461795e81ff0f9d10f80e3965cda30ff1a8514a2b6600fea1e7f1d9c422ced
[Pipeline] }
$ docker stop --time=1 754a657463a70e34634309eac04110309314c58c3a41ce4e152b1fe5591093f2
$ docker rm -f 754a657463a70e34634309eac04110309314c58c3a41ce4e152b1fe5591093f2
[Pipeline] }
[Pipeline] // withDockerContainer
[Pipeline] // withDockerContainer
[Pipeline] }
[Pipeline] }
Post stage
[Pipeline] // withDockerContainer
[Pipeline] }
[Pipeline] // withEnv
[Pipeline] }
$ docker stop --time=1 07486524d233a7c6016c588a37a8ccc252fb8fee9f2dfd6a745c996fc6e9b9c3
$ docker rm -f 07486524d233a7c6016c588a37a8ccc252fb8fee9f2dfd6a745c996fc6e9b9c3
[Pipeline] }
$ docker stop --time=1 2f772156bcf64c56bd4113aad6c576d5cf2161ca45a4bed9b3f476c95f91bbd7
$ docker rm -f 2f772156bcf64c56bd4113aad6c576d5cf2161ca45a4bed9b3f476c95f91bbd7
[Pipeline] sh
[Pipeline] // withEnv
[Pipeline] // withEnv
[Pipeline] }
[Pipeline] }
[Pipeline] }
+ ccache --show-stats
cache directory                     /tmp/ccache
primary config                      /tmp/ccache/ccache.conf
secondary config      (readonly)    /etc/ccache.conf
stats zero time                     Thu Aug  5 08:37:27 2021
cache hit (direct)                    23
cache hit (preprocessed)               1
cache miss                           124
cache hit rate                     16.22 %
cleanups performed                     0
files in cache                     10192
cache size                           9.1 GB
max cache size                      10.0 GB
[Pipeline] // withEnv
[Pipeline] }
[Pipeline] // withDockerContainer
[Pipeline] // withDockerContainer
[Pipeline] }
[Pipeline] }
[Pipeline] // node
[Pipeline] // node
[Pipeline] // withEnv
[Pipeline] }
[Pipeline] }
[Pipeline] }
$ docker stop --time=1 4e3d4ff929a8afcc02243a73dde83f41e1fecf86a7887d5f60e4097f30ff735c
Click here to forcibly terminate running steps
$ docker rm -f 4e3d4ff929a8afcc02243a73dde83f41e1fecf86a7887d5f60e4097f30ff735c
[Pipeline] // node
[Pipeline] }
[Pipeline] // withEnv
[Pipeline] // withEnv
[Pipeline] }
[Pipeline] }
[Pipeline] // stage
[Pipeline] // stage
[Pipeline] // withDockerContainer
[Pipeline] }
Failed in branch HIP-ROCm-4.2-C++17
[Pipeline] }
Failed in branch CUDA-9.2-NVCC
[Pipeline] }
[Pipeline] // stage
[Pipeline] }
Failed in branch CUDA-10.1-Clang-Tidy
[Pipeline] }
$ docker stop --time=1 74206799e52a50b00f0ec406a452c740923e62b4829ef2a8ffe2bf01d95ffa77
$ docker rm -f 74206799e52a50b00f0ec406a452c740923e62b4829ef2a8ffe2bf01d95ffa77
[Pipeline] // node
[Pipeline] // node
[Pipeline] }
[Pipeline] }
[Pipeline] // withEnv
[Pipeline] }
[Pipeline] // withDockerContainer
[Pipeline] }
[Pipeline] // stage
[Pipeline] // stage
[Pipeline] }
Failed in branch CUDA-11.0-NVCC-C++17-RDC
[Pipeline] }
Failed in branch CUDA-10.1-NVCC-DEBUG
[Pipeline] // node
[Pipeline] }
[Pipeline] // withEnv
[Pipeline] }
[Pipeline] // stage
[Pipeline] }
Failed in branch HIP-ROCm-4.2-C++14
[Pipeline] // node
[Pipeline] }
[Pipeline] // stage
[Pipeline] }
Failed in branch SYCL-OneAPI
[Pipeline] // parallel
[Pipeline] }
[Pipeline] // stage
[Pipeline] }
[Pipeline] // timeout
[Pipeline] }
[Pipeline] // withEnv
[Pipeline] End of Pipeline
ERROR: script returned exit code 8
Finished: ABORTED